{"text_format":"2","workbook":"xlsx","n_sheets":6,"sheets":["Neurals","Data","Instructions","Meetings","Race","Selections"],"not_rendered":{"charts":0,"images":0,"macros":1,"external_links":0,"defined_names":928,"comments":0,"pivot_tables":0},"unopened":[],"bounds":{"document_bytes":16777216,"sheet_cells":100000,"run_cost":"one","rows_first":2000,"rows_last":500,"rows_between":2000,"halvings":0,"cell_chars":16384,"cell_head_chars":4096},"cells_cut":0,"cells_raw":0,"read":"whole","date_system":"1900"}

{"sheet":"Neurals","index":0,"n_rows":50,"n_cols":32,"rows_kept":50,"cut":false,"hidden":false,"merged":[[2,5,2,7],[1,8,2,10]]}
[{"$nulls":20},{"$f":"IF(Race!D2=\"Paying\",\"Paying\",\"\")","v":""},{"$f":"SUM(AA1:AA2)","v":5},{"$f":"IF(AA1<>\"\",B3,\"\")","v":"CAULFIELD "},null,{"$f":"IF(AA1<>\"\",E3,\"\")","v":9},null,{"$f":"IF(W9<>\"\",W9,\"\")","v":5},{"$f":"IF(AA1=\"\",\"\",IF(ISNA(VLOOKUP(AA1,$B$11:$C$40,2,FALSE)),\"\",(VLOOKUP(AA1,$B$11:$C$40,2,FALSE))))","v":" Oforawesome "},null,null,{"$f":"IF(U1<>\"\",IF(ISNA(VLOOKUP(AB1,Data!$C$3:$E$5,2,FALSE)),\"\",(VLOOKUP(AB1,Data!$C$3:$E$5,2,FALSE))),\"\")","v":""},{"$f":"IF(U1<>\"\",IF(ISNA(VLOOKUP(AB1,Data!$C$3:$E$5,1,FALSE)),\"\",(VLOOKUP(AB1,Data!$C$3:$E$5,3,FALSE))),\"\")","v":""}]
[null,"Race Venue",null,"Race Code","1st Race No","Last Race No",{"$nulls":6},"WT"]
[null,"CAULFIELD ",null,16291,9,8,{"$nulls":6},3]
[]
[]
[]
[]
[null,{"$f":"B3","v":"CAULFIELD "},null,"Race",{"$f":"E3","v":9}]
[{"$nulls":20},{"$f":"SMALL(R11:R40,1)","v":4.5999999999999996},{"$f":"SMALL(S11:S40,1)","v":{"$error":"#NUM!"}},{"$f":"LARGE(W11:W40,1)","v":5}]
["INC","TAB","HORSE","RFS","DLS","12m","BRR","SCR","FORM","COND","CONS","BP","JOCK","JC","FR","EM","PER","DIV","DInc"]
[null,1," Elusive King ",5,28,42,null,0,{"$nulls":5},0,44.5,0,21.95,4.5999999999999996,null,null,{"$f":"IF(R11=$U$9,R11,\"\")","v":4.5999999999999996},null,{"$f":"IF(U11<>\"\",B11,\"\")","v":1},{"$nulls":6},"Today's Meetings"]
[null,2," Cuban Sunday ",7,17,37.5,null,0,{"$nulls":5},0,41.5,3,8.7799999999999994,11,null,null,{"$f":"IF(R12=$U$9,R12,\"\")","v":""},null,{"$f":"IF(U12<>\"\",B12,\"\")","v":""},{"$nulls":6},{"$f":"IF(Data!F2=\"\",\"\",Data!F2)","v":"DOOMBEN "}]
[null,3," La Fantastique ",7,12,39.5,null,0,{"$nulls":5},0,37.5,7,1.1000000000000001,91,null,null,"",null,"",{"$nulls":6},{"$f":"IF(Data!F3=\"\",\"\",Data!F3)","v":"ROSEHILL "}]
[null,4," Becerra ",4,12,42.5,null,0,{"$nulls":5},0,38.5,6,1.76,61,null,null,"",null,"",{"$nulls":6},{"$f":"IF(Data!F4=\"\",\"\",Data!F4)","v":"CAULFIELD "}]
[null,5," Oforawesome ",3,12,42.5,null,0,{"$nulls":5},0,44.5,0,21.95,4.5999999999999996,null,null,4.5999999999999996,null,5,{"$nulls":6},{"$f":"IF(Data!F5=\"\",\"\",Data!F5)","v":"GOLD COAST "}]
[null,6," Shadowofexcellence ",4,8,42,null,1,{"$nulls":5},0,null,null,null,"scr",null,null,"",null,"",{"$nulls":6},{"$f":"IF(Data!F6=\"\",\"\",Data!F6)","v":"NEWCASTLE "}]
[null,7," Right Of Refusal ",5,17,38.5,null,1,{"$nulls":5},0,null,null,null,"scr",null,null,"",null,"",{"$nulls":6},{"$f":"IF(Data!F7=\"\",\"\",Data!F7)","v":"COLAC "}]
[null,8," Shezaten ",3,17,44.5,null,0,{"$nulls":5},0,35,9.5,0.22,501,null,null,"",null,"",{"$nulls":6},{"$f":"IF(Data!F8=\"\",\"\",Data!F8)","v":"MORPHETTVILLE "}]
[null,9," Coral Reef ",6,17,36.5,null,0,{"$nulls":5},0,36,8.5,0.44,201,null,null,"",null,"",{"$nulls":6},{"$f":"IF(Data!F9=\"\",\"\",Data!F9)","v":"GOULBURN "}]
[null,10," Almodovar ",4,20,36,null,0,{"$nulls":5},0,38.5,6,1.76,61,null,null,"",null,"",{"$nulls":6},{"$f":"IF(Data!F10=\"\",\"\",Data!F10)","v":"ASCOT "}]
[null,11," Missten ",6,17,40,null,1,{"$nulls":5},0,null,null,null,"scr",null,null,"",null,"",{"$nulls":6},{"$f":"IF(Data!F11=\"\",\"\",Data!F11)","v":"TOOWOOMBA "}]
[null,12," Royaltown Road ",9,15,38,null,0,{"$nulls":5},0,40,4.5,4.3899999999999997,21,null,null,"",null,"",{"$nulls":6},{"$f":"IF(Data!F12=\"\",\"\",Data!F12)","v":"WELLINGTON "}]
[null,13," Medal Day ",8,12,40.5,null,0,{"$nulls":5},0,41,3.5,7.24,14,null,null,"",null,"",{"$nulls":6},{"$f":"IF(Data!F13=\"\",\"\",Data!F13)","v":"EDENHOPE "}]
[null,14," Skalatonic ",6,16,35.5,null,1,{"$nulls":5},0,null,null,null,"scr",null,null,"",null,"",{"$nulls":6},{"$f":"IF(Data!F14=\"\",\"\",Data!F14)","v":"ALICE SPRINGS "}]
[null,15," Straight Arrow ",3,16,38,null,0,{"$nulls":5},0,39,5.5,2.41,41,null,null,"",null,"",{"$nulls":6},{"$f":"IF(Data!F15=\"\",\"\",Data!F15)","v":"RICCARTON "}]
[null,16," Eureka Jack ",5,15,38.5,null,1,{"$nulls":5},0,null,null,null,"scr",null,null,"",null,"",{"$nulls":6},{"$f":"IF(Data!F16=\"\",\"\",Data!F16)","v":"TAURANGA "}]
[null,17," Apres ",5,8,35.5,null,0,{"$nulls":5},0,32,12.5,0.22,501,null,null,"",null,"",{"$nulls":6},{"$f":"IF(Data!F17=\"\",\"\",Data!F17)","v":""}]
[null,18," Paramour ",4,12,41,null,0,{"$nulls":5},0,43.5,1,17.559999999999999,5.5,null,null,"",null,"",{"$nulls":6},{"$f":"IF(Data!F18=\"\",\"\",Data!F18)","v":""}]
[{"$nulls":6},"Clear","Clear","Clear","Clear","Clear","Clear",{"$nulls":8},"",null,"",{"$nulls":6},{"$f":"IF(Data!F19=\"\",\"\",Data!F19)","v":""}]
[{"$nulls":20},"",null,"",{"$nulls":6},{"$f":"IF(Data!F20=\"\",\"\",Data!F20)","v":""}]
[{"$nulls":20},"",null,"",{"$nulls":6},{"$f":"IF(Data!F21=\"\",\"\",Data!F21)","v":""}]
[{"$nulls":20},"",null,"",{"$nulls":6},{"$f":"IF(Data!F22=\"\",\"\",Data!F22)","v":""}]
[{"$nulls":20},"",null,"",{"$nulls":6},{"$f":"IF(Data!F23=\"\",\"\",Data!F23)","v":""}]
[{"$nulls":20},"",null,"",{"$nulls":6},{"$f":"IF(Data!F24=\"\",\"\",Data!F24)","v":""}]
[{"$nulls":20},"",null,"",{"$nulls":6},{"$f":"IF(Data!F25=\"\",\"\",Data!F25)","v":""}]
[{"$nulls":20},"",null,"",{"$nulls":6},{"$f":"IF(Data!F26=\"\",\"\",Data!F26)","v":""}]
[{"$nulls":20},"",null,""]
[{"$nulls":20},"",null,""]
[{"$nulls":20},"",null,""]
[{"$nulls":20},"",null,""]
[{"$nulls":22},""]
[{"$nulls":22},""]
[{"$nulls":22},""]
[{"$nulls":22},""]
[{"$nulls":22},""]
[{"$nulls":22},""]
[{"$nulls":22},""]
[{"$nulls":22},""]
[{"$nulls":22},""]
[{"$nulls":22},""]

{"sheet":"Data","index":1,"n_rows":45,"n_cols":19,"rows_kept":45,"cut":false,"hidden":false,"merged":[]}
[{"$f":"Neurals!B3","v":"CAULFIELD "},{"$f":"Neurals!E3","v":9},{"$f":"Neurals!U1","v":""},null,"2011-03-26",null,{"$f":"IF(ISNA(VLOOKUP(A1,F2:Q40,B1+2,FALSE)),\"\",VLOOKUP(A1,F2:Q40,B1+2,FALSE))","v":""}]
[{"$nulls":5},{"$f":"IF(G2=\"\",\"\",IF(ISERROR(LEFT(G2,FIND(\"(\",G2,1)-1)),\"\",LEFT(G2,FIND(\"(\",G2,1)-1)))","v":"DOOMBEN "},{"$f":"IF(Meetings!B3=\"\",\"\",Meetings!B3)","v":"DOOMBEN (BR)"},{"$f":"IF(Meetings!D3=\"\",\"\",getAddress(Meetings!D3))","v":"http://www.tabonline.com.au/2011/03/26/BR01.html"},{"$f":"IF(Meetings!E3=\"\",\"\",getAddress(Meetings!E3))","v":"http://www.tabonline.com.au/2011/03/26/BR02.html"},{"$f":"IF(Meetings!F3=\"\",\"\",getAddress(Meetings!F3))","v":"http://www.tabonline.com.au/2011/03/26/BR03.html"},{"$f":"IF(Meetings!G3=\"\",\"\",getAddress(Meetings!G3))","v":"http://www.tabonline.com.au/2011/03/26/BR04.html"},{"$f":"IF(Meetings!H3=\"\",\"\",getAddress(Meetings!H3))","v":"http://www.tabonline.com.au/2011/03/26/BR05.html"},{"$f":"IF(Meetings!I3=\"\",\"\",getAddress(Meetings!I3))","v":"http://www.tabonline.com.au/2011/03/26/BR06.html"},{"$f":"IF(Meetings!J3=\"\",\"\",getAddress(Meetings!J3))","v":"http://www.tabonline.com.au/2011/03/26/BR07.html"},{"$f":"IF(Meetings!K3=\"\",\"\",getAddress(Meetings!K3))","v":"http://www.tabonline.com.au/2011/03/26/BR08.html"},{"$f":"IF(Meetings!L3=\"\",\"\",getAddress(Meetings!L3))","v":""},{"$f":"IF(Meetings!M3=\"\",\"\",getAddress(Meetings!M3))","v":""},{"$f":"IF(Meetings!N3=\"\",\"\",getAddress(Meetings!N3))","v":""},{"$f":"IF(Meetings!O3=\"\",\"\",getAddress(Meetings!O3))","v":""}]
[{"$f":"IF(Race!N1<>\"\",(CLEAN(TRIM(Race!C1))),\"\")","v":""},{"$f":"IF(A3<>\"\",Race!I1,\"\")","v":""},{"$f":"IF($C$1<>\"\",INDEX(Race!$A$1:$C20,MATCH(\"QN\",Race!$A1:$A$20,0)-4,3),\"\")","v":""},{"$f":"IF(ISNA(VLOOKUP(C3,Race!$C$2:$E$15,2,FALSE)),\"\",(VLOOKUP(C3,Race!$C$2:$E$15,2,FALSE)))","v":""},{"$f":"IF(ISNA(VLOOKUP(C3,Race!$C$2:$E$15,3,FALSE)),\"\",(VLOOKUP(C3,Race!$C$2:$E$15,3,FALSE)))","v":""},{"$f":"IF(H3=\"\",\"\",IF(ISERROR(LEFT(G3,FIND(\"(\",G3,1)-1)),\"\",LEFT(G3,FIND(\"(\",G3,1)-1)))","v":"ROSEHILL "},{"$f":"IF(Meetings!B4=\"\",\"\",Meetings!B4)","v":"ROSEHILL (SR)"},{"$f":"IF(Meetings!D4=\"\",\"\",getAddress(Meetings!D4))","v":"http://www.tabonline.com.au/2011/03/26/SR01.html"},{"$f":"IF(Meetings!E4=\"\",\"\",getAddress(Meetings!E4))","v":"http://www.tabonline.com.au/2011/03/26/SR02.html"},{"$f":"IF(Meetings!F4=\"\",\"\",getAddress(Meetings!F4))","v":"http://www.tabonline.com.au/2011/03/26/SR03.html"},{"$f":"IF(Meetings!G4=\"\",\"\",getAddress(Meetings!G4))","v":"http://www.tabonline.com.au/2011/03/26/SR04.html"},{"$f":"IF(Meetings!H4=\"\",\"\",getAddress(Meetings!H4))","v":"http://www.tabonline.com.au/2011/03/26/SR05.html"},{"$f":"IF(Meetings!I4=\"\",\"\",getAddress(Meetings!I4))","v":"http://www.tabonline.com.au/2011/03/26/SR06.html"},{"$f":"IF(Meetings!J4=\"\",\"\",getAddress(Meetings!J4))","v":"http://www.tabonline.com.au/2011/03/26/SR07.html"},{"$f":"IF(Meetings!K4=\"\",\"\",getAddress(Meetings!K4))","v":"http://www.tabonline.com.au/2011/03/26/SR08.html"},{"$f":"IF(Meetings!L4=\"\",\"\",getAddress(Meetings!L4))","v":"http://www.tabonline.com.au/2011/03/26/SR09.html"},{"$f":"IF(Meetings!M4=\"\",\"\",getAddress(Meetings!M4))","v":""},{"$f":"IF(Meetings!N4=\"\",\"\",getAddress(Meetings!N4))","v":""},{"$f":"IF(Meetings!O4=\"\",\"\",getAddress(Meetings!O4))","v":""}]
[{"$f":"IF(Race!N2<>\"\",(CLEAN(TRIM(Race!C2))),\"\")","v":""},{"$f":"IF(A4<>\"\",Race!N2,\"\")","v":""},{"$f":"IF($C$1<>\"\",INDEX(Race!$A$1:$C21,MATCH(\"QN\",Race!$A2:$A$20,0)-2,3),\"\")","v":""},{"$f":"IF(ISNA(VLOOKUP(C4,Race!$C$2:$E$15,2,FALSE)),\"\",(VLOOKUP(C4,Race!$C$2:$E$15,2,FALSE)))","v":""},{"$f":"IF(ISNA(VLOOKUP(C4,Race!$C$2:$E$15,3,FALSE)),\"\",(VLOOKUP(C4,Race!$C$2:$E$15,3,FALSE)))","v":""},{"$f":"IF(H4=\"\",\"\",IF(ISERROR(LEFT(G4,FIND(\"(\",G4,1)-1)),\"\",LEFT(G4,FIND(\"(\",G4,1)-1)))","v":"CAULFIELD "},{"$f":"IF(Meetings!B5=\"\",\"\",Meetings!B5)","v":"CAULFIELD (MR)"},{"$f":"IF(Meetings!D5=\"\",\"\",getAddress(Meetings!D5))","v":"http://www.tabonline.com.au/2011/03/26/MR01.html"},{"$f":"IF(Meetings!E5=\"\",\"\",getAddress(Meetings!E5))","v":"http://www.tabonline.com.au/2011/03/26/MR02.html"},{"$f":"IF(Meetings!F5=\"\",\"\",getAddress(Meetings!F5))","v":"http://www.tabonline.com.au/2011/03/26/MR03.html"},{"$f":"IF(Meetings!G5=\"\",\"\",getAddress(Meetings!G5))","v":"http://www.tabonline.com.au/2011/03/26/MR04.html"},{"$f":"IF(Meetings!H5=\"\",\"\",getAddress(Meetings!H5))","v":"http://www.tabonline.com.au/2011/03/26/MR05.html"},{"$f":"IF(Meetings!I5=\"\",\"\",getAddress(Meetings!I5))","v":"http://www.tabonline.com.au/2011/03/26/MR06.html"},{"$f":"IF(Meetings!J5=\"\",\"\",getAddress(Meetings!J5))","v":"http://www.tabonline.com.au/2011/03/26/MR07.html"},{"$f":"IF(Meetings!K5=\"\",\"\",getAddress(Meetings!K5))","v":"http://www.tabonline.com.au/2011/03/26/MR08.html"},{"$f":"IF(Meetings!L5=\"\",\"\",getAddress(Meetings!L5))","v":""},{"$f":"IF(Meetings!M5=\"\",\"\",getAddress(Meetings!M5))","v":""},{"$f":"IF(Meetings!N5=\"\",\"\",getAddress(Meetings!N5))","v":""},{"$f":"IF(Meetings!O5=\"\",\"\",getAddress(Meetings!O5))","v":""}]
[{"$f":"IF(Race!N3<>\"\",(CLEAN(TRIM(Race!C3))),\"\")","v":""},{"$f":"IF(A5<>\"\",Race!N3,\"\")","v":""},{"$f":"IF($C$1<>\"\",INDEX(Race!$A$1:$C22,MATCH(\"QN\",Race!$A3:$A$20,0)-0,3),\"\")","v":""},{"$f":"IF(ISNA(VLOOKUP(C5,Race!$C$2:$E$15,2,FALSE)),\"\",(VLOOKUP(C5,Race!$C$2:$E$15,2,FALSE)))","v":""},{"$f":"IF(ISNA(VLOOKUP(C5,Race!$C$2:$E$15,3,FALSE)),\"\",(VLOOKUP(C5,Race!$C$2:$E$15,3,FALSE)))","v":""},"GOLD COAST ",{"$f":"IF(Meetings!B6=\"\",\"\",Meetings!B6)","v":"GOLD COAST (QR)"},{"$f":"IF(Meetings!D6=\"\",\"\",getAddress(Meetings!D6))","v":"http://www.tabonline.com.au/2011/03/26/QR01.html"},{"$f":"IF(Meetings!E6=\"\",\"\",getAddress(Meetings!E6))","v":"http://www.tabonline.com.au/2011/03/26/QR02.html"},{"$f":"IF(Meetings!F6=\"\",\"\",getAddress(Meetings!F6))","v":"http://www.tabonline.com.au/2011/03/26/QR03.html"},{"$f":"IF(Meetings!G6=\"\",\"\",getAddress(Meetings!G6))","v":"http://www.tabonline.com.au/2011/03/26/QR04.html"},{"$f":"IF(Meetings!H6=\"\",\"\",getAddress(Meetings!H6))","v":"http://www.tabonline.com.au/2011/03/26/QR05.html"},{"$f":"IF(Meetings!I6=\"\",\"\",getAddress(Meetings!I6))","v":"http://www.tabonline.com.au/2011/03/26/QR06.html"},{"$f":"IF(Meetings!J6=\"\",\"\",getAddress(Meetings!J6))","v":"http://www.tabonline.com.au/2011/03/26/QR07.html"},{"$f":"IF(Meetings!K6=\"\",\"\",getAddress(Meetings!K6))","v":"http://www.tabonline.com.au/2011/03/26/QR08.html"},{"$f":"IF(Meetings!L6=\"\",\"\",getAddress(Meetings!L6))","v":""},{"$f":"IF(Meetings!M6=\"\",\"\",getAddress(Meetings!M6))","v":""},{"$f":"IF(Meetings!N6=\"\",\"\",getAddress(Meetings!N6))","v":""},{"$f":"IF(Meetings!O6=\"\",\"\",getAddress(Meetings!O6))","v":""}]
[{"$f":"IF(Race!N4<>\"\",(CLEAN(TRIM(Race!C4))),\"\")","v":""},{"$f":"IF(A6<>\"\",Race!N4,\"\")","v":""},null,null,null,"NEWCASTLE ",{"$f":"IF(Meetings!B7=\"\",\"\",Meetings!B7)","v":"NEWCASTLE (NR)"},{"$f":"IF(Meetings!D7=\"\",\"\",getAddress(Meetings!D7))","v":"http://www.tabonline.com.au/2011/03/26/NR01.html"},{"$f":"IF(Meetings!E7=\"\",\"\",getAddress(Meetings!E7))","v":"http://www.tabonline.com.au/2011/03/26/NR02.html"},{"$f":"IF(Meetings!F7=\"\",\"\",getAddress(Meetings!F7))","v":"http://www.tabonline.com.au/2011/03/26/NR03.html"},{"$f":"IF(Meetings!G7=\"\",\"\",getAddress(Meetings!G7))","v":"http://www.tabonline.com.au/2011/03/26/NR04.html"},{"$f":"IF(Meetings!H7=\"\",\"\",getAddress(Meetings!H7))","v":"http://www.tabonline.com.au/2011/03/26/NR05.html"},{"$f":"IF(Meetings!I7=\"\",\"\",getAddress(Meetings!I7))","v":"http://www.tabonline.com.au/2011/03/26/NR06.html"},{"$f":"IF(Meetings!J7=\"\",\"\",getAddress(Meetings!J7))","v":"http://www.tabonline.com.au/2011/03/26/NR07.html"},{"$f":"IF(Meetings!K7=\"\",\"\",getAddress(Meetings!K7))","v":"http://www.tabonline.com.au/2011/03/26/NR08.html"},{"$f":"IF(Meetings!L7=\"\",\"\",getAddress(Meetings!L7))","v":""},{"$f":"IF(Meetings!M7=\"\",\"\",getAddress(Meetings!M7))","v":""},{"$f":"IF(Meetings!N7=\"\",\"\",getAddress(Meetings!N7))","v":""},{"$f":"IF(Meetings!O7=\"\",\"\",getAddress(Meetings!O7))","v":""}]
[{"$f":"IF(Race!N5<>\"\",(CLEAN(TRIM(Race!C5))),\"\")","v":""},{"$f":"IF(A7<>\"\",Race!N5,\"\")","v":""},{"$f":"IF(A7<>\"\",Race!I5,\"\")","v":""},null,null,"COLAC ",{"$f":"IF(Meetings!B8=\"\",\"\",Meetings!B8)","v":"COLAC (VR)"},{"$f":"IF(Meetings!D8=\"\",\"\",getAddress(Meetings!D8))","v":"http://www.tabonline.com.au/2011/03/26/VR01.html"},{"$f":"IF(Meetings!E8=\"\",\"\",getAddress(Meetings!E8))","v":"http://www.tabonline.com.au/2011/03/26/VR02.html"},{"$f":"IF(Meetings!F8=\"\",\"\",getAddress(Meetings!F8))","v":"http://www.tabonline.com.au/2011/03/26/VR03.html"},{"$f":"IF(Meetings!G8=\"\",\"\",getAddress(Meetings!G8))","v":"http://www.tabonline.com.au/2011/03/26/VR04.html"},{"$f":"IF(Meetings!H8=\"\",\"\",getAddress(Meetings!H8))","v":"http://www.tabonline.com.au/2011/03/26/VR05.html"},{"$f":"IF(Meetings!I8=\"\",\"\",getAddress(Meetings!I8))","v":"http://www.tabonline.com.au/2011/03/26/VR06.html"},{"$f":"IF(Meetings!J8=\"\",\"\",getAddress(Meetings!J8))","v":"http://www.tabonline.com.au/2011/03/26/VR07.html"},{"$f":"IF(Meetings!K8=\"\",\"\",getAddress(Meetings!K8))","v":"http://www.tabonline.com.au/2011/03/26/VR08.html"},{"$f":"IF(Meetings!L8=\"\",\"\",getAddress(Meetings!L8))","v":""},{"$f":"IF(Meetings!M8=\"\",\"\",getAddress(Meetings!M8))","v":""},{"$f":"IF(Meetings!N8=\"\",\"\",getAddress(Meetings!N8))","v":""},{"$f":"IF(Meetings!O8=\"\",\"\",getAddress(Meetings!O8))","v":""}]
[{"$f":"IF(Race!N6<>\"\",(CLEAN(TRIM(Race!C6))),\"\")","v":"Name"},{"$f":"IF(A8<>\"\",Race!N6,\"\")","v":"Rtng"},{"$f":"IF(A8<>\"\",Race!I6,\"\")","v":"Bar"},null,null,"MORPHETTVILLE ",{"$f":"IF(Meetings!B9=\"\",\"\",Meetings!B9)","v":"MORPHETTVILLE (AR)"},{"$f":"IF(Meetings!D9=\"\",\"\",getAddress(Meetings!D9))","v":"http://www.tabonline.com.au/2011/03/26/AR01.html"},{"$f":"IF(Meetings!E9=\"\",\"\",getAddress(Meetings!E9))","v":"http://www.tabonline.com.au/2011/03/26/AR02.html"},{"$f":"IF(Meetings!F9=\"\",\"\",getAddress(Meetings!F9))","v":"http://www.tabonline.com.au/2011/03/26/AR03.html"},{"$f":"IF(Meetings!G9=\"\",\"\",getAddress(Meetings!G9))","v":"http://www.tabonline.com.au/2011/03/26/AR04.html"},{"$f":"IF(Meetings!H9=\"\",\"\",getAddress(Meetings!H9))","v":"http://www.tabonline.com.au/2011/03/26/AR05.html"},{"$f":"IF(Meetings!I9=\"\",\"\",getAddress(Meetings!I9))","v":"http://www.tabonline.com.au/2011/03/26/AR06.html"},{"$f":"IF(Meetings!J9=\"\",\"\",getAddress(Meetings!J9))","v":"http://www.tabonline.com.au/2011/03/26/AR07.html"},{"$f":"IF(Meetings!K9=\"\",\"\",getAddress(Meetings!K9))","v":"http://www.tabonline.com.au/2011/03/26/AR08.html"},{"$f":"IF(Meetings!L9=\"\",\"\",getAddress(Meetings!L9))","v":""},{"$f":"IF(Meetings!M9=\"\",\"\",getAddress(Meetings!M9))","v":""},{"$f":"IF(Meetings!N9=\"\",\"\",getAddress(Meetings!N9))","v":""},{"$f":"IF(Meetings!O9=\"\",\"\",getAddress(Meetings!O9))","v":""}]
[{"$f":"IF(Race!N7<>\"\",(CLEAN(TRIM(Race!C7))),\"\")","v":"ELUSIVE KING"},{"$f":"IF(A9<>\"\",Race!N7,\"\")","v":99},{"$f":"IF(A9<>\"\",Race!I7,\"\")","v":9},null,null,"GOULBURN ",{"$f":"IF(Meetings!B10=\"\",\"\",Meetings!B10)","v":"GOULBURN (CR)"},{"$f":"IF(Meetings!D10=\"\",\"\",getAddress(Meetings!D10))","v":"http://www.tabonline.com.au/2011/03/26/CR01.html"},{"$f":"IF(Meetings!E10=\"\",\"\",getAddress(Meetings!E10))","v":"http://www.tabonline.com.au/2011/03/26/CR02.html"},{"$f":"IF(Meetings!F10=\"\",\"\",getAddress(Meetings!F10))","v":"http://www.tabonline.com.au/2011/03/26/CR03.html"},{"$f":"IF(Meetings!G10=\"\",\"\",getAddress(Meetings!G10))","v":"http://www.tabonline.com.au/2011/03/26/CR04.html"},{"$f":"IF(Meetings!H10=\"\",\"\",getAddress(Meetings!H10))","v":"http://www.tabonline.com.au/2011/03/26/CR05.html"},{"$f":"IF(Meetings!I10=\"\",\"\",getAddress(Meetings!I10))","v":"http://www.tabonline.com.au/2011/03/26/CR06.html"},{"$f":"IF(Meetings!J10=\"\",\"\",getAddress(Meetings!J10))","v":""},{"$f":"IF(Meetings!K10=\"\",\"\",getAddress(Meetings!K10))","v":""},{"$f":"IF(Meetings!L10=\"\",\"\",getAddress(Meetings!L10))","v":""},{"$f":"IF(Meetings!M10=\"\",\"\",getAddress(Meetings!M10))","v":""},{"$f":"IF(Meetings!N10=\"\",\"\",getAddress(Meetings!N10))","v":""},{"$f":"IF(Meetings!O10=\"\",\"\",getAddress(Meetings!O10))","v":""}]
[{"$f":"IF(Race!N8<>\"\",(CLEAN(TRIM(Race!C8))),\"\")","v":"CUBAN SUNDAY"},{"$f":"IF(A10<>\"\",Race!N8,\"\")","v":93},{"$f":"IF(A10<>\"\",Race!I8,\"\")","v":7},null,null,"ASCOT ",{"$f":"IF(Meetings!B11=\"\",\"\",Meetings!B11)","v":"ASCOT (PR)"},{"$f":"IF(Meetings!D11=\"\",\"\",getAddress(Meetings!D11))","v":"http://www.tabonline.com.au/2011/03/26/PR01.html"},{"$f":"IF(Meetings!E11=\"\",\"\",getAddress(Meetings!E11))","v":"http://www.tabonline.com.au/2011/03/26/PR02.html"},{"$f":"IF(Meetings!F11=\"\",\"\",getAddress(Meetings!F11))","v":"http://www.tabonline.com.au/2011/03/26/PR03.html"},{"$f":"IF(Meetings!G11=\"\",\"\",getAddress(Meetings!G11))","v":"http://www.tabonline.com.au/2011/03/26/PR04.html"},{"$f":"IF(Meetings!H11=\"\",\"\",getAddress(Meetings!H11))","v":"http://www.tabonline.com.au/2011/03/26/PR05.html"},{"$f":"IF(Meetings!I11=\"\",\"\",getAddress(Meetings!I11))","v":"http://www.tabonline.com.au/2011/03/26/PR06.html"},{"$f":"IF(Meetings!J11=\"\",\"\",getAddress(Meetings!J11))","v":"http://www.tabonline.com.au/2011/03/26/PR07.html"},{"$f":"IF(Meetings!K11=\"\",\"\",getAddress(Meetings!K11))","v":"http://www.tabonline.com.au/2011/03/26/PR08.html"},{"$f":"IF(Meetings!L11=\"\",\"\",getAddress(Meetings!L11))","v":""},{"$f":"IF(Meetings!M11=\"\",\"\",getAddress(Meetings!M11))","v":""},{"$f":"IF(Meetings!N11=\"\",\"\",getAddress(Meetings!N11))","v":""},{"$f":"IF(Meetings!O11=\"\",\"\",getAddress(Meetings!O11))","v":""}]
[{"$f":"IF(Race!N9<>\"\",(CLEAN(TRIM(Race!C9))),\"\")","v":"LA FANTASTIQUE"},{"$f":"IF(A11<>\"\",Race!N9,\"\")","v":95},{"$f":"IF(A11<>\"\",Race!I9,\"\")","v":6},null,null,"TOOWOOMBA ",{"$f":"IF(Meetings!B12=\"\",\"\",Meetings!B12)","v":"TOOWOOMBA (ER)"},{"$f":"IF(Meetings!D12=\"\",\"\",getAddress(Meetings!D12))","v":"http://www.tabonline.com.au/2011/03/26/ER01.html"},{"$f":"IF(Meetings!E12=\"\",\"\",getAddress(Meetings!E12))","v":"http://www.tabonline.com.au/2011/03/26/ER02.html"},{"$f":"IF(Meetings!F12=\"\",\"\",getAddress(Meetings!F12))","v":"http://www.tabonline.com.au/2011/03/26/ER03.html"},{"$f":"IF(Meetings!G12=\"\",\"\",getAddress(Meetings!G12))","v":"http://www.tabonline.com.au/2011/03/26/ER04.html"},{"$f":"IF(Meetings!H12=\"\",\"\",getAddress(Meetings!H12))","v":"http://www.tabonline.com.au/2011/03/26/ER05.html"},{"$f":"IF(Meetings!I12=\"\",\"\",getAddress(Meetings!I12))","v":"http://www.tabonline.com.au/2011/03/26/ER06.html"},{"$f":"IF(Meetings!J12=\"\",\"\",getAddress(Meetings!J12))","v":"http://www.tabonline.com.au/2011/03/26/ER07.html"},{"$f":"IF(Meetings!K12=\"\",\"\",getAddress(Meetings!K12))","v":""},{"$f":"IF(Meetings!L12=\"\",\"\",getAddress(Meetings!L12))","v":""},{"$f":"IF(Meetings!M12=\"\",\"\",getAddress(Meetings!M12))","v":""},{"$f":"IF(Meetings!N12=\"\",\"\",getAddress(Meetings!N12))","v":""},{"$f":"IF(Meetings!O12=\"\",\"\",getAddress(Meetings!O12))","v":""}]
[{"$f":"IF(Race!N10<>\"\",(CLEAN(TRIM(Race!C10))),\"\")","v":"BECERRA"},{"$f":"IF(A12<>\"\",Race!N10,\"\")","v":92},{"$f":"IF(A12<>\"\",Race!I10,\"\")","v":17},null,null,"WELLINGTON ",{"$f":"IF(Meetings!B13=\"\",\"\",Meetings!B13)","v":"WELLINGTON (OR)"},{"$f":"IF(Meetings!D13=\"\",\"\",getAddress(Meetings!D13))","v":"http://www.tabonline.com.au/2011/03/26/OR01.html"},{"$f":"IF(Meetings!E13=\"\",\"\",getAddress(Meetings!E13))","v":"http://www.tabonline.com.au/2011/03/26/OR02.html"},{"$f":"IF(Meetings!F13=\"\",\"\",getAddress(Meetings!F13))","v":"http://www.tabonline.com.au/2011/03/26/OR03.html"},{"$f":"IF(Meetings!G13=\"\",\"\",getAddress(Meetings!G13))","v":"http://www.tabonline.com.au/2011/03/26/OR04.html"},{"$f":"IF(Meetings!H13=\"\",\"\",getAddress(Meetings!H13))","v":"http://www.tabonline.com.au/2011/03/26/OR05.html"},{"$f":"IF(Meetings!I13=\"\",\"\",getAddress(Meetings!I13))","v":"http://www.tabonline.com.au/2011/03/26/OR06.html"},{"$f":"IF(Meetings!J13=\"\",\"\",getAddress(Meetings!J13))","v":"http://www.tabonline.com.au/2011/03/26/OR07.html"},{"$f":"IF(Meetings!K13=\"\",\"\",getAddress(Meetings!K13))","v":""},{"$f":"IF(Meetings!L13=\"\",\"\",getAddress(Meetings!L13))","v":""},{"$f":"IF(Meetings!M13=\"\",\"\",getAddress(Meetings!M13))","v":""},{"$f":"IF(Meetings!N13=\"\",\"\",getAddress(Meetings!N13))","v":""},{"$f":"IF(Meetings!O13=\"\",\"\",getAddress(Meetings!O13))","v":""}]
[{"$f":"IF(Race!N11<>\"\",(CLEAN(TRIM(Race!C11))),\"\")","v":"OFORAWESOME"},{"$f":"IF(A13<>\"\",Race!N11,\"\")","v":100},{"$f":"IF(A13<>\"\",Race!I11,\"\")","v":2},null,null,"EDENHOPE ",{"$f":"IF(Meetings!B14=\"\",\"\",Meetings!B14)","v":"EDENHOPE (ZR)"},{"$f":"IF(Meetings!D14=\"\",\"\",getAddress(Meetings!D14))","v":"http://www.tabonline.com.au/2011/03/26/ZR01.html"},{"$f":"IF(Meetings!E14=\"\",\"\",getAddress(Meetings!E14))","v":"http://www.tabonline.com.au/2011/03/26/ZR02.html"},{"$f":"IF(Meetings!F14=\"\",\"\",getAddress(Meetings!F14))","v":"http://www.tabonline.com.au/2011/03/26/ZR03.html"},{"$f":"IF(Meetings!G14=\"\",\"\",getAddress(Meetings!G14))","v":"http://www.tabonline.com.au/2011/03/26/ZR04.html"},{"$f":"IF(Meetings!H14=\"\",\"\",getAddress(Meetings!H14))","v":"http://www.tabonline.com.au/2011/03/26/ZR05.html"},{"$f":"IF(Meetings!I14=\"\",\"\",getAddress(Meetings!I14))","v":"http://www.tabonline.com.au/2011/03/26/ZR06.html"},{"$f":"IF(Meetings!J14=\"\",\"\",getAddress(Meetings!J14))","v":"http://www.tabonline.com.au/2011/03/26/ZR07.html"},{"$f":"IF(Meetings!K14=\"\",\"\",getAddress(Meetings!K14))","v":""},{"$f":"IF(Meetings!L14=\"\",\"\",getAddress(Meetings!L14))","v":""},{"$f":"IF(Meetings!M14=\"\",\"\",getAddress(Meetings!M14))","v":""},{"$f":"IF(Meetings!N14=\"\",\"\",getAddress(Meetings!N14))","v":""},{"$f":"IF(Meetings!O14=\"\",\"\",getAddress(Meetings!O14))","v":""}]
[{"$f":"IF(Race!N12<>\"\",(CLEAN(TRIM(Race!C12))),\"\")","v":""},{"$f":"IF(A14<>\"\",Race!N12,\"\")","v":""},{"$f":"IF(A14<>\"\",Race!I12,\"\")","v":""},null,null,"ALICE SPRINGS ",{"$f":"IF(Meetings!B15=\"\",\"\",Meetings!B15)","v":"ALICE SPRINGS (DR)"},{"$f":"IF(Meetings!D15=\"\",\"\",getAddress(Meetings!D15))","v":"http://www.tabonline.com.au/2011/03/26/DR01.html"},{"$f":"IF(Meetings!E15=\"\",\"\",getAddress(Meetings!E15))","v":"http://www.tabonline.com.au/2011/03/26/DR02.html"},{"$f":"IF(Meetings!F15=\"\",\"\",getAddress(Meetings!F15))","v":"http://www.tabonline.com.au/2011/03/26/DR03.html"},{"$f":"IF(Meetings!G15=\"\",\"\",getAddress(Meetings!G15))","v":"http://www.tabonline.com.au/2011/03/26/DR04.html"},{"$f":"IF(Meetings!H15=\"\",\"\",getAddress(Meetings!H15))","v":"http://www.tabonline.com.au/2011/03/26/DR05.html"},{"$f":"IF(Meetings!I15=\"\",\"\",getAddress(Meetings!I15))","v":"http://www.tabonline.com.au/2011/03/26/DR06.html"},{"$f":"IF(Meetings!J15=\"\",\"\",getAddress(Meetings!J15))","v":""},{"$f":"IF(Meetings!K15=\"\",\"\",getAddress(Meetings!K15))","v":""},{"$f":"IF(Meetings!L15=\"\",\"\",getAddress(Meetings!L15))","v":""},{"$f":"IF(Meetings!M15=\"\",\"\",getAddress(Meetings!M15))","v":""},{"$f":"IF(Meetings!N15=\"\",\"\",getAddress(Meetings!N15))","v":""},{"$f":"IF(Meetings!O15=\"\",\"\",getAddress(Meetings!O15))","v":""}]
[{"$f":"IF(Race!N13<>\"\",(CLEAN(TRIM(Race!C13))),\"\")","v":""},{"$f":"IF(A15<>\"\",Race!N13,\"\")","v":""},{"$f":"IF(A15<>\"\",Race!I13,\"\")","v":""},null,null,"RICCARTON ",{"$f":"IF(Meetings!B16=\"\",\"\",Meetings!B16)","v":"RICCARTON (NS)"},{"$f":"IF(Meetings!D16=\"\",\"\",getAddress(Meetings!D16))","v":"http://www.tabonline.com.au/2011/03/26/NS01.html"},{"$f":"IF(Meetings!E16=\"\",\"\",getAddress(Meetings!E16))","v":"http://www.tabonline.com.au/2011/03/26/NS02.html"},{"$f":"IF(Meetings!F16=\"\",\"\",getAddress(Meetings!F16))","v":"http://www.tabonline.com.au/2011/03/26/NS03.html"},{"$f":"IF(Meetings!G16=\"\",\"\",getAddress(Meetings!G16))","v":"http://www.tabonline.com.au/2011/03/26/NS04.html"},{"$f":"IF(Meetings!H16=\"\",\"\",getAddress(Meetings!H16))","v":"http://www.tabonline.com.au/2011/03/26/NS05.html"},{"$f":"IF(Meetings!I16=\"\",\"\",getAddress(Meetings!I16))","v":"http://www.tabonline.com.au/2011/03/26/NS06.html"},{"$f":"IF(Meetings!J16=\"\",\"\",getAddress(Meetings!J16))","v":"http://www.tabonline.com.au/2011/03/26/NS07.html"},{"$f":"IF(Meetings!K16=\"\",\"\",getAddress(Meetings!K16))","v":"http://www.tabonline.com.au/2011/03/26/NS08.html"},{"$f":"IF(Meetings!L16=\"\",\"\",getAddress(Meetings!L16))","v":"http://www.tabonline.com.au/2011/03/26/NS09.html"},{"$f":"IF(Meetings!M16=\"\",\"\",getAddress(Meetings!M16))","v":"http://www.tabonline.com.au/2011/03/26/NS10.html"},{"$f":"IF(Meetings!N16=\"\",\"\",getAddress(Meetings!N16))","v":"http://www.tabonline.com.au/2011/03/26/NS11.html"},{"$f":"IF(Meetings!O16=\"\",\"\",getAddress(Meetings!O16))","v":""}]
[{"$f":"IF(Race!N14<>\"\",(CLEAN(TRIM(Race!C14))),\"\")","v":"SHEZATEN"},{"$f":"IF(A16<>\"\",Race!N14,\"\")","v":89},{"$f":"IF(A16<>\"\",Race!I14,\"\")","v":8},null,null,"TAURANGA ",{"$f":"IF(Meetings!B17=\"\",\"\",Meetings!B17)","v":"TAURANGA (ZS)"},{"$f":"IF(Meetings!D17=\"\",\"\",getAddress(Meetings!D17))","v":"http://www.tabonline.com.au/2011/03/26/ZS01.html"},{"$f":"IF(Meetings!E17=\"\",\"\",getAddress(Meetings!E17))","v":"http://www.tabonline.com.au/2011/03/26/ZS02.html"},{"$f":"IF(Meetings!F17=\"\",\"\",getAddress(Meetings!F17))","v":"http://www.tabonline.com.au/2011/03/26/ZS03.html"},{"$f":"IF(Meetings!G17=\"\",\"\",getAddress(Meetings!G17))","v":"http://www.tabonline.com.au/2011/03/26/ZS04.html"},{"$f":"IF(Meetings!H17=\"\",\"\",getAddress(Meetings!H17))","v":"http://www.tabonline.com.au/2011/03/26/ZS05.html"},{"$f":"IF(Meetings!I17=\"\",\"\",getAddress(Meetings!I17))","v":"http://www.tabonline.com.au/2011/03/26/ZS06.html"},{"$f":"IF(Meetings!J17=\"\",\"\",getAddress(Meetings!J17))","v":"http://www.tabonline.com.au/2011/03/26/ZS07.html"},{"$f":"IF(Meetings!K17=\"\",\"\",getAddress(Meetings!K17))","v":"http://www.tabonline.com.au/2011/03/26/ZS08.html"},{"$f":"IF(Meetings!L17=\"\",\"\",getAddress(Meetings!L17))","v":"http://www.tabonline.com.au/2011/03/26/ZS09.html"},{"$f":"IF(Meetings!M17=\"\",\"\",getAddress(Meetings!M17))","v":"http://www.tabonline.com.au/2011/03/26/ZS10.html"},{"$f":"IF(Meetings!N17=\"\",\"\",getAddress(Meetings!N17))","v":""},{"$f":"IF(Meetings!O17=\"\",\"\",getAddress(Meetings!O17))","v":""}]
[{"$f":"IF(Race!N15<>\"\",(CLEAN(TRIM(Race!C15))),\"\")","v":"CORAL REEF"},{"$f":"IF(A17<>\"\",Race!N15,\"\")","v":92},{"$f":"IF(A17<>\"\",Race!I15,\"\")","v":1},null,null,"",{"$f":"IF(Meetings!B18=\"\",\"\",Meetings!B18)","v":""},{"$f":"IF(Meetings!D18=\"\",\"\",getAddress(Meetings!D18))","v":""},{"$f":"IF(Meetings!E18=\"\",\"\",getAddress(Meetings!E18))","v":""},{"$f":"IF(Meetings!F18=\"\",\"\",getAddress(Meetings!F18))","v":""},{"$f":"IF(Meetings!G18=\"\",\"\",getAddress(Meetings!G18))","v":""},{"$f":"IF(Meetings!H18=\"\",\"\",getAddress(Meetings!H18))","v":""},{"$f":"IF(Meetings!I18=\"\",\"\",getAddress(Meetings!I18))","v":""},{"$f":"IF(Meetings!J18=\"\",\"\",getAddress(Meetings!J18))","v":""},{"$f":"IF(Meetings!K18=\"\",\"\",getAddress(Meetings!K18))","v":""},{"$f":"IF(Meetings!L18=\"\",\"\",getAddress(Meetings!L18))","v":""},{"$f":"IF(Meetings!M18=\"\",\"\",getAddress(Meetings!M18))","v":""},{"$f":"IF(Meetings!N18=\"\",\"\",getAddress(Meetings!N18))","v":""},{"$f":"IF(Meetings!O18=\"\",\"\",getAddress(Meetings!O18))","v":""}]
[{"$f":"IF(Race!N16<>\"\",(CLEAN(TRIM(Race!C16))),\"\")","v":"ALMODOVAR"},{"$f":"IF(A18<>\"\",Race!N16,\"\")","v":90},{"$f":"IF(A18<>\"\",Race!I16,\"\")","v":12},null,null,"",{"$f":"IF(Meetings!B19=\"\",\"\",Meetings!B19)","v":""},{"$f":"IF(Meetings!D19=\"\",\"\",getAddress(Meetings!D19))","v":""},{"$f":"IF(Meetings!E19=\"\",\"\",getAddress(Meetings!E19))","v":""},{"$f":"IF(Meetings!F19=\"\",\"\",getAddress(Meetings!F19))","v":""},{"$f":"IF(Meetings!G19=\"\",\"\",getAddress(Meetings!G19))","v":""},{"$f":"IF(Meetings!H19=\"\",\"\",getAddress(Meetings!H19))","v":""},{"$f":"IF(Meetings!I19=\"\",\"\",getAddress(Meetings!I19))","v":""},{"$f":"IF(Meetings!J19=\"\",\"\",getAddress(Meetings!J19))","v":""},{"$f":"IF(Meetings!K19=\"\",\"\",getAddress(Meetings!K19))","v":""},{"$f":"IF(Meetings!L19=\"\",\"\",getAddress(Meetings!L19))","v":""},{"$f":"IF(Meetings!M19=\"\",\"\",getAddress(Meetings!M19))","v":""},{"$f":"IF(Meetings!N19=\"\",\"\",getAddress(Meetings!N19))","v":""},{"$f":"IF(Meetings!O19=\"\",\"\",getAddress(Meetings!O19))","v":""}]
[{"$f":"IF(Race!N17<>\"\",(CLEAN(TRIM(Race!C17))),\"\")","v":""},{"$f":"IF(A19<>\"\",Race!N17,\"\")","v":""},{"$f":"IF(A19<>\"\",Race!I17,\"\")","v":""},null,null,"",{"$f":"IF(Meetings!B20=\"\",\"\",Meetings!B20)","v":""},{"$f":"IF(Meetings!D20=\"\",\"\",getAddress(Meetings!D20))","v":""},{"$f":"IF(Meetings!E20=\"\",\"\",getAddress(Meetings!E20))","v":""},{"$f":"IF(Meetings!F20=\"\",\"\",getAddress(Meetings!F20))","v":""},{"$f":"IF(Meetings!G20=\"\",\"\",getAddress(Meetings!G20))","v":""},{"$f":"IF(Meetings!H20=\"\",\"\",getAddress(Meetings!H20))","v":""},{"$f":"IF(Meetings!I20=\"\",\"\",getAddress(Meetings!I20))","v":""},{"$f":"IF(Meetings!J20=\"\",\"\",getAddress(Meetings!J20))","v":""},{"$f":"IF(Meetings!K20=\"\",\"\",getAddress(Meetings!K20))","v":""},{"$f":"IF(Meetings!L20=\"\",\"\",getAddress(Meetings!L20))","v":""},{"$f":"IF(Meetings!M20=\"\",\"\",getAddress(Meetings!M20))","v":""},{"$f":"IF(Meetings!N20=\"\",\"\",getAddress(Meetings!N20))","v":""},{"$f":"IF(Meetings!O20=\"\",\"\",getAddress(Meetings!O20))","v":""}]
[{"$f":"IF(Race!N18<>\"\",(CLEAN(TRIM(Race!C18))),\"\")","v":"ROYALTOWN ROAD"},{"$f":"IF(A20<>\"\",Race!N18,\"\")","v":93},{"$f":"IF(A20<>\"\",Race!I18,\"\")","v":5},null,null,"",{"$f":"IF(Meetings!B21=\"\",\"\",Meetings!B21)","v":""},{"$f":"IF(Meetings!D21=\"\",\"\",getAddress(Meetings!D21))","v":""},{"$f":"IF(Meetings!E21=\"\",\"\",getAddress(Meetings!E21))","v":""},{"$f":"IF(Meetings!F21=\"\",\"\",getAddress(Meetings!F21))","v":""},{"$f":"IF(Meetings!G21=\"\",\"\",getAddress(Meetings!G21))","v":""},{"$f":"IF(Meetings!H21=\"\",\"\",getAddress(Meetings!H21))","v":""},{"$f":"IF(Meetings!I21=\"\",\"\",getAddress(Meetings!I21))","v":""},{"$f":"IF(Meetings!J21=\"\",\"\",getAddress(Meetings!J21))","v":""},{"$f":"IF(Meetings!K21=\"\",\"\",getAddress(Meetings!K21))","v":""},{"$f":"IF(Meetings!L21=\"\",\"\",getAddress(Meetings!L21))","v":""},{"$f":"IF(Meetings!M21=\"\",\"\",getAddress(Meetings!M21))","v":""},{"$f":"IF(Meetings!N21=\"\",\"\",getAddress(Meetings!N21))","v":""},{"$f":"IF(Meetings!O21=\"\",\"\",getAddress(Meetings!O21))","v":""}]
[{"$f":"IF(Race!N19<>\"\",(CLEAN(TRIM(Race!C19))),\"\")","v":"MEDAL DAY"},{"$f":"IF(A21<>\"\",Race!N19,\"\")","v":92},{"$f":"IF(A21<>\"\",Race!I19,\"\")","v":16},null,null,"",{"$f":"IF(Meetings!B22=\"\",\"\",Meetings!B22)","v":""},{"$f":"IF(Meetings!D22=\"\",\"\",getAddress(Meetings!D22))","v":""},{"$f":"IF(Meetings!E22=\"\",\"\",getAddress(Meetings!E22))","v":""},{"$f":"IF(Meetings!F22=\"\",\"\",getAddress(Meetings!F22))","v":""},{"$f":"IF(Meetings!G22=\"\",\"\",getAddress(Meetings!G22))","v":""},{"$f":"IF(Meetings!H22=\"\",\"\",getAddress(Meetings!H22))","v":""},{"$f":"IF(Meetings!I22=\"\",\"\",getAddress(Meetings!I22))","v":""},{"$f":"IF(Meetings!J22=\"\",\"\",getAddress(Meetings!J22))","v":""},{"$f":"IF(Meetings!K22=\"\",\"\",getAddress(Meetings!K22))","v":""},{"$f":"IF(Meetings!L22=\"\",\"\",getAddress(Meetings!L22))","v":""},{"$f":"IF(Meetings!M22=\"\",\"\",getAddress(Meetings!M22))","v":""},{"$f":"IF(Meetings!N22=\"\",\"\",getAddress(Meetings!N22))","v":""},{"$f":"IF(Meetings!O22=\"\",\"\",getAddress(Meetings!O22))","v":""}]
[{"$f":"IF(Race!N20<>\"\",(CLEAN(TRIM(Race!C20))),\"\")","v":""},{"$f":"IF(A22<>\"\",Race!N20,\"\")","v":""},{"$f":"IF(A22<>\"\",Race!I20,\"\")","v":""},null,null,"",{"$f":"IF(Meetings!B23=\"\",\"\",Meetings!B23)","v":""},{"$f":"IF(Meetings!D23=\"\",\"\",getAddress(Meetings!D23))","v":""},{"$f":"IF(Meetings!E23=\"\",\"\",getAddress(Meetings!E23))","v":""},{"$f":"IF(Meetings!F23=\"\",\"\",getAddress(Meetings!F23))","v":""},{"$f":"IF(Meetings!G23=\"\",\"\",getAddress(Meetings!G23))","v":""},{"$f":"IF(Meetings!H23=\"\",\"\",getAddress(Meetings!H23))","v":""},{"$f":"IF(Meetings!I23=\"\",\"\",getAddress(Meetings!I23))","v":""},{"$f":"IF(Meetings!J23=\"\",\"\",getAddress(Meetings!J23))","v":""},{"$f":"IF(Meetings!K23=\"\",\"\",getAddress(Meetings!K23))","v":""},{"$f":"IF(Meetings!L23=\"\",\"\",getAddress(Meetings!L23))","v":""},{"$f":"IF(Meetings!M23=\"\",\"\",getAddress(Meetings!M23))","v":""},{"$f":"IF(Meetings!N23=\"\",\"\",getAddress(Meetings!N23))","v":""},{"$f":"IF(Meetings!O23=\"\",\"\",getAddress(Meetings!O23))","v":""}]
[{"$f":"IF(Race!N21<>\"\",(CLEAN(TRIM(Race!C21))),\"\")","v":"STRAIGHT ARROW"},{"$f":"IF(A23<>\"\",Race!N21,\"\")","v":92},{"$f":"IF(A23<>\"\",Race!I21,\"\")","v":3},null,null,"",{"$f":"IF(Meetings!B24=\"\",\"\",Meetings!B24)","v":""},{"$f":"IF(Meetings!D24=\"\",\"\",getAddress(Meetings!D24))","v":""},{"$f":"IF(Meetings!E24=\"\",\"\",getAddress(Meetings!E24))","v":""},{"$f":"IF(Meetings!F24=\"\",\"\",getAddress(Meetings!F24))","v":""},{"$f":"IF(Meetings!G24=\"\",\"\",getAddress(Meetings!G24))","v":""},{"$f":"IF(Meetings!H24=\"\",\"\",getAddress(Meetings!H24))","v":""},{"$f":"IF(Meetings!I24=\"\",\"\",getAddress(Meetings!I24))","v":""},{"$f":"IF(Meetings!J24=\"\",\"\",getAddress(Meetings!J24))","v":""},{"$f":"IF(Meetings!K24=\"\",\"\",getAddress(Meetings!K24))","v":""},{"$f":"IF(Meetings!L24=\"\",\"\",getAddress(Meetings!L24))","v":""},{"$f":"IF(Meetings!M24=\"\",\"\",getAddress(Meetings!M24))","v":""},{"$f":"IF(Meetings!N24=\"\",\"\",getAddress(Meetings!N24))","v":""},{"$f":"IF(Meetings!O24=\"\",\"\",getAddress(Meetings!O24))","v":""}]
[{"$f":"IF(Race!N22<>\"\",(CLEAN(TRIM(Race!C22))),\"\")","v":""},{"$f":"IF(A24<>\"\",Race!N22,\"\")","v":""},{"$f":"IF(A24<>\"\",Race!I22,\"\")","v":""},null,null,"",{"$f":"IF(Meetings!B25=\"\",\"\",Meetings!B25)","v":""},{"$f":"IF(Meetings!D25=\"\",\"\",getAddress(Meetings!D25))","v":""},{"$f":"IF(Meetings!E25=\"\",\"\",getAddress(Meetings!E25))","v":""},{"$f":"IF(Meetings!F25=\"\",\"\",getAddress(Meetings!F25))","v":""},{"$f":"IF(Meetings!G25=\"\",\"\",getAddress(Meetings!G25))","v":""},{"$f":"IF(Meetings!H25=\"\",\"\",getAddress(Meetings!H25))","v":""},{"$f":"IF(Meetings!I25=\"\",\"\",getAddress(Meetings!I25))","v":""},{"$f":"IF(Meetings!J25=\"\",\"\",getAddress(Meetings!J25))","v":""},{"$f":"IF(Meetings!K25=\"\",\"\",getAddress(Meetings!K25))","v":""},{"$f":"IF(Meetings!L25=\"\",\"\",getAddress(Meetings!L25))","v":""},{"$f":"IF(Meetings!M25=\"\",\"\",getAddress(Meetings!M25))","v":""},{"$f":"IF(Meetings!N25=\"\",\"\",getAddress(Meetings!N25))","v":""},{"$f":"IF(Meetings!O25=\"\",\"\",getAddress(Meetings!O25))","v":""}]
[{"$f":"IF(Race!N23<>\"\",(CLEAN(TRIM(Race!C23))),\"\")","v":"APRES"},{"$f":"IF(A25<>\"\",Race!N23,\"\")","v":86},{"$f":"IF(A25<>\"\",Race!I23,\"\")","v":13},null,null,"",{"$f":"IF(Meetings!B26=\"\",\"\",Meetings!B26)","v":""},{"$f":"IF(Meetings!D26=\"\",\"\",getAddress(Meetings!D26))","v":""},{"$f":"IF(Meetings!E26=\"\",\"\",getAddress(Meetings!E26))","v":""},{"$f":"IF(Meetings!F26=\"\",\"\",getAddress(Meetings!F26))","v":""},{"$f":"IF(Meetings!G26=\"\",\"\",getAddress(Meetings!G26))","v":""},{"$f":"IF(Meetings!H26=\"\",\"\",getAddress(Meetings!H26))","v":""},{"$f":"IF(Meetings!I26=\"\",\"\",getAddress(Meetings!I26))","v":""},{"$f":"IF(Meetings!J26=\"\",\"\",getAddress(Meetings!J26))","v":""},{"$f":"IF(Meetings!K26=\"\",\"\",getAddress(Meetings!K26))","v":""},{"$f":"IF(Meetings!L26=\"\",\"\",getAddress(Meetings!L26))","v":""},{"$f":"IF(Meetings!M26=\"\",\"\",getAddress(Meetings!M26))","v":""},{"$f":"IF(Meetings!N26=\"\",\"\",getAddress(Meetings!N26))","v":""},{"$f":"IF(Meetings!O26=\"\",\"\",getAddress(Meetings!O26))","v":""}]
[{"$f":"IF(Race!N24<>\"\",(CLEAN(TRIM(Race!C24))),\"\")","v":"PARAMOUR"},{"$f":"IF(A26<>\"\",Race!N24,\"\")","v":94},{"$f":"IF(A26<>\"\",Race!I24,\"\")","v":4},null,null,"",{"$f":"IF(Meetings!B27=\"\",\"\",Meetings!B27)","v":""},{"$f":"IF(Meetings!D27=\"\",\"\",getAddress(Meetings!D27))","v":""},{"$f":"IF(Meetings!E27=\"\",\"\",getAddress(Meetings!E27))","v":""},{"$f":"IF(Meetings!F27=\"\",\"\",getAddress(Meetings!F27))","v":""},{"$f":"IF(Meetings!G27=\"\",\"\",getAddress(Meetings!G27))","v":""},{"$f":"IF(Meetings!H27=\"\",\"\",getAddress(Meetings!H27))","v":""},{"$f":"IF(Meetings!I27=\"\",\"\",getAddress(Meetings!I27))","v":""},{"$f":"IF(Meetings!J27=\"\",\"\",getAddress(Meetings!J27))","v":""},{"$f":"IF(Meetings!K27=\"\",\"\",getAddress(Meetings!K27))","v":""},{"$f":"IF(Meetings!L27=\"\",\"\",getAddress(Meetings!L27))","v":""},{"$f":"IF(Meetings!M27=\"\",\"\",getAddress(Meetings!M27))","v":""},{"$f":"IF(Meetings!N27=\"\",\"\",getAddress(Meetings!N27))","v":""},{"$f":"IF(Meetings!O27=\"\",\"\",getAddress(Meetings!O27))","v":""}]
[{"$f":"IF(Race!N25<>\"\",(CLEAN(TRIM(Race!C25))),\"\")","v":""},{"$f":"IF(A27<>\"\",Race!N25,\"\")","v":""},{"$f":"IF(A27<>\"\",Race!I25,\"\")","v":""},null,null,"",{"$f":"IF(Meetings!B28=\"\",\"\",Meetings!B28)","v":""},{"$f":"IF(Meetings!D28=\"\",\"\",getAddress(Meetings!D28))","v":""},{"$f":"IF(Meetings!E28=\"\",\"\",getAddress(Meetings!E28))","v":""},{"$f":"IF(Meetings!F28=\"\",\"\",getAddress(Meetings!F28))","v":""},{"$f":"IF(Meetings!G28=\"\",\"\",getAddress(Meetings!G28))","v":""},{"$f":"IF(Meetings!H28=\"\",\"\",getAddress(Meetings!H28))","v":""},{"$f":"IF(Meetings!I28=\"\",\"\",getAddress(Meetings!I28))","v":""},{"$f":"IF(Meetings!J28=\"\",\"\",getAddress(Meetings!J28))","v":""},{"$f":"IF(Meetings!K28=\"\",\"\",getAddress(Meetings!K28))","v":""},{"$f":"IF(Meetings!L28=\"\",\"\",getAddress(Meetings!L28))","v":""},{"$f":"IF(Meetings!M28=\"\",\"\",getAddress(Meetings!M28))","v":""},{"$f":"IF(Meetings!N28=\"\",\"\",getAddress(Meetings!N28))","v":""},{"$f":"IF(Meetings!O28=\"\",\"\",getAddress(Meetings!O28))","v":""}]
[{"$f":"IF(Race!N26<>\"\",(CLEAN(TRIM(Race!C26))),\"\")","v":""},{"$f":"IF(A28<>\"\",Race!N26,\"\")","v":""},{"$f":"IF(A28<>\"\",Race!I26,\"\")","v":""},null,null,"",{"$f":"IF(Meetings!B29=\"\",\"\",Meetings!B29)","v":""},{"$f":"IF(Meetings!D29=\"\",\"\",getAddress(Meetings!D29))","v":""},{"$f":"IF(Meetings!E29=\"\",\"\",getAddress(Meetings!E29))","v":""},{"$f":"IF(Meetings!F29=\"\",\"\",getAddress(Meetings!F29))","v":""},{"$f":"IF(Meetings!G29=\"\",\"\",getAddress(Meetings!G29))","v":""},{"$f":"IF(Meetings!H29=\"\",\"\",getAddress(Meetings!H29))","v":""},{"$f":"IF(Meetings!I29=\"\",\"\",getAddress(Meetings!I29))","v":""},{"$f":"IF(Meetings!J29=\"\",\"\",getAddress(Meetings!J29))","v":""},{"$f":"IF(Meetings!K29=\"\",\"\",getAddress(Meetings!K29))","v":""},{"$f":"IF(Meetings!L29=\"\",\"\",getAddress(Meetings!L29))","v":""},{"$f":"IF(Meetings!M29=\"\",\"\",getAddress(Meetings!M29))","v":""},{"$f":"IF(Meetings!N29=\"\",\"\",getAddress(Meetings!N29))","v":""},{"$f":"IF(Meetings!O29=\"\",\"\",getAddress(Meetings!O29))","v":""}]
[{"$f":"IF(Race!N27<>\"\",(CLEAN(TRIM(Race!C27))),\"\")","v":""},{"$f":"IF(A29<>\"\",Race!N27,\"\")","v":""},{"$f":"IF(A29<>\"\",Race!I27,\"\")","v":""},null,null,"",{"$f":"IF(Meetings!B30=\"\",\"\",Meetings!B30)","v":""},{"$f":"IF(Meetings!D30=\"\",\"\",getAddress(Meetings!D30))","v":""},{"$f":"IF(Meetings!E30=\"\",\"\",getAddress(Meetings!E30))","v":""},{"$f":"IF(Meetings!F30=\"\",\"\",getAddress(Meetings!F30))","v":""},{"$f":"IF(Meetings!G30=\"\",\"\",getAddress(Meetings!G30))","v":""},{"$f":"IF(Meetings!H30=\"\",\"\",getAddress(Meetings!H30))","v":""},{"$f":"IF(Meetings!I30=\"\",\"\",getAddress(Meetings!I30))","v":""},{"$f":"IF(Meetings!J30=\"\",\"\",getAddress(Meetings!J30))","v":""},{"$f":"IF(Meetings!K30=\"\",\"\",getAddress(Meetings!K30))","v":""},{"$f":"IF(Meetings!L30=\"\",\"\",getAddress(Meetings!L30))","v":""},{"$f":"IF(Meetings!M30=\"\",\"\",getAddress(Meetings!M30))","v":""},{"$f":"IF(Meetings!N30=\"\",\"\",getAddress(Meetings!N30))","v":""},{"$f":"IF(Meetings!O30=\"\",\"\",getAddress(Meetings!O30))","v":""}]
[{"$f":"IF(Race!N28<>\"\",(CLEAN(TRIM(Race!C28))),\"\")","v":""},{"$f":"IF(A30<>\"\",Race!N28,\"\")","v":""},{"$f":"IF(A30<>\"\",Race!I28,\"\")","v":""},null,null,"",{"$f":"IF(Meetings!B31=\"\",\"\",Meetings!B31)","v":""},{"$f":"IF(Meetings!D31=\"\",\"\",getAddress(Meetings!D31))","v":""},{"$f":"IF(Meetings!E31=\"\",\"\",getAddress(Meetings!E31))","v":""},{"$f":"IF(Meetings!F31=\"\",\"\",getAddress(Meetings!F31))","v":""},{"$f":"IF(Meetings!G31=\"\",\"\",getAddress(Meetings!G31))","v":""},{"$f":"IF(Meetings!H31=\"\",\"\",getAddress(Meetings!H31))","v":""},{"$f":"IF(Meetings!I31=\"\",\"\",getAddress(Meetings!I31))","v":""},{"$f":"IF(Meetings!J31=\"\",\"\",getAddress(Meetings!J31))","v":""},{"$f":"IF(Meetings!K31=\"\",\"\",getAddress(Meetings!K31))","v":""},{"$f":"IF(Meetings!L31=\"\",\"\",getAddress(Meetings!L31))","v":""},{"$f":"IF(Meetings!M31=\"\",\"\",getAddress(Meetings!M31))","v":""},{"$f":"IF(Meetings!N31=\"\",\"\",getAddress(Meetings!N31))","v":""},{"$f":"IF(Meetings!O31=\"\",\"\",getAddress(Meetings!O31))","v":""}]
[{"$f":"IF(Race!N29<>\"\",(CLEAN(TRIM(Race!C29))),\"\")","v":""},{"$f":"IF(A31<>\"\",Race!N29,\"\")","v":""},{"$f":"IF(A31<>\"\",Race!I29,\"\")","v":""},null,null,"",{"$f":"IF(Meetings!B32=\"\",\"\",Meetings!B32)","v":""},{"$f":"IF(Meetings!D32=\"\",\"\",getAddress(Meetings!D32))","v":""},{"$f":"IF(Meetings!E32=\"\",\"\",getAddress(Meetings!E32))","v":""},{"$f":"IF(Meetings!F32=\"\",\"\",getAddress(Meetings!F32))","v":""},{"$f":"IF(Meetings!G32=\"\",\"\",getAddress(Meetings!G32))","v":""},{"$f":"IF(Meetings!H32=\"\",\"\",getAddress(Meetings!H32))","v":""},{"$f":"IF(Meetings!I32=\"\",\"\",getAddress(Meetings!I32))","v":""},{"$f":"IF(Meetings!J32=\"\",\"\",getAddress(Meetings!J32))","v":""},{"$f":"IF(Meetings!K32=\"\",\"\",getAddress(Meetings!K32))","v":""},{"$f":"IF(Meetings!L32=\"\",\"\",getAddress(Meetings!L32))","v":""},{"$f":"IF(Meetings!M32=\"\",\"\",getAddress(Meetings!M32))","v":""},{"$f":"IF(Meetings!N32=\"\",\"\",getAddress(Meetings!N32))","v":""},{"$f":"IF(Meetings!O32=\"\",\"\",getAddress(Meetings!O32))","v":""}]
[{"$f":"IF(Race!N30<>\"\",(CLEAN(TRIM(Race!C30))),\"\")","v":""},{"$f":"IF(A32<>\"\",Race!N30,\"\")","v":""},{"$f":"IF(A32<>\"\",Race!I30,\"\")","v":""},null,null,"",{"$f":"IF(Meetings!B33=\"\",\"\",Meetings!B33)","v":""},{"$f":"IF(Meetings!D33=\"\",\"\",getAddress(Meetings!D33))","v":""},{"$f":"IF(Meetings!E33=\"\",\"\",getAddress(Meetings!E33))","v":""},{"$f":"IF(Meetings!F33=\"\",\"\",getAddress(Meetings!F33))","v":""},{"$f":"IF(Meetings!G33=\"\",\"\",getAddress(Meetings!G33))","v":""},{"$f":"IF(Meetings!H33=\"\",\"\",getAddress(Meetings!H33))","v":""},{"$f":"IF(Meetings!I33=\"\",\"\",getAddress(Meetings!I33))","v":""},{"$f":"IF(Meetings!J33=\"\",\"\",getAddress(Meetings!J33))","v":""},{"$f":"IF(Meetings!K33=\"\",\"\",getAddress(Meetings!K33))","v":""},{"$f":"IF(Meetings!L33=\"\",\"\",getAddress(Meetings!L33))","v":""},{"$f":"IF(Meetings!M33=\"\",\"\",getAddress(Meetings!M33))","v":""},{"$f":"IF(Meetings!N33=\"\",\"\",getAddress(Meetings!N33))","v":""},{"$f":"IF(Meetings!O33=\"\",\"\",getAddress(Meetings!O33))","v":""}]
[{"$f":"IF(Race!N31<>\"\",(CLEAN(TRIM(Race!C31))),\"\")","v":""},{"$f":"IF(A33<>\"\",Race!N31,\"\")","v":""},{"$f":"IF(A33<>\"\",Race!I31,\"\")","v":""},null,null,"",{"$f":"IF(Meetings!B34=\"\",\"\",Meetings!B34)","v":""},{"$f":"IF(Meetings!D34=\"\",\"\",getAddress(Meetings!D34))","v":""},{"$f":"IF(Meetings!E34=\"\",\"\",getAddress(Meetings!E34))","v":""},{"$f":"IF(Meetings!F34=\"\",\"\",getAddress(Meetings!F34))","v":""},{"$f":"IF(Meetings!G34=\"\",\"\",getAddress(Meetings!G34))","v":""},{"$f":"IF(Meetings!H34=\"\",\"\",getAddress(Meetings!H34))","v":""},{"$f":"IF(Meetings!I34=\"\",\"\",getAddress(Meetings!I34))","v":""},{"$f":"IF(Meetings!J34=\"\",\"\",getAddress(Meetings!J34))","v":""},{"$f":"IF(Meetings!K34=\"\",\"\",getAddress(Meetings!K34))","v":""},{"$f":"IF(Meetings!L34=\"\",\"\",getAddress(Meetings!L34))","v":""},{"$f":"IF(Meetings!M34=\"\",\"\",getAddress(Meetings!M34))","v":""},{"$f":"IF(Meetings!N34=\"\",\"\",getAddress(Meetings!N34))","v":""},{"$f":"IF(Meetings!O34=\"\",\"\",getAddress(Meetings!O34))","v":""}]
[{"$f":"IF(Race!N32<>\"\",(CLEAN(TRIM(Race!C32))),\"\")","v":""},{"$f":"IF(A34<>\"\",Race!N32,\"\")","v":""},{"$f":"IF(A34<>\"\",Race!I32,\"\")","v":""},{"$nulls":4},{"$f":"IF(Meetings!D36=\"\",\"\",getAddress(Meetings!D36))","v":""},{"$f":"IF(Meetings!E36=\"\",\"\",getAddress(Meetings!E36))","v":""},{"$f":"IF(Meetings!F36=\"\",\"\",getAddress(Meetings!F36))","v":""},{"$f":"IF(Meetings!G36=\"\",\"\",getAddress(Meetings!G36))","v":""},{"$f":"IF(Meetings!H36=\"\",\"\",getAddress(Meetings!H36))","v":""},{"$f":"IF(Meetings!I36=\"\",\"\",getAddress(Meetings!I36))","v":""},{"$f":"IF(Meetings!J36=\"\",\"\",getAddress(Meetings!J36))","v":""},{"$f":"IF(Meetings!K36=\"\",\"\",getAddress(Meetings!K36))","v":""},{"$f":"IF(Meetings!L36=\"\",\"\",getAddress(Meetings!L36))","v":""},{"$f":"IF(Meetings!M36=\"\",\"\",getAddress(Meetings!M36))","v":""}]
[{"$f":"IF(Race!N33<>\"\",(CLEAN(TRIM(Race!C33))),\"\")","v":""},{"$f":"IF(A35<>\"\",Race!N33,\"\")","v":""},{"$f":"IF(A35<>\"\",Race!I33,\"\")","v":""},{"$nulls":4},{"$f":"IF(Meetings!D37=\"\",\"\",getAddress(Meetings!D37))","v":""},{"$f":"IF(Meetings!E37=\"\",\"\",getAddress(Meetings!E37))","v":""},{"$f":"IF(Meetings!F37=\"\",\"\",getAddress(Meetings!F37))","v":""},{"$f":"IF(Meetings!G37=\"\",\"\",getAddress(Meetings!G37))","v":""},{"$f":"IF(Meetings!H37=\"\",\"\",getAddress(Meetings!H37))","v":""},{"$f":"IF(Meetings!I37=\"\",\"\",getAddress(Meetings!I37))","v":""},{"$f":"IF(Meetings!J37=\"\",\"\",getAddress(Meetings!J37))","v":""},{"$f":"IF(Meetings!K37=\"\",\"\",getAddress(Meetings!K37))","v":""},{"$f":"IF(Meetings!L37=\"\",\"\",getAddress(Meetings!L37))","v":""},{"$f":"IF(Meetings!M37=\"\",\"\",getAddress(Meetings!M37))","v":""}]
[{"$f":"IF(Race!N34<>\"\",(CLEAN(TRIM(Race!C34))),\"\")","v":""},{"$f":"IF(A36<>\"\",Race!N34,\"\")","v":""},{"$f":"IF(A36<>\"\",Race!I34,\"\")","v":""},{"$nulls":4},{"$f":"IF(Meetings!D38=\"\",\"\",getAddress(Meetings!D38))","v":""},{"$f":"IF(Meetings!E38=\"\",\"\",getAddress(Meetings!E38))","v":""},{"$f":"IF(Meetings!F38=\"\",\"\",getAddress(Meetings!F38))","v":""},{"$f":"IF(Meetings!G38=\"\",\"\",getAddress(Meetings!G38))","v":""},{"$f":"IF(Meetings!H38=\"\",\"\",getAddress(Meetings!H38))","v":""},{"$f":"IF(Meetings!I38=\"\",\"\",getAddress(Meetings!I38))","v":""},{"$f":"IF(Meetings!J38=\"\",\"\",getAddress(Meetings!J38))","v":""},{"$f":"IF(Meetings!K38=\"\",\"\",getAddress(Meetings!K38))","v":""},{"$f":"IF(Meetings!L38=\"\",\"\",getAddress(Meetings!L38))","v":""},{"$f":"IF(Meetings!M38=\"\",\"\",getAddress(Meetings!M38))","v":""}]
[null,null,{"$f":"IF(A37<>\"\",Race!I35,\"\")","v":""},{"$nulls":4},{"$f":"IF(Meetings!D39=\"\",\"\",getAddress(Meetings!D39))","v":""},{"$f":"IF(Meetings!E39=\"\",\"\",getAddress(Meetings!E39))","v":""},{"$f":"IF(Meetings!F39=\"\",\"\",getAddress(Meetings!F39))","v":""},{"$f":"IF(Meetings!G39=\"\",\"\",getAddress(Meetings!G39))","v":""},{"$f":"IF(Meetings!H39=\"\",\"\",getAddress(Meetings!H39))","v":""},{"$f":"IF(Meetings!I39=\"\",\"\",getAddress(Meetings!I39))","v":""},{"$f":"IF(Meetings!J39=\"\",\"\",getAddress(Meetings!J39))","v":""},{"$f":"IF(Meetings!K39=\"\",\"\",getAddress(Meetings!K39))","v":""},{"$f":"IF(Meetings!L39=\"\",\"\",getAddress(Meetings!L39))","v":""},{"$f":"IF(Meetings!M39=\"\",\"\",getAddress(Meetings!M39))","v":""}]
[null,null,{"$f":"IF(A38<>\"\",Race!I36,\"\")","v":""},{"$nulls":4},{"$f":"IF(Meetings!D40=\"\",\"\",getAddress(Meetings!D40))","v":""},{"$f":"IF(Meetings!E40=\"\",\"\",getAddress(Meetings!E40))","v":""},{"$f":"IF(Meetings!F40=\"\",\"\",getAddress(Meetings!F40))","v":""},{"$f":"IF(Meetings!G40=\"\",\"\",getAddress(Meetings!G40))","v":""},{"$f":"IF(Meetings!H40=\"\",\"\",getAddress(Meetings!H40))","v":""},{"$f":"IF(Meetings!I40=\"\",\"\",getAddress(Meetings!I40))","v":""},{"$f":"IF(Meetings!J40=\"\",\"\",getAddress(Meetings!J40))","v":""},{"$f":"IF(Meetings!K40=\"\",\"\",getAddress(Meetings!K40))","v":""},{"$f":"IF(Meetings!L40=\"\",\"\",getAddress(Meetings!L40))","v":""},{"$f":"IF(Meetings!M40=\"\",\"\",getAddress(Meetings!M40))","v":""}]
[null,null,{"$f":"IF(A39<>\"\",Race!I37,\"\")","v":""},{"$nulls":4},{"$f":"IF(Meetings!D41=\"\",\"\",getAddress(Meetings!D41))","v":""},{"$f":"IF(Meetings!E41=\"\",\"\",getAddress(Meetings!E41))","v":""},{"$f":"IF(Meetings!F41=\"\",\"\",getAddress(Meetings!F41))","v":""},{"$f":"IF(Meetings!G41=\"\",\"\",getAddress(Meetings!G41))","v":""},{"$f":"IF(Meetings!H41=\"\",\"\",getAddress(Meetings!H41))","v":""},{"$f":"IF(Meetings!I41=\"\",\"\",getAddress(Meetings!I41))","v":""},{"$f":"IF(Meetings!J41=\"\",\"\",getAddress(Meetings!J41))","v":""},{"$f":"IF(Meetings!K41=\"\",\"\",getAddress(Meetings!K41))","v":""},{"$f":"IF(Meetings!L41=\"\",\"\",getAddress(Meetings!L41))","v":""},{"$f":"IF(Meetings!M41=\"\",\"\",getAddress(Meetings!M41))","v":""}]
[null,null,{"$f":"IF(A40<>\"\",Race!I38,\"\")","v":""},{"$nulls":4},{"$f":"IF(Meetings!D42=\"\",\"\",getAddress(Meetings!D42))","v":""},{"$f":"IF(Meetings!E42=\"\",\"\",getAddress(Meetings!E42))","v":""},{"$f":"IF(Meetings!F42=\"\",\"\",getAddress(Meetings!F42))","v":""},{"$f":"IF(Meetings!G42=\"\",\"\",getAddress(Meetings!G42))","v":""},{"$f":"IF(Meetings!H42=\"\",\"\",getAddress(Meetings!H42))","v":""},{"$f":"IF(Meetings!I42=\"\",\"\",getAddress(Meetings!I42))","v":""},{"$f":"IF(Meetings!J42=\"\",\"\",getAddress(Meetings!J42))","v":""},{"$f":"IF(Meetings!K42=\"\",\"\",getAddress(Meetings!K42))","v":""},{"$f":"IF(Meetings!L42=\"\",\"\",getAddress(Meetings!L42))","v":""},{"$f":"IF(Meetings!M42=\"\",\"\",getAddress(Meetings!M42))","v":""}]
[null,null,{"$f":"IF(A41<>\"\",Race!I39,\"\")","v":""},{"$nulls":4},{"$f":"IF(Meetings!D43=\"\",\"\",getAddress(Meetings!D43))","v":""},{"$f":"IF(Meetings!E43=\"\",\"\",getAddress(Meetings!E43))","v":""},{"$f":"IF(Meetings!F43=\"\",\"\",getAddress(Meetings!F43))","v":""},{"$f":"IF(Meetings!G43=\"\",\"\",getAddress(Meetings!G43))","v":""},{"$f":"IF(Meetings!H43=\"\",\"\",getAddress(Meetings!H43))","v":""},{"$f":"IF(Meetings!I43=\"\",\"\",getAddress(Meetings!I43))","v":""},{"$f":"IF(Meetings!J43=\"\",\"\",getAddress(Meetings!J43))","v":""},{"$f":"IF(Meetings!K43=\"\",\"\",getAddress(Meetings!K43))","v":""},{"$f":"IF(Meetings!L43=\"\",\"\",getAddress(Meetings!L43))","v":""},{"$f":"IF(Meetings!M43=\"\",\"\",getAddress(Meetings!M43))","v":""}]
[null,null,{"$f":"IF(A42<>\"\",Race!I40,\"\")","v":""},{"$nulls":4},{"$f":"IF(Meetings!D44=\"\",\"\",getAddress(Meetings!D44))","v":""},{"$f":"IF(Meetings!E44=\"\",\"\",getAddress(Meetings!E44))","v":""},{"$f":"IF(Meetings!F44=\"\",\"\",getAddress(Meetings!F44))","v":""},{"$f":"IF(Meetings!G44=\"\",\"\",getAddress(Meetings!G44))","v":""},{"$f":"IF(Meetings!H44=\"\",\"\",getAddress(Meetings!H44))","v":""},{"$f":"IF(Meetings!I44=\"\",\"\",getAddress(Meetings!I44))","v":""},{"$f":"IF(Meetings!J44=\"\",\"\",getAddress(Meetings!J44))","v":""},{"$f":"IF(Meetings!K44=\"\",\"\",getAddress(Meetings!K44))","v":""},{"$f":"IF(Meetings!L44=\"\",\"\",getAddress(Meetings!L44))","v":""},{"$f":"IF(Meetings!M44=\"\",\"\",getAddress(Meetings!M44))","v":""}]
[null,null,{"$f":"IF(A43<>\"\",Race!I41,\"\")","v":""},{"$nulls":4},{"$f":"IF(Meetings!D45=\"\",\"\",getAddress(Meetings!D45))","v":""},{"$f":"IF(Meetings!E45=\"\",\"\",getAddress(Meetings!E45))","v":""},{"$f":"IF(Meetings!F45=\"\",\"\",getAddress(Meetings!F45))","v":""},{"$f":"IF(Meetings!G45=\"\",\"\",getAddress(Meetings!G45))","v":""},{"$f":"IF(Meetings!H45=\"\",\"\",getAddress(Meetings!H45))","v":""},{"$f":"IF(Meetings!I45=\"\",\"\",getAddress(Meetings!I45))","v":""},{"$f":"IF(Meetings!J45=\"\",\"\",getAddress(Meetings!J45))","v":""},{"$f":"IF(Meetings!K45=\"\",\"\",getAddress(Meetings!K45))","v":""},{"$f":"IF(Meetings!L45=\"\",\"\",getAddress(Meetings!L45))","v":""},{"$f":"IF(Meetings!M45=\"\",\"\",getAddress(Meetings!M45))","v":""}]
[null,null,{"$f":"IF(A44<>\"\",Race!I42,\"\")","v":""},{"$nulls":4},{"$f":"IF(Meetings!D46=\"\",\"\",getAddress(Meetings!D46))","v":""},{"$f":"IF(Meetings!E46=\"\",\"\",getAddress(Meetings!E46))","v":""},{"$f":"IF(Meetings!F46=\"\",\"\",getAddress(Meetings!F46))","v":""},{"$f":"IF(Meetings!G46=\"\",\"\",getAddress(Meetings!G46))","v":""},{"$f":"IF(Meetings!H46=\"\",\"\",getAddress(Meetings!H46))","v":""},{"$f":"IF(Meetings!I46=\"\",\"\",getAddress(Meetings!I46))","v":""},{"$f":"IF(Meetings!J46=\"\",\"\",getAddress(Meetings!J46))","v":""},{"$f":"IF(Meetings!K46=\"\",\"\",getAddress(Meetings!K46))","v":""},{"$f":"IF(Meetings!L46=\"\",\"\",getAddress(Meetings!L46))","v":""},{"$f":"IF(Meetings!M46=\"\",\"\",getAddress(Meetings!M46))","v":""}]
[null,null,{"$f":"IF(A45<>\"\",Race!I43,\"\")","v":""},{"$nulls":4},{"$f":"IF(Meetings!D47=\"\",\"\",getAddress(Meetings!D47))","v":""},{"$f":"IF(Meetings!E47=\"\",\"\",getAddress(Meetings!E47))","v":""},{"$f":"IF(Meetings!F47=\"\",\"\",getAddress(Meetings!F47))","v":""},{"$f":"IF(Meetings!G47=\"\",\"\",getAddress(Meetings!G47))","v":""},{"$f":"IF(Meetings!H47=\"\",\"\",getAddress(Meetings!H47))","v":""},{"$f":"IF(Meetings!I47=\"\",\"\",getAddress(Meetings!I47))","v":""},{"$f":"IF(Meetings!J47=\"\",\"\",getAddress(Meetings!J47))","v":""},{"$f":"IF(Meetings!K47=\"\",\"\",getAddress(Meetings!K47))","v":""},{"$f":"IF(Meetings!L47=\"\",\"\",getAddress(Meetings!L47))","v":""},{"$f":"IF(Meetings!M47=\"\",\"\",getAddress(Meetings!M47))","v":""}]

{"sheet":"Instructions","index":2,"n_rows":10,"n_cols":11,"rows_kept":10,"cut":false,"hidden":false,"merged":[]}
[]
[]
[]
[]
[null,"Instructions"]
[]
[null,"You need to get the race code from",null,null,null,"http://www.racingandsports.com.au/form-guide/",{"$nulls":4},"click on each venue and get the last set of numbers from the address bar."]
[null,"On the \"Neurals\" sheet press \"Start\" press \"OK\" for todays date or put in a date, there is a box on the right that has the days races, hightlight a race and press \"Select\"  put in race code then 1st and last race numbers for that venue then press the \"Import\" button,"]
[null,"the race will be imported, The lowest Div and highest tab number will copy to the \"Selections\" sheet."]
[null,"Each race will cycle through for that meeting, when done change the meeting and the race numbers and press import again."]

{"sheet":"Meetings","index":3,"n_rows":25,"n_cols":16,"rows_kept":25,"cut":false,"hidden":false,"merged":[[1,0,1,2],[22,0,22,2],[28,0,28,2]]}
[]
["Races",null,null,1,2,3,4,5,6,7,8,9,10,11,12]
[null,"DOOMBEN (BR)","Fields","12:00 F4","12:40 F4","1:20 F4","2:00 F4","2:40 F4","3:20 F4","4:00 F4","4:40 F4"]
[null,"ROSEHILL (SR)","Fields","11:10am F4","11:50am F4","12:30 F4","1:10 F4","1:50 F4","2:30 F4","3:10 F4","3:50 F4","4:30 F4"]
[null,"CAULFIELD (MR)","Fields","11:30am F4","12:10 F4","12:50 F4","1:30 F4","2:10 F4","2:50 F4","3:30 F4","4:10 F4"]
[null,"GOLD COAST (QR)","Fields","11:45am F4","12:25 F4","1:05 F4","1:45 F4","2:25 F4","3:05 F4","3:45 F4","4:25 F4"]
[null,"NEWCASTLE (NR)","Fields","11:35am ","12:15:00","12:55:00","01:35:00","02:15:00","02:55:00","03:35:00","04:15:00"]
[null,"COLAC (VR)","Fields","11:55am ","12:35:00","01:15:00","01:55:00","02:35:00","03:15:00","03:55:00","04:35:00"]
[null,"MORPHETTVILLE (AR)","Fields","12:20 F4","1:00 F4","1:40 F4","2:20 F4","3:00 F4","3:40 F4","4:20 F4","4:55 F4"]
[null,"GOULBURN (CR)","Fields","01:02:00","01:42:00","02:22:00","03:01:00","03:41:00","04:21:00"]
[null,"ASCOT (PR)","Fields","2:45 F4","3:25 F4","4:05 F4","4:45 F4","5:20 F4","5:55 F4","6:30 F4","7:05 F4"]
[null,"TOOWOOMBA (ER)","Fields","6:05 F4","6:45 F4","7:22 F4","7:57 F4","8:35 F4","9:07 F4","9:37 F4"]
[null,"WELLINGTON (OR)","Fields","10:15am ","10:50am ","11:25am ","12:05:00","12:45:00","01:25:00","02:05:00"]
[null,"EDENHOPE (ZR)","Fields","12:02:00","12:42:00","01:22:00","02:02:00","02:41:00","03:21:00","04:01:00"]
[null,"ALICE SPRINGS (DR)","Fields","03:14:00","03:49:00","04:29:00","05:05:00","05:44:00","06:21:00"]
[null,"RICCARTON (NS)","Fields","8:40am ","9:11am ","9:41am ","10:12am ","10:50am ","11:26am ","12:06:00","12:46:00","01:26:00","02:06:00","02:45:00"]
[null,"TAURANGA (ZS)","Fields","9:21am ","9:51am ","10:25am ","11:05am ","11:45am ","12:26:00","01:06:00","01:46:00","02:26:00","03:05:00"]
{"$rows_empty":7}
[{"$nulls":15},"3,7,8 "]

{"sheet":"Race","index":4,"n_rows":34,"n_cols":14,"rows_kept":34,"cut":false,"hidden":false,"merged":[]}
[]
["CAULFIELD",null,"MR 8","Jump","04:10:00"]
[null,null,null,"Odds","09:42:00"]
["2011-03-26","ROKK EBONY CUP",null,null,"Fixed Price"]
["RADIO TAB","1-5-2-10","STEVE MORAN","5-1-10-4",null,"2000M","OVERCAST","DEAD(4)"]
["No.",null,"Name","08:42:00","Win","Plc",null,"Rider  ","Bar","Wght",null,"Form","L3S","Rtng"]
[1,null,"ELUSIVE KING",3.2,4.2,3.4,null,"L CURRIE",9,59,null,null,122,99]
[2,null,"CUBAN SUNDAY",4.4000000000000004,6.3,6.2,null,"B KNOBEL(A)",7,57.5,null,null,411,93]
[3,null,"LA FANTASTIQUE",22.3,22.6,5.3,null,"J MASKIELL(A)",6,57.5,null,null,418,95]
[4,null,"BECERRA",26.8,16,5.0999999999999996,null,"J WINKS",17,57,null,null,576,92]
[5,null,"OFORAWESOME",9.1999999999999993,5.3,1.5,null,"J MOTT",2,56,null,null,"X12",100]
[6,null,"SHADOWOFEXCELLENCE",{"$nulls":4},"SCRATCHED",14]
[7,null,"RIGHT OF REFUSAL",{"$nulls":4},"SCRATCHED",11]
[8,null,"SHEZATEN",21,14.3,2.9,null,"D NIKOLIC",8,54,null,null,"X05",89]
[9,null,"CORAL REEF",11.5,10.6,1.9,null,"P MERTENS",1,53.5,null,"W",114,92]
[10,null,"ALMODOVAR",19.8,18.5,5.5,null,"L MEECH",12,53.5,null,null,351,90]
[11,null,"MISSTEN",{"$nulls":4},"SCRATCHED",15]
[12,null,"ROYALTOWN ROAD",13.9,13.9,5.2,null,"D YENDALL",5,53.5,null,"D",412,93]
[13,null,"MEDAL DAY",145,116.5,19.600000000000001,null,"J MALLYON(A)",16,53.5,null,null,15,92]
[14,null,"SKALATONIC",{"$nulls":4},"SCRATCHED",18]
[15,null,"STRAIGHT ARROW",8.9,7.8,1.9,null,"D GAUCI",3,53.5,null,null,"X32",92]
[16,null,"EUREKA JACK",{"$nulls":4},"SCRATCHED",10]
[17,null,"APRES",58,76.400000000000006,24.2,null,"L BEER",13,53.5,null,"D",515,86]
[18,null,"PARAMOUR",17.2,21.2,6.3,null,"J NOONAN(A)",4,53.5,null,null,433,94]
[]
["UNiTAB Pool Totals"]
["WN",2862,"QN",311,"TF",960,"DD(7,8) "]
["PL",1440,"EX",127,"F4",147,"TT(6,7,8) "]
[null,null,"A2",77,null,null,"QD(5,6,7,8) "]
[]
["<< MR  1  2  3  4  5  6  7  8  DD/TT/QD  XD Riders  Fixed Price >>"]
[]
["Help","Gambling Advice","TAB Home","Refresh"]
["© Copyright UNiTAB Ltd","Created: Sat, 26 Mar 2011 09:43:06 Aust EST"]

{"sheet":"Selections","index":5,"n_rows":9,"n_cols":10,"rows_kept":9,"cut":false,"hidden":false,"merged":[]}
["Venue",null,"Race",null,"No","Runner",null,null,"Win","Place"]
["CAULFIELD ",null,1,null,1," Rockshaft ",null,null,"",""]
["CAULFIELD ",null,2,null,8," Syntonic ",null,null,"",""]
["CAULFIELD ",null,3,null,8," Neriani ",null,null,"",""]
["CAULFIELD ",null,4,null,3," Ariarni ",null,null,"",""]
["CAULFIELD ",null,5,null,4," Launay ",null,null,"",""]
["CAULFIELD ",null,6,null,1," Pinwheel ",null,null,"",""]
["CAULFIELD ",null,7,null,7," Base ",null,null,"",""]
["CAULFIELD ",null,8,null,5," Oforawesome ",null,null,"",""]