{"text_format":"2","workbook":"xlsx","n_sheets":6,"sheets":["Neurals","Data","Instructions","Meetings","Race","Selections"],"not_rendered":{"charts":0,"images":0,"macros":1,"external_links":0,"defined_names":1095,"comments":0,"pivot_tables":0},"unopened":[],"bounds":{"document_bytes":16777216,"sheet_cells":100000,"run_cost":"one","rows_first":2000,"rows_last":500,"rows_between":2000,"halvings":0,"cell_chars":16384,"cell_head_chars":4096},"cells_cut":0,"cells_raw":0,"read":"whole","date_system":"1900"}

{"sheet":"Neurals","index":0,"n_rows":68,"n_cols":32,"rows_kept":68,"cut":false,"hidden":false,"merged":[[2,5,2,7],[1,8,2,10],[2,14,2,15]]}
[{"$nulls":20},{"$f":"IF(Race!D2=\"Paying\",\"Paying\",\"\")","v":"Paying"},{"$f":"SUM(AA1:AA2)","v":1},{"$f":"IF(AA1<>\"\",B3,\"\")","v":""},null,{"$f":"IF(AA1<>\"\",E3,\"\")","v":""},{"$f":"IF(AA1=\"\",\"\",\"Fav\")","v":""},{"$f":"IF(SUM(Y11:Y36)>0,SUM(Y11:Y36),\"\")","v":""},{"$f":"IF(AA1=\"\",\"\",IF(ISNA(VLOOKUP(AA1,$Y$11:$Z$36,2,FALSE)),\"\",(VLOOKUP(AA1,$Y$11:$Z$36,2,FALSE))))","v":""},null,null,{"$f":"IF(U1<>\"\",IF(ISNA(VLOOKUP(AB1,Data!$C$3:$E$5,2,FALSE)),\"\",(VLOOKUP(AB1,Data!$C$3:$E$5,2,FALSE))),\"\")","v":""},{"$f":"IF(U1<>\"\",IF(ISNA(VLOOKUP(AB1,Data!$C$3:$E$5,1,FALSE)),\"\",(VLOOKUP(AB1,Data!$C$3:$E$5,3,FALSE))),\"\")","v":""}]
[null,"Race Venue",null,"Race Code","1st Race No","Last Race No",{"$nulls":6},"WT",null,"Min Price",{"$nulls":7},{"$f":"IF(AA2<>\"\",B3,\"\")","v":"CAULFIELD "},null,{"$f":"IF(AA2<>\"\",E3,\"\")","v":2},{"$f":"IF(AA2=\"\",\"\",\"CP/FR\")","v":"CP/FR"},{"$f":"IF(SUM(Y41:Y67)>0,SUM(Y41:Y67),\"\")","v":1},{"$f":"IF(AA2=\"\",\"\",IF(ISNA(VLOOKUP(AA2,$Y$41:$Z$65,2,FALSE)),\"\",(VLOOKUP(AA2,$Y$41:$Z$65,2,FALSE))))","v":"Rockshaft"},null,null,{"$f":"IF(U1<>\"\",IF(ISNA(VLOOKUP(AB2,Data!$C$3:$E$5,2,FALSE)),\"\",(VLOOKUP(AB2,Data!$C$3:$E$5,2,FALSE))),\"\")","v":""},{"$f":"IF(U1<>\"\",IF(ISNA(VLOOKUP(AB2,Data!$C$3:$E$5,1,FALSE)),\"\",(VLOOKUP(AB2,Data!$C$3:$E$5,3,FALSE))),\"\")","v":""}]
[null,"CAULFIELD ",null,16291,2,1,{"$nulls":6},3,null,2,{"$nulls":7},{"$f":"IF(AA3<>\"\",B3,\"\")","v":""},null,{"$f":"IF(AA3<>\"\",E3,\"\")","v":""},{"$f":"IF(AA3<>\"\",AA39,\"\")","v":""},{"$f":"IF(AA39<O3,\"\",IF(AB39<>\"\",AB39,\"\"))","v":""},{"$f":"IF(AA3=\"\",\"\",IF(ISNA(VLOOKUP(AA3,$B$36:$C$71,2,FALSE)),\"\",(VLOOKUP(AA3,$B$36:$C$71,2,FALSE))))","v":""},null,null,{"$f":"IF(U1<>\"\",IF(ISNA(VLOOKUP(AB3,Data!$C$3:$E$5,2,FALSE)),\"\",(VLOOKUP(AB3,Data!$C$3:$E$5,2,FALSE))),\"\")","v":""},{"$f":"IF(U1<>\"\",IF(ISNA(VLOOKUP(AB3,Data!$C$3:$E$5,1,FALSE)),\"\",(VLOOKUP(AB3,Data!$C$3:$E$5,3,FALSE))),\"\")","v":""}]
[]
[]
[]
[]
[null,{"$f":"B3","v":"CAULFIELD "},null,"Race",{"$f":"E3","v":2}]
[null,null,{"$f":"LARGE(C11:C40,1)","v":136},null,{"$f":"LARGE(E11:E40,1)","v":14}]
["TAB","HORSE","NR","HCP","CP","CF","TIM","SCR","JA","TA","JT","BP","WET","CRS","D","$","DLR",{"$nulls":5},"Unitab Rated",null,null,"Runner"]
{"$rows_left_out":59}
{"sheet":"Data","index":1,"n_rows":45,"n_cols":19,"rows_kept":45,"cut":false,"hidden":false,"merged":[]}
[{"$f":"Neurals!B3","v":"CAULFIELD "},{"$f":"Neurals!E3","v":2},{"$f":"Neurals!U1","v":"Paying"},null,"2011-03-26",null,{"$f":"IF(ISNA(VLOOKUP(A1,F2:Q40,B1+2,FALSE)),\"\",VLOOKUP(A1,F2:Q40,B1+2,FALSE))","v":"http://www.tabonline.com.au/2011/03/26/MR02.html"}]
[{"$nulls":5},{"$f":"IF(G2=\"\",\"\",IF(ISERROR(LEFT(G2,FIND(\"(\",G2,1)-1)),\"\",LEFT(G2,FIND(\"(\",G2,1)-1)))","v":"DOOMBEN "},{"$f":"IF(Meetings!B3=\"\",\"\",Meetings!B3)","v":"DOOMBEN (BR)"},{"$f":"IF(Meetings!D3=\"\",\"\",getAddress(Meetings!D3))","v":"http://www.tabonline.com.au/2011/03/26/BR01.html"},{"$f":"IF(Meetings!E3=\"\",\"\",getAddress(Meetings!E3))","v":"http://www.tabonline.com.au/2011/03/26/BR02.html"},{"$f":"IF(Meetings!F3=\"\",\"\",getAddress(Meetings!F3))","v":"http://www.tabonline.com.au/2011/03/26/BR03.html"},{"$f":"IF(Meetings!G3=\"\",\"\",getAddress(Meetings!G3))","v":"http://www.tabonline.com.au/2011/03/26/BR04.html"},{"$f":"IF(Meetings!H3=\"\",\"\",getAddress(Meetings!H3))","v":"http://www.tabonline.com.au/2011/03/26/BR05.html"},{"$f":"IF(Meetings!I3=\"\",\"\",getAddress(Meetings!I3))","v":"http://www.tabonline.com.au/2011/03/26/BR06.html"},{"$f":"IF(Meetings!J3=\"\",\"\",getAddress(Meetings!J3))","v":"http://www.tabonline.com.au/2011/03/26/BR07.html"},{"$f":"IF(Meetings!K3=\"\",\"\",getAddress(Meetings!K3))","v":"http://www.tabonline.com.au/2011/03/26/BR08.html"},{"$f":"IF(Meetings!L3=\"\",\"\",getAddress(Meetings!L3))","v":""},{"$f":"IF(Meetings!M3=\"\",\"\",getAddress(Meetings!M3))","v":""},{"$f":"IF(Meetings!N3=\"\",\"\",getAddress(Meetings!N3))","v":""},{"$f":"IF(Meetings!O3=\"\",\"\",getAddress(Meetings!O3))","v":""}]
[{"$f":"IF(Race!N1<>\"\",(CLEAN(TRIM(Race!C1))),\"\")","v":""},{"$f":"IF(A3<>\"\",Race!I1,\"\")","v":""},{"$f":"IF($C$1<>\"\",INDEX(Race!$A$1:$C20,MATCH(\"QN\",Race!$A1:$A$20,0)-4,3),\"\")","v":"CUTE EMILY"},{"$f":"IF(ISNA(VLOOKUP(C3,Race!$C$2:$E$15,2,FALSE)),\"\",(VLOOKUP(C3,Race!$C$2:$E$15,2,FALSE)))","v":4},{"$f":"IF(ISNA(VLOOKUP(C3,Race!$C$2:$E$15,3,FALSE)),\"\",(VLOOKUP(C3,Race!$C$2:$E$15,3,FALSE)))","v":1.4},{"$f":"IF(H3=\"\",\"\",IF(ISERROR(LEFT(G3,FIND(\"(\",G3,1)-1)),\"\",LEFT(G3,FIND(\"(\",G3,1)-1)))","v":"ROSEHILL "},{"$f":"IF(Meetings!B4=\"\",\"\",Meetings!B4)","v":"ROSEHILL (SR)"},{"$f":"IF(Meetings!D4=\"\",\"\",getAddress(Meetings!D4))","v":"http://www.tabonline.com.au/2011/03/26/SR01.html"},{"$f":"IF(Meetings!E4=\"\",\"\",getAddress(Meetings!E4))","v":"http://www.tabonline.com.au/2011/03/26/SR02.html"},{"$f":"IF(Meetings!F4=\"\",\"\",getAddress(Meetings!F4))","v":"http://www.tabonline.com.au/2011/03/26/SR03.html"},{"$f":"IF(Meetings!G4=\"\",\"\",getAddress(Meetings!G4))","v":"http://www.tabonline.com.au/2011/03/26/SR04.html"},{"$f":"IF(Meetings!H4=\"\",\"\",getAddress(Meetings!H4))","v":"http://www.tabonline.com.au/2011/03/26/SR05.html"},{"$f":"IF(Meetings!I4=\"\",\"\",getAddress(Meetings!I4))","v":"http://www.tabonline.com.au/2011/03/26/SR06.html"},{"$f":"IF(Meetings!J4=\"\",\"\",getAddress(Meetings!J4))","v":"http://www.tabonline.com.au/2011/03/26/SR07.html"},{"$f":"IF(Meetings!K4=\"\",\"\",getAddress(Meetings!K4))","v":"http://www.tabonline.com.au/2011/03/26/SR08.html"},{"$f":"IF(Meetings!L4=\"\",\"\",getAddress(Meetings!L4))","v":"http://www.tabonline.com.au/2011/03/26/SR09.html"},{"$f":"IF(Meetings!M4=\"\",\"\",getAddress(Meetings!M4))","v":""},{"$f":"IF(Meetings!N4=\"\",\"\",getAddress(Meetings!N4))","v":""},{"$f":"IF(Meetings!O4=\"\",\"\",getAddress(Meetings!O4))","v":""}]
[{"$f":"IF(Race!N2<>\"\",(CLEAN(TRIM(Race!C2))),\"\")","v":""},{"$f":"IF(A4<>\"\",Race!N2,\"\")","v":""},{"$f":"IF($C$1<>\"\",INDEX(Race!$A$1:$C21,MATCH(\"QN\",Race!$A2:$A$20,0)-2,3),\"\")","v":"KUHREIHEN"},{"$f":"IF(ISNA(VLOOKUP(C4,Race!$C$2:$E$15,2,FALSE)),\"\",(VLOOKUP(C4,Race!$C$2:$E$15,2,FALSE)))","v":0},{"$f":"IF(ISNA(VLOOKUP(C4,Race!$C$2:$E$15,3,FALSE)),\"\",(VLOOKUP(C4,Race!$C$2:$E$15,3,FALSE)))","v":2.5},{"$f":"IF(H4=\"\",\"\",IF(ISERROR(LEFT(G4,FIND(\"(\",G4,1)-1)),\"\",LEFT(G4,FIND(\"(\",G4,1)-1)))","v":"CAULFIELD "},{"$f":"IF(Meetings!B5=\"\",\"\",Meetings!B5)","v":"CAULFIELD (MR)"},{"$f":"IF(Meetings!D5=\"\",\"\",getAddress(Meetings!D5))","v":"http://www.tabonline.com.au/2011/03/26/MR01.html"},{"$f":"IF(Meetings!E5=\"\",\"\",getAddress(Meetings!E5))","v":"http://www.tabonline.com.au/2011/03/26/MR02.html"},{"$f":"IF(Meetings!F5=\"\",\"\",getAddress(Meetings!F5))","v":"http://www.tabonline.com.au/2011/03/26/MR03.html"},{"$f":"IF(Meetings!G5=\"\",\"\",getAddress(Meetings!G5))","v":"http://www.tabonline.com.au/2011/03/26/MR04.html"},{"$f":"IF(Meetings!H5=\"\",\"\",getAddress(Meetings!H5))","v":"http://www.tabonline.com.au/2011/03/26/MR05.html"},{"$f":"IF(Meetings!I5=\"\",\"\",getAddress(Meetings!I5))","v":"http://www.tabonline.com.au/2011/03/26/MR06.html"},{"$f":"IF(Meetings!J5=\"\",\"\",getAddress(Meetings!J5))","v":"http://www.tabonline.com.au/2011/03/26/MR07.html"},{"$f":"IF(Meetings!K5=\"\",\"\",getAddress(Meetings!K5))","v":"http://www.tabonline.com.au/2011/03/26/MR08.html"},{"$f":"IF(Meetings!L5=\"\",\"\",getAddress(Meetings!L5))","v":""},{"$f":"IF(Meetings!M5=\"\",\"\",getAddress(Meetings!M5))","v":""},{"$f":"IF(Meetings!N5=\"\",\"\",getAddress(Meetings!N5))","v":""},{"$f":"IF(Meetings!O5=\"\",\"\",getAddress(Meetings!O5))","v":""}]
[{"$f":"IF(Race!N3<>\"\",(CLEAN(TRIM(Race!C3))),\"\")","v":""},{"$f":"IF(A5<>\"\",Race!N3,\"\")","v":""},{"$f":"IF($C$1<>\"\",INDEX(Race!$A$1:$C22,MATCH(\"QN\",Race!$A3:$A$20,0)-0,3),\"\")","v":"GENERAL OFFER"},{"$f":"IF(ISNA(VLOOKUP(C5,Race!$C$2:$E$15,2,FALSE)),\"\",(VLOOKUP(C5,Race!$C$2:$E$15,2,FALSE)))","v":0},{"$f":"IF(ISNA(VLOOKUP(C5,Race!$C$2:$E$15,3,FALSE)),\"\",(VLOOKUP(C5,Race!$C$2:$E$15,3,FALSE)))","v":1.7},"GOLD COAST ",{"$f":"IF(Meetings!B6=\"\",\"\",Meetings!B6)","v":"GOLD COAST (QR)"},{"$f":"IF(Meetings!D6=\"\",\"\",getAddress(Meetings!D6))","v":"http://www.tabonline.com.au/2011/03/26/QR01.html"},{"$f":"IF(Meetings!E6=\"\",\"\",getAddress(Meetings!E6))","v":"http://www.tabonline.com.au/2011/03/26/QR02.html"},{"$f":"IF(Meetings!F6=\"\",\"\",getAddress(Meetings!F6))","v":"http://www.tabonline.com.au/2011/03/26/QR03.html"},{"$f":"IF(Meetings!G6=\"\",\"\",getAddress(Meetings!G6))","v":"http://www.tabonline.com.au/2011/03/26/QR04.html"},{"$f":"IF(Meetings!H6=\"\",\"\",getAddress(Meetings!H6))","v":"http://www.tabonline.com.au/2011/03/26/QR05.html"},{"$f":"IF(Meetings!I6=\"\",\"\",getAddress(Meetings!I6))","v":"http://www.tabonline.com.au/2011/03/26/QR06.html"},{"$f":"IF(Meetings!J6=\"\",\"\",getAddress(Meetings!J6))","v":"http://www.tabonline.com.au/2011/03/26/QR07.html"},{"$f":"IF(Meetings!K6=\"\",\"\",getAddress(Meetings!K6))","v":"http://www.tabonline.com.au/2011/03/26/QR08.html"},{"$f":"IF(Meetings!L6=\"\",\"\",getAddress(Meetings!L6))","v":""},{"$f":"IF(Meetings!M6=\"\",\"\",getAddress(Meetings!M6))","v":""},{"$f":"IF(Meetings!N6=\"\",\"\",getAddress(Meetings!N6))","v":""},{"$f":"IF(Meetings!O6=\"\",\"\",getAddress(Meetings!O6))","v":""}]
[{"$f":"IF(Race!N4<>\"\",(CLEAN(TRIM(Race!C4))),\"\")","v":""},{"$f":"IF(A6<>\"\",Race!N4,\"\")","v":""},null,null,null,"NEWCASTLE ",{"$f":"IF(Meetings!B7=\"\",\"\",Meetings!B7)","v":"NEWCASTLE (NR)"},{"$f":"IF(Meetings!D7=\"\",\"\",getAddress(Meetings!D7))","v":"http://www.tabonline.com.au/2011/03/26/NR01.html"},{"$f":"IF(Meetings!E7=\"\",\"\",getAddress(Meetings!E7))","v":"http://www.tabonline.com.au/2011/03/26/NR02.html"},{"$f":"IF(Meetings!F7=\"\",\"\",getAddress(Meetings!F7))","v":"http://www.tabonline.com.au/2011/03/26/NR03.html"},{"$f":"IF(Meetings!G7=\"\",\"\",getAddress(Meetings!G7))","v":"http://www.tabonline.com.au/2011/03/26/NR04.html"},{"$f":"IF(Meetings!H7=\"\",\"\",getAddress(Meetings!H7))","v":"http://www.tabonline.com.au/2011/03/26/NR05.html"},{"$f":"IF(Meetings!I7=\"\",\"\",getAddress(Meetings!I7))","v":"http://www.tabonline.com.au/2011/03/26/NR06.html"},{"$f":"IF(Meetings!J7=\"\",\"\",getAddress(Meetings!J7))","v":"http://www.tabonline.com.au/2011/03/26/NR07.html"},{"$f":"IF(Meetings!K7=\"\",\"\",getAddress(Meetings!K7))","v":"http://www.tabonline.com.au/2011/03/26/NR08.html"},{"$f":"IF(Meetings!L7=\"\",\"\",getAddress(Meetings!L7))","v":""},{"$f":"IF(Meetings!M7=\"\",\"\",getAddress(Meetings!M7))","v":""},{"$f":"IF(Meetings!N7=\"\",\"\",getAddress(Meetings!N7))","v":""},{"$f":"IF(Meetings!O7=\"\",\"\",getAddress(Meetings!O7))","v":""}]
[{"$f":"IF(Race!N5<>\"\",(CLEAN(TRIM(Race!C5))),\"\")","v":""},{"$f":"IF(A7<>\"\",Race!N5,\"\")","v":""},{"$f":"IF(A7<>\"\",Race!I5,\"\")","v":""},null,null,"COLAC ",{"$f":"IF(Meetings!B8=\"\",\"\",Meetings!B8)","v":"COLAC (VR)"},{"$f":"IF(Meetings!D8=\"\",\"\",getAddress(Meetings!D8))","v":"http://www.tabonline.com.au/2011/03/26/VR01.html"},{"$f":"IF(Meetings!E8=\"\",\"\",getAddress(Meetings!E8))","v":"http://www.tabonline.com.au/2011/03/26/VR02.html"},{"$f":"IF(Meetings!F8=\"\",\"\",getAddress(Meetings!F8))","v":"http://www.tabonline.com.au/2011/03/26/VR03.html"},{"$f":"IF(Meetings!G8=\"\",\"\",getAddress(Meetings!G8))","v":"http://www.tabonline.com.au/2011/03/26/VR04.html"},{"$f":"IF(Meetings!H8=\"\",\"\",getAddress(Meetings!H8))","v":"http://www.tabonline.com.au/2011/03/26/VR05.html"},{"$f":"IF(Meetings!I8=\"\",\"\",getAddress(Meetings!I8))","v":"http://www.tabonline.com.au/2011/03/26/VR06.html"},{"$f":"IF(Meetings!J8=\"\",\"\",getAddress(Meetings!J8))","v":"http://www.tabonline.com.au/2011/03/26/VR07.html"},{"$f":"IF(Meetings!K8=\"\",\"\",getAddress(Meetings!K8))","v":"http://www.tabonline.com.au/2011/03/26/VR08.html"},{"$f":"IF(Meetings!L8=\"\",\"\",getAddress(Meetings!L8))","v":""},{"$f":"IF(Meetings!M8=\"\",\"\",getAddress(Meetings!M8))","v":""},{"$f":"IF(Meetings!N8=\"\",\"\",getAddress(Meetings!N8))","v":""},{"$f":"IF(Meetings!O8=\"\",\"\",getAddress(Meetings!O8))","v":""}]
[{"$f":"IF(Race!N6<>\"\",(CLEAN(TRIM(Race!C6))),\"\")","v":""},{"$f":"IF(A8<>\"\",Race!N6,\"\")","v":""},{"$f":"IF(A8<>\"\",Race!I6,\"\")","v":""},null,null,"MORPHETTVILLE ",{"$f":"IF(Meetings!B9=\"\",\"\",Meetings!B9)","v":"MORPHETTVILLE (AR)"},{"$f":"IF(Meetings!D9=\"\",\"\",getAddress(Meetings!D9))","v":"http://www.tabonline.com.au/2011/03/26/AR01.html"},{"$f":"IF(Meetings!E9=\"\",\"\",getAddress(Meetings!E9))","v":"http://www.tabonline.com.au/2011/03/26/AR02.html"},{"$f":"IF(Meetings!F9=\"\",\"\",getAddress(Meetings!F9))","v":"http://www.tabonline.com.au/2011/03/26/AR03.html"},{"$f":"IF(Meetings!G9=\"\",\"\",getAddress(Meetings!G9))","v":"http://www.tabonline.com.au/2011/03/26/AR04.html"},{"$f":"IF(Meetings!H9=\"\",\"\",getAddress(Meetings!H9))","v":"http://www.tabonline.com.au/2011/03/26/AR05.html"},{"$f":"IF(Meetings!I9=\"\",\"\",getAddress(Meetings!I9))","v":"http://www.tabonline.com.au/2011/03/26/AR06.html"},{"$f":"IF(Meetings!J9=\"\",\"\",getAddress(Meetings!J9))","v":"http://www.tabonline.com.au/2011/03/26/AR07.html"},{"$f":"IF(Meetings!K9=\"\",\"\",getAddress(Meetings!K9))","v":"http://www.tabonline.com.au/2011/03/26/AR08.html"},{"$f":"IF(Meetings!L9=\"\",\"\",getAddress(Meetings!L9))","v":""},{"$f":"IF(Meetings!M9=\"\",\"\",getAddress(Meetings!M9))","v":""},{"$f":"IF(Meetings!N9=\"\",\"\",getAddress(Meetings!N9))","v":""},{"$f":"IF(Meetings!O9=\"\",\"\",getAddress(Meetings!O9))","v":""}]
[{"$f":"IF(Race!N7<>\"\",(CLEAN(TRIM(Race!C7))),\"\")","v":""},{"$f":"IF(A9<>\"\",Race!N7,\"\")","v":""},{"$f":"IF(A9<>\"\",Race!I7,\"\")","v":""},null,null,"GOULBURN ",{"$f":"IF(Meetings!B10=\"\",\"\",Meetings!B10)","v":"GOULBURN (CR)"},{"$f":"IF(Meetings!D10=\"\",\"\",getAddress(Meetings!D10))","v":"http://www.tabonline.com.au/2011/03/26/CR01.html"},{"$f":"IF(Meetings!E10=\"\",\"\",getAddress(Meetings!E10))","v":"http://www.tabonline.com.au/2011/03/26/CR02.html"},{"$f":"IF(Meetings!F10=\"\",\"\",getAddress(Meetings!F10))","v":"http://www.tabonline.com.au/2011/03/26/CR03.html"},{"$f":"IF(Meetings!G10=\"\",\"\",getAddress(Meetings!G10))","v":"http://www.tabonline.com.au/2011/03/26/CR04.html"},{"$f":"IF(Meetings!H10=\"\",\"\",getAddress(Meetings!H10))","v":"http://www.tabonline.com.au/2011/03/26/CR05.html"},{"$f":"IF(Meetings!I10=\"\",\"\",getAddress(Meetings!I10))","v":"http://www.tabonline.com.au/2011/03/26/CR06.html"},{"$f":"IF(Meetings!J10=\"\",\"\",getAddress(Meetings!J10))","v":""},{"$f":"IF(Meetings!K10=\"\",\"\",getAddress(Meetings!K10))","v":""},{"$f":"IF(Meetings!L10=\"\",\"\",getAddress(Meetings!L10))","v":""},{"$f":"IF(Meetings!M10=\"\",\"\",getAddress(Meetings!M10))","v":""},{"$f":"IF(Meetings!N10=\"\",\"\",getAddress(Meetings!N10))","v":""},{"$f":"IF(Meetings!O10=\"\",\"\",getAddress(Meetings!O10))","v":""}]
[{"$f":"IF(Race!N8<>\"\",(CLEAN(TRIM(Race!C8))),\"\")","v":""},{"$f":"IF(A10<>\"\",Race!N8,\"\")","v":""},{"$f":"IF(A10<>\"\",Race!I8,\"\")","v":""},null,null,"ASCOT ",{"$f":"IF(Meetings!B11=\"\",\"\",Meetings!B11)","v":"ASCOT (PR)"},{"$f":"IF(Meetings!D11=\"\",\"\",getAddress(Meetings!D11))","v":"http://www.tabonline.com.au/2011/03/26/PR01.html"},{"$f":"IF(Meetings!E11=\"\",\"\",getAddress(Meetings!E11))","v":"http://www.tabonline.com.au/2011/03/26/PR02.html"},{"$f":"IF(Meetings!F11=\"\",\"\",getAddress(Meetings!F11))","v":"http://www.tabonline.com.au/2011/03/26/PR03.html"},{"$f":"IF(Meetings!G11=\"\",\"\",getAddress(Meetings!G11))","v":"http://www.tabonline.com.au/2011/03/26/PR04.html"},{"$f":"IF(Meetings!H11=\"\",\"\",getAddress(Meetings!H11))","v":"http://www.tabonline.com.au/2011/03/26/PR05.html"},{"$f":"IF(Meetings!I11=\"\",\"\",getAddress(Meetings!I11))","v":"http://www.tabonline.com.au/2011/03/26/PR06.html"},{"$f":"IF(Meetings!J11=\"\",\"\",getAddress(Meetings!J11))","v":"http://www.tabonline.com.au/2011/03/26/PR07.html"},{"$f":"IF(Meetings!K11=\"\",\"\",getAddress(Meetings!K11))","v":"http://www.tabonline.com.au/2011/03/26/PR08.html"},{"$f":"IF(Meetings!L11=\"\",\"\",getAddress(Meetings!L11))","v":""},{"$f":"IF(Meetings!M11=\"\",\"\",getAddress(Meetings!M11))","v":""},{"$f":"IF(Meetings!N11=\"\",\"\",getAddress(Meetings!N11))","v":""},{"$f":"IF(Meetings!O11=\"\",\"\",getAddress(Meetings!O11))","v":""}]
{"$rows_left_out":36}
{"sheet":"Instructions","index":2,"n_rows":10,"n_cols":11,"rows_kept":10,"cut":false,"hidden":false,"merged":[]}
[]
[]
[]
[]
[null,"Instructions"]
[]
[null,"You need to get the race code from",null,null,null,"http://www.racingandsports.com.au/form-guide/",{"$nulls":4},"click on each venue and get the last set of numbers from the address bar."]
[null,"On the \"Neurals\" sheet press \"Start\" press \"OK\" for todays date or put in a date, there is a box on the right that has the days races, hightlight a race and press \"Select\"  put in race code then 1st and last race numbers for that venue then press the \"Import\" button,"]
[null,"the race will be imported, if the top Neurals selection is also the unitab top rated it will copy to the \"Selections\" sheet."]
[null,"Each race will cycle through for that meeting, when done change the meeting and the race numbers and press import again."]
{"$rows_left_out":1}
{"sheet":"Meetings","index":3,"n_rows":35,"n_cols":16,"rows_kept":35,"cut":false,"hidden":false,"merged":[[1,0,1,2],[28,0,28,2],[21,0,21,2]]}
[]
["Races",null,null,1,2,3,4,5,6,7,8,9,10,11,12]
[null,"DOOMBEN (BR)","Fields","3,5,4 F4","17m F4","57m F4","2:00 F4","2:40 F4","3:20 F4","4:00 F4","4:40 F4"]
[null,"ROSEHILL (SR)","Fields","7,3,11 F4","8,6,3 F4","7m F4","47m F4","1:50 F4","2:30 F4","3:10 F4","3:50 F4","4:30 F4"]
[null,"CAULFIELD (MR)","Fields","9,5,3 F4","9,6,7 F4","27m F4","1:30 F4","2:10 F4","2:50 F4","3:30 F4","4:10 F4"]
[null,"GOLD COAST (QR)","Fields","6,3,2 F4","2m F4","42m F4","1:45 F4","2:25 F4","3:05 F4","3:45 F4","4:25 F4"]
[null,"NEWCASTLE (NR)","Fields","2,1,9 ","Interim ","32m ","01:35:00","02:15:00","02:55:00","03:35:00","04:15:00"]
[null,"COLAC (VR)","Fields","2,4,8 ","12m ","52m ","01:55:00","02:35:00","03:15:00","03:55:00","04:35:00"]
[null,"MORPHETTVILLE (AR)","Fields","Interim F4","37m F4","1:40 F4","2:20 F4","3:00 F4","3:40 F4","4:20 F4","4:55 F4"]
[null,"GOULBURN (CR)","Fields","39m ","01:42:00","02:22:00","03:01:00","03:41:00","04:21:00"]
{"$rows_left_out":26}
{"sheet":"Race","index":4,"n_rows":38,"n_cols":14,"rows_kept":38,"cut":false,"hidden":false,"merged":[]}
[]
["CAULFIELD",null,"MR 1","PAYING"]
[]
["2011-03-26","2YO HANDICAP",null,null,"Fixed Price"]
["RADIO TAB","1-9-8-3","STEVE MORAN","3-1-6-5","Late Mail 9","1200M","OVERCAST","DEAD(4)"]
[]
[{"$nulls":6},"SCR 2 7 10"]
[9,null,"CUTE EMILY",4,1.4]
[5,null,"KUHREIHEN",null,2.5]
[3,null,"GENERAL OFFER",null,1.7]
{"$rows_left_out":29}
{"sheet":"Selections","index":5,"n_rows":1,"n_cols":10,"rows_kept":1,"cut":false,"hidden":false,"merged":[]}
["Venue",null,"Race",null,"No","Runner",null,null,"Win","Place"]