{"text_format":"2","workbook":"xlsx","n_sheets":6,"sheets":["Neurals","Data","Instructions","Meetings","Race","Selections"],"not_rendered":{"charts":0,"images":0,"macros":1,"external_links":0,"defined_names":1095,"comments":0,"pivot_tables":0},"unopened":[],"bounds":{"document_bytes":16777216,"sheet_cells":100000,"run_cost":"one","rows_first":2000,"rows_last":500,"rows_between":2000,"halvings":0,"cell_chars":16384,"cell_head_chars":4096},"cells_cut":0,"cells_raw":0,"read":"whole","date_system":"1900"}

{"sheet":"Neurals","index":0,"n_rows":68,"n_cols":32,"rows_kept":68,"cut":false,"hidden":false,"merged":[[2,5,2,7],[1,8,2,10],[2,14,2,15]]}
[{"$nulls":20},{"$f":"IF(Race!D2=\"Paying\",\"Paying\",\"\")","v":"Paying"},{"$f":"SUM(AA1:AA2)","v":1},{"$f":"IF(AA1<>\"\",B3,\"\")","v":""},null,{"$f":"IF(AA1<>\"\",E3,\"\")","v":""},{"$f":"IF(AA1=\"\",\"\",\"Fav\")","v":""},{"$f":"IF(SUM(Y11:Y36)>0,SUM(Y11:Y36),\"\")","v":""},{"$f":"IF(AA1=\"\",\"\",IF(ISNA(VLOOKUP(AA1,$Y$11:$Z$36,2,FALSE)),\"\",(VLOOKUP(AA1,$Y$11:$Z$36,2,FALSE))))","v":""},null,null,{"$f":"IF(U1<>\"\",IF(ISNA(VLOOKUP(AB1,Data!$C$3:$E$5,2,FALSE)),\"\",(VLOOKUP(AB1,Data!$C$3:$E$5,2,FALSE))),\"\")","v":""},{"$f":"IF(U1<>\"\",IF(ISNA(VLOOKUP(AB1,Data!$C$3:$E$5,1,FALSE)),\"\",(VLOOKUP(AB1,Data!$C$3:$E$5,3,FALSE))),\"\")","v":""}]
[null,"Race Venue",null,"Race Code","1st Race No","Last Race No",{"$nulls":6},"WT",null,"Min Price",{"$nulls":7},{"$f":"IF(AA2<>\"\",B3,\"\")","v":"CAULFIELD "},null,{"$f":"IF(AA2<>\"\",E3,\"\")","v":2},{"$f":"IF(AA2=\"\",\"\",\"CP/FR\")","v":"CP/FR"},{"$f":"IF(SUM(Y41:Y67)>0,SUM(Y41:Y67),\"\")","v":1},{"$f":"IF(AA2=\"\",\"\",IF(ISNA(VLOOKUP(AA2,$Y$41:$Z$65,2,FALSE)),\"\",(VLOOKUP(AA2,$Y$41:$Z$65,2,FALSE))))","v":"Rockshaft"},null,null,{"$f":"IF(U1<>\"\",IF(ISNA(VLOOKUP(AB2,Data!$C$3:$E$5,2,FALSE)),\"\",(VLOOKUP(AB2,Data!$C$3:$E$5,2,FALSE))),\"\")","v":""},{"$f":"IF(U1<>\"\",IF(ISNA(VLOOKUP(AB2,Data!$C$3:$E$5,1,FALSE)),\"\",(VLOOKUP(AB2,Data!$C$3:$E$5,3,FALSE))),\"\")","v":""}]
[null,"CAULFIELD ",null,16291,2,1,{"$nulls":6},3,null,2,{"$nulls":7},{"$f":"IF(AA3<>\"\",B3,\"\")","v":""},null,{"$f":"IF(AA3<>\"\",E3,\"\")","v":""},{"$f":"IF(AA3<>\"\",AA39,\"\")","v":""},{"$f":"IF(AA39<O3,\"\",IF(AB39<>\"\",AB39,\"\"))","v":""},{"$f":"IF(AA3=\"\",\"\",IF(ISNA(VLOOKUP(AA3,$B$36:$C$71,2,FALSE)),\"\",(VLOOKUP(AA3,$B$36:$C$71,2,FALSE))))","v":""},null,null,{"$f":"IF(U1<>\"\",IF(ISNA(VLOOKUP(AB3,Data!$C$3:$E$5,2,FALSE)),\"\",(VLOOKUP(AB3,Data!$C$3:$E$5,2,FALSE))),\"\")","v":""},{"$f":"IF(U1<>\"\",IF(ISNA(VLOOKUP(AB3,Data!$C$3:$E$5,1,FALSE)),\"\",(VLOOKUP(AB3,Data!$C$3:$E$5,3,FALSE))),\"\")","v":""}]
[]
[]
[]
[]
[null,{"$f":"B3","v":"CAULFIELD "},null,"Race",{"$f":"E3","v":2}]
[null,null,{"$f":"LARGE(C11:C40,1)","v":136},null,{"$f":"LARGE(E11:E40,1)","v":14}]
["TAB","HORSE","NR","HCP","CP","CF","TIM","SCR","JA","TA","JT","BP","WET","CRS","D","$","DLR",{"$nulls":5},"Unitab Rated",null,null,"Runner"]
[1," Rockshaft",125,null,14,18,10,0,5,3,13,14,0,1,11,22,15,{"$nulls":4},{"$f":"CLEAN(TRIM(B11))","v":"Rockshaft"},{"$f":"IF(ISNA(VLOOKUP(V11,Data!$A$1:'Data'!$B$200,2,FALSE)),\"\",(VLOOKUP(V11,Data!$A$1:'Data'!$B$200,2,FALSE)))","v":96},null,{"$f":"IF(W11=100,IF(C11=$C$9,A11,\"\"),\"\")","v":""},{"$f":"IF(Y11=\"\",\"\",CLEAN(TRIM(B11)))","v":""},null,null,null,"Today's Meetings"]
[2," Caravaggio",0,null,0,0,0,1,0,0,0,0,0,0,0,0,0,{"$nulls":4},{"$f":"CLEAN(TRIM(B12))","v":"Caravaggio"},{"$f":"IF(ISNA(VLOOKUP(V12,Data!$A$1:'Data'!$B$200,2,FALSE)),\"\",(VLOOKUP(V12,Data!$A$1:'Data'!$B$200,2,FALSE)))","v":""},null,"",{"$f":"IF(Y12=\"\",\"\",CLEAN(TRIM(B12)))","v":""},null,null,null,{"$f":"IF(Data!F2=\"\",\"\",Data!F2)","v":"DOOMBEN "}]
[3," General Offer",76.5,null,8,9,10,0,8,3,3,10,0,1,8,2,16,{"$nulls":4},"General Offer",{"$f":"IF(ISNA(VLOOKUP(V13,Data!$A$1:'Data'!$B$200,2,FALSE)),\"\",(VLOOKUP(V13,Data!$A$1:'Data'!$B$200,2,FALSE)))","v":91},null,"","",null,null,null,{"$f":"IF(Data!F3=\"\",\"\",Data!F3)","v":"ROSEHILL "}]
[4," King'S Shilling",47.5,null,1,0,1,0,3,13,8,9,0,1,11,1,1,{"$nulls":4},"King'S Shilling",{"$f":"IF(ISNA(VLOOKUP(V14,Data!$A$1:'Data'!$B$200,2,FALSE)),\"\",(VLOOKUP(V14,Data!$A$1:'Data'!$B$200,2,FALSE)))","v":64},null,"","",null,null,null,{"$f":"IF(Data!F4=\"\",\"\",Data!F4)","v":"CAULFIELD "}]
[5," Kuhreihen",49.5,null,0,0,0,0,10,15,3,10,0,1,10,1,0,{"$nulls":4},"Kuhreihen",{"$f":"IF(ISNA(VLOOKUP(V15,Data!$A$1:'Data'!$B$200,2,FALSE)),\"\",(VLOOKUP(V15,Data!$A$1:'Data'!$B$200,2,FALSE)))","v":84},null,"","",null,null,null,{"$f":"IF(Data!F5=\"\",\"\",Data!F5)","v":"GOLD COAST "}]
[6," River Of Glory",47.5,null,1,0,1,0,13,8,3,10,0,1,10,1,1,{"$nulls":4},"River Of Glory",{"$f":"IF(ISNA(VLOOKUP(V16,Data!$A$1:'Data'!$B$200,2,FALSE)),\"\",(VLOOKUP(V16,Data!$A$1:'Data'!$B$200,2,FALSE)))","v":64},null,"","",null,null,null,{"$f":"IF(Data!F6=\"\",\"\",Data!F6)","v":"NEWCASTLE "}]
[7," Raffles Pegasus",0,null,0,0,0,1,0,0,0,0,0,0,0,0,0,{"$nulls":4},"Raffles Pegasus",{"$f":"IF(ISNA(VLOOKUP(V17,Data!$A$1:'Data'!$B$200,2,FALSE)),\"\",(VLOOKUP(V17,Data!$A$1:'Data'!$B$200,2,FALSE)))","v":""},null,"","",null,null,null,{"$f":"IF(Data!F7=\"\",\"\",Data!F7)","v":"COLAC "}]
[8," Riccardo The Great",95.5,null,6,7,1,0,15,8,20,11,0,1,8,1,18,{"$nulls":4},"Riccardo The Great",{"$f":"IF(ISNA(VLOOKUP(V18,Data!$A$1:'Data'!$B$200,2,FALSE)),\"\",(VLOOKUP(V18,Data!$A$1:'Data'!$B$200,2,FALSE)))","v":85},null,"","",null,null,null,{"$f":"IF(Data!F8=\"\",\"\",Data!F8)","v":"MORPHETTVILLE "}]
[9," Cute Emily",136,null,5,7,5,0,15,35,25,11,0,1,10,6,16,{"$nulls":4},"Cute Emily",{"$f":"IF(ISNA(VLOOKUP(V19,Data!$A$1:'Data'!$B$200,2,FALSE)),\"\",(VLOOKUP(V19,Data!$A$1:'Data'!$B$200,2,FALSE)))","v":88},null,"","",null,null,null,{"$f":"IF(Data!F9=\"\",\"\",Data!F9)","v":"GOULBURN "}]
[10," Plucky Belle",0,null,0,0,0,1,0,0,0,0,0,0,0,0,0,{"$nulls":4},"Plucky Belle",{"$f":"IF(ISNA(VLOOKUP(V20,Data!$A$1:'Data'!$B$200,2,FALSE)),\"\",(VLOOKUP(V20,Data!$A$1:'Data'!$B$200,2,FALSE)))","v":""},null,"","",null,null,null,{"$f":"IF(Data!F10=\"\",\"\",Data!F10)","v":"ASCOT "}]
[11," Alanza",60.5,null,1,1,3,0,5,3,5,10,0,1,10,6,16,{"$nulls":4},"Alanza",{"$f":"IF(ISNA(VLOOKUP(V21,Data!$A$1:'Data'!$B$200,2,FALSE)),\"\",(VLOOKUP(V21,Data!$A$1:'Data'!$B$200,2,FALSE)))","v":79},null,"","",null,null,null,{"$f":"IF(Data!F11=\"\",\"\",Data!F11)","v":"TOOWOOMBA "}]
[12," Tigressive",55.5,null,1,1,1,0,5,3,5,14,0,1,10,1,14,{"$nulls":4},"Tigressive",{"$f":"IF(ISNA(VLOOKUP(V22,Data!$A$1:'Data'!$B$200,2,FALSE)),\"\",(VLOOKUP(V22,Data!$A$1:'Data'!$B$200,2,FALSE)))","v":79},null,"","",null,null,null,{"$f":"IF(Data!F12=\"\",\"\",Data!F12)","v":"WELLINGTON "}]
[{"$nulls":21},"",{"$f":"IF(ISNA(VLOOKUP(V23,Data!$A$1:'Data'!$B$200,2,FALSE)),\"\",(VLOOKUP(V23,Data!$A$1:'Data'!$B$200,2,FALSE)))","v":""},null,"","",null,null,null,{"$f":"IF(Data!F13=\"\",\"\",Data!F13)","v":"EDENHOPE "}]
[{"$nulls":21},"",{"$f":"IF(ISNA(VLOOKUP(V24,Data!$A$1:'Data'!$B$200,2,FALSE)),\"\",(VLOOKUP(V24,Data!$A$1:'Data'!$B$200,2,FALSE)))","v":""},null,"","",null,null,null,{"$f":"IF(Data!F14=\"\",\"\",Data!F14)","v":"ALICE SPRINGS "}]
[{"$nulls":24},"","",null,null,null,{"$f":"IF(Data!F15=\"\",\"\",Data!F15)","v":"LINGFIELD "}]
[{"$nulls":24},"","",null,null,null,{"$f":"IF(Data!F16=\"\",\"\",Data!F16)","v":"RICCARTON "}]
[{"$nulls":24},"","",null,null,null,{"$f":"IF(Data!F17=\"\",\"\",Data!F17)","v":"TURFFONTEIN "}]
[{"$nulls":24},"","",null,null,null,{"$f":"IF(Data!F18=\"\",\"\",Data!F18)","v":"KEMPTON PARK "}]
[{"$nulls":24},"","",null,null,null,{"$f":"IF(Data!F19=\"\",\"\",Data!F19)","v":"TAURANGA "}]
[{"$nulls":24},"","",null,null,null,{"$f":"IF(Data!F20=\"\",\"\",Data!F20)","v":""}]
[{"$nulls":24},"","",null,null,null,{"$f":"IF(Data!F21=\"\",\"\",Data!F21)","v":{"$error":"#VALUE!"}}]
[{"$nulls":24},"","",null,null,null,{"$f":"IF(Data!F22=\"\",\"\",Data!F22)","v":"ALBION PARK "}]
[{"$nulls":24},"","",null,null,null,{"$f":"IF(Data!F23=\"\",\"\",Data!F23)","v":"BATHURST "}]
[{"$nulls":24},"","",null,null,null,{"$f":"IF(Data!F24=\"\",\"\",Data!F24)","v":"KILMORE "}]
[{"$nulls":24},"","",null,null,null,{"$f":"IF(Data!F25=\"\",\"\",Data!F25)","v":"GLOBE DERBY "}]
[{"$nulls":24},"","",null,null,null,{"$f":"IF(Data!F26=\"\",\"\",Data!F26)","v":"GLOUCESTER PARK "}]
[]
[]
[{"$nulls":14},{"$f":"LARGE(O41:O70,1)","v":41},{"$nulls":11},{"$f":"SMALL(R41:R70,1)","v":1.9},{"$f":"LARGE(AB41:AB71,1)","v":1}]
["INC","TAB","HORSE","RFS","DLS","12m","BRR","SCR","FORM","COND","CONS","BP","JOCK","JC","FR","EM","PER","DIV","DInc",null,null,null,"Barrier",null,null,"Runner"]
[null,1," Rockshaft ",4,21,35.5,null,0,{"$nulls":5},1.5,41,0,52.33,1.9,null,null,null,{"$f":"CLEAN(TRIM(C41))","v":"Rockshaft"},{"$f":"IF(V41=\"\",\"\",IF(ISNA(VLOOKUP(V41,Data!$A$1:'Data'!$C$200,3,FALSE)),\"\",(VLOOKUP(V41,Data!$A$1:'Data'!$C$200,3,FALSE))))","v":8},null,{"$f":"IF(W41=\"\",\"\",IF(W41>4,IF(AND(E11=$E$9,O41=$O$39),B41,\"\"),\"\"))","v":1},{"$f":"IF(Y41=\"\",\"\",CLEAN(TRIM(C41)))","v":"Rockshaft"},{"$f":"IF(R41=$AA$39,R41,\"\")","v":1.9},{"$f":"IF(AA41<>\"\",B41,\"\")","v":1}]
[null,2," Caravaggio ","SU ",9,32.5,null,1,{"$nulls":5},0,null,null,null,"scr",null,null,null,{"$f":"CLEAN(TRIM(C42))","v":"Caravaggio"},{"$f":"IF(V42=\"\",\"\",IF(ISNA(VLOOKUP(V42,Data!$A$1:'Data'!$C$200,3,FALSE)),\"\",(VLOOKUP(V42,Data!$A$1:'Data'!$C$200,3,FALSE))))","v":""},null,{"$f":"IF(W42=\"\",\"\",IF(W42>4,IF(AND(E12=$E$9,O42=$O$39),B42,\"\"),\"\"))","v":""},{"$f":"IF(Y42=\"\",\"\",CLEAN(TRIM(C42)))","v":""},{"$f":"IF(R42=$AA$39,R42,\"\")","v":""},{"$f":"IF(AA42<>\"\",B42,\"\")","v":""}]
[null,3," General Offer ",5,14,35,null,0,{"$nulls":5},0,38,3,20.93,4.8,null,null,null,"General Offer",{"$f":"IF(V43=\"\",\"\",IF(ISNA(VLOOKUP(V43,Data!$A$1:'Data'!$C$200,3,FALSE)),\"\",(VLOOKUP(V43,Data!$A$1:'Data'!$C$200,3,FALSE))))","v":11},null,"","","",""]
[null,4," King'S Shilling ","FU ",0,null,null,0,{"$nulls":5},2,34,7,2.62,41,null,null,null,"King'S Shilling",{"$f":"IF(V44=\"\",\"\",IF(ISNA(VLOOKUP(V44,Data!$A$1:'Data'!$C$200,3,FALSE)),\"\",(VLOOKUP(V44,Data!$A$1:'Data'!$C$200,3,FALSE))))","v":2},null,"","","",""]
[null,5," Kuhreihen ",0,0,null,null,0,{"$nulls":5},0,32,9,0.52,201,null,null,null,"Kuhreihen",{"$f":"IF(V45=\"\",\"\",IF(ISNA(VLOOKUP(V45,Data!$A$1:'Data'!$C$200,3,FALSE)),\"\",(VLOOKUP(V45,Data!$A$1:'Data'!$C$200,3,FALSE))))","v":6},null,"","","",""]
[null,6," River Of Glory ","FU ",0,null,null,0,{"$nulls":5},1.5,35.5,5.5,5.76,17,null,null,null,"River Of Glory",{"$f":"IF(V46=\"\",\"\",IF(ISNA(VLOOKUP(V46,Data!$A$1:'Data'!$C$200,3,FALSE)),\"\",(VLOOKUP(V46,Data!$A$1:'Data'!$C$200,3,FALSE))))","v":1},null,"","","",""]
[null,7," Raffles Pegasus ",4,14,32.5,null,1,{"$nulls":5},0,null,null,null,"scr",null,null,null,"Raffles Pegasus",{"$f":"IF(V47=\"\",\"\",IF(ISNA(VLOOKUP(V47,Data!$A$1:'Data'!$C$200,3,FALSE)),\"\",(VLOOKUP(V47,Data!$A$1:'Data'!$C$200,3,FALSE))))","v":""},null,"","","",""]
[null,8," Riccardo The Great ",3,9,32,null,0,{"$nulls":5},0,33.5,7.5,2.09,51,null,null,null,"Riccardo The Great",{"$f":"IF(V48=\"\",\"\",IF(ISNA(VLOOKUP(V48,Data!$A$1:'Data'!$C$200,3,FALSE)),\"\",(VLOOKUP(V48,Data!$A$1:'Data'!$C$200,3,FALSE))))","v":5},null,"","","",""]
[null,9," Cute Emily ","SU ",15,32,null,0,{"$nulls":5},0,35,6,4.1900000000000004,26,null,null,null,"Cute Emily",{"$f":"IF(V49=\"\",\"\",IF(ISNA(VLOOKUP(V49,Data!$A$1:'Data'!$C$200,3,FALSE)),\"\",(VLOOKUP(V49,Data!$A$1:'Data'!$C$200,3,FALSE))))","v":12},null,"","","",""]
[null,10," Plucky Belle ","SU ",14,41,null,1,{"$nulls":5},2,null,null,null,"scr",null,null,null,"Plucky Belle",{"$f":"IF(V50=\"\",\"\",IF(ISNA(VLOOKUP(V50,Data!$A$1:'Data'!$C$200,3,FALSE)),\"\",(VLOOKUP(V50,Data!$A$1:'Data'!$C$200,3,FALSE))))","v":""},null,"",{"$f":"IF(Y50=\"\",\"\",CLEAN(TRIM(C50)))","v":""},"",""]
[null,11," Alanza ","SU ",15,25,null,0,{"$nulls":5},0,26,15,0.52,201,null,null,null,"Alanza",{"$f":"IF(V51=\"\",\"\",IF(ISNA(VLOOKUP(V51,Data!$A$1:'Data'!$C$200,3,FALSE)),\"\",(VLOOKUP(V51,Data!$A$1:'Data'!$C$200,3,FALSE))))","v":7},null,"","","",""]
[null,12," Tigressive ","SU ",26,25.5,null,0,{"$nulls":5},0,28.5,12.5,0.52,201,null,null,null,"Tigressive",{"$f":"IF(V52=\"\",\"\",IF(ISNA(VLOOKUP(V52,Data!$A$1:'Data'!$C$200,3,FALSE)),\"\",(VLOOKUP(V52,Data!$A$1:'Data'!$C$200,3,FALSE))))","v":10},null,"","","",""]
[{"$nulls":6},"Clear","Clear","Clear","Clear","Clear","Clear",{"$nulls":9},"",{"$f":"IF(V53=\"\",\"\",IF(ISNA(VLOOKUP(V53,Data!$A$1:'Data'!$C$200,3,FALSE)),\"\",(VLOOKUP(V53,Data!$A$1:'Data'!$C$200,3,FALSE))))","v":""},null,"","","",""]
[{"$nulls":21},"",{"$f":"IF(V54=\"\",\"\",IF(ISNA(VLOOKUP(V54,Data!$A$1:'Data'!$C$200,3,FALSE)),\"\",(VLOOKUP(V54,Data!$A$1:'Data'!$C$200,3,FALSE))))","v":""},null,"","","",""]
[{"$nulls":21},"",{"$f":"IF(V55=\"\",\"\",IF(ISNA(VLOOKUP(V55,Data!$A$1:'Data'!$C$200,3,FALSE)),\"\",(VLOOKUP(V55,Data!$A$1:'Data'!$C$200,3,FALSE))))","v":""},null,"",{"$f":"IF(Y55=\"\",\"\",CLEAN(TRIM(C55)))","v":""},"",""]
[{"$nulls":21},"",{"$f":"IF(V56=\"\",\"\",IF(ISNA(VLOOKUP(V56,Data!$A$1:'Data'!$C$200,3,FALSE)),\"\",(VLOOKUP(V56,Data!$A$1:'Data'!$C$200,3,FALSE))))","v":""},null,"","","",""]
[{"$nulls":21},"",{"$f":"IF(V57=\"\",\"\",IF(ISNA(VLOOKUP(V57,Data!$A$1:'Data'!$C$200,3,FALSE)),\"\",(VLOOKUP(V57,Data!$A$1:'Data'!$C$200,3,FALSE))))","v":""},null,"","","",""]
[{"$nulls":21},"",{"$f":"IF(V58=\"\",\"\",IF(ISNA(VLOOKUP(V58,Data!$A$1:'Data'!$C$200,3,FALSE)),\"\",(VLOOKUP(V58,Data!$A$1:'Data'!$C$200,3,FALSE))))","v":""},null,"","","",""]
[{"$nulls":21},"",{"$f":"IF(V59=\"\",\"\",IF(ISNA(VLOOKUP(V59,Data!$A$1:'Data'!$C$200,3,FALSE)),\"\",(VLOOKUP(V59,Data!$A$1:'Data'!$C$200,3,FALSE))))","v":""},null,"","","",""]
[{"$nulls":21},"",{"$f":"IF(V60=\"\",\"\",IF(ISNA(VLOOKUP(V60,Data!$A$1:'Data'!$C$200,3,FALSE)),\"\",(VLOOKUP(V60,Data!$A$1:'Data'!$C$200,3,FALSE))))","v":""},null,"","","",""]
[{"$nulls":21},"",{"$f":"IF(V61=\"\",\"\",IF(ISNA(VLOOKUP(V61,Data!$A$1:'Data'!$C$200,3,FALSE)),\"\",(VLOOKUP(V61,Data!$A$1:'Data'!$C$200,3,FALSE))))","v":""},null,"","","",""]
[{"$nulls":21},"",{"$f":"IF(V62=\"\",\"\",IF(ISNA(VLOOKUP(V62,Data!$A$1:'Data'!$C$200,3,FALSE)),\"\",(VLOOKUP(V62,Data!$A$1:'Data'!$C$200,3,FALSE))))","v":""},null,"","","",""]
[{"$nulls":21},"",{"$f":"IF(V63=\"\",\"\",IF(ISNA(VLOOKUP(V63,Data!$A$1:'Data'!$C$200,3,FALSE)),\"\",(VLOOKUP(V63,Data!$A$1:'Data'!$C$200,3,FALSE))))","v":""},null,"","","",""]
[{"$nulls":21},"",{"$f":"IF(V64=\"\",\"\",IF(ISNA(VLOOKUP(V64,Data!$A$1:'Data'!$C$200,3,FALSE)),\"\",(VLOOKUP(V64,Data!$A$1:'Data'!$C$200,3,FALSE))))","v":""},null,"",{"$f":"IF(Y64=\"\",\"\",CLEAN(TRIM(C64)))","v":""},"",""]
[{"$nulls":21},"",{"$f":"IF(V65=\"\",\"\",IF(ISNA(VLOOKUP(V65,Data!$A$1:'Data'!$C$200,3,FALSE)),\"\",(VLOOKUP(V65,Data!$A$1:'Data'!$C$200,3,FALSE))))","v":""},null,"","","",""]
[{"$nulls":21},"",{"$f":"IF(V66=\"\",\"\",IF(ISNA(VLOOKUP(V66,Data!$A$1:'Data'!$C$200,3,FALSE)),\"\",(VLOOKUP(V66,Data!$A$1:'Data'!$C$200,3,FALSE))))","v":""},null,"","","",""]
[{"$nulls":24},"","","",""]
[{"$nulls":24},"","","",""]

{"sheet":"Data","index":1,"n_rows":45,"n_cols":19,"rows_kept":45,"cut":false,"hidden":false,"merged":[]}
[{"$f":"Neurals!B3","v":"CAULFIELD "},{"$f":"Neurals!E3","v":2},{"$f":"Neurals!U1","v":"Paying"},null,"2011-03-26",null,{"$f":"IF(ISNA(VLOOKUP(A1,F2:Q40,B1+2,FALSE)),\"\",VLOOKUP(A1,F2:Q40,B1+2,FALSE))","v":"http://www.tabonline.com.au/2011/03/26/MR02.html"}]
[{"$nulls":5},{"$f":"IF(G2=\"\",\"\",IF(ISERROR(LEFT(G2,FIND(\"(\",G2,1)-1)),\"\",LEFT(G2,FIND(\"(\",G2,1)-1)))","v":"DOOMBEN "},{"$f":"IF(Meetings!B3=\"\",\"\",Meetings!B3)","v":"DOOMBEN (BR)"},{"$f":"IF(Meetings!D3=\"\",\"\",getAddress(Meetings!D3))","v":"http://www.tabonline.com.au/2011/03/26/BR01.html"},{"$f":"IF(Meetings!E3=\"\",\"\",getAddress(Meetings!E3))","v":"http://www.tabonline.com.au/2011/03/26/BR02.html"},{"$f":"IF(Meetings!F3=\"\",\"\",getAddress(Meetings!F3))","v":"http://www.tabonline.com.au/2011/03/26/BR03.html"},{"$f":"IF(Meetings!G3=\"\",\"\",getAddress(Meetings!G3))","v":"http://www.tabonline.com.au/2011/03/26/BR04.html"},{"$f":"IF(Meetings!H3=\"\",\"\",getAddress(Meetings!H3))","v":"http://www.tabonline.com.au/2011/03/26/BR05.html"},{"$f":"IF(Meetings!I3=\"\",\"\",getAddress(Meetings!I3))","v":"http://www.tabonline.com.au/2011/03/26/BR06.html"},{"$f":"IF(Meetings!J3=\"\",\"\",getAddress(Meetings!J3))","v":"http://www.tabonline.com.au/2011/03/26/BR07.html"},{"$f":"IF(Meetings!K3=\"\",\"\",getAddress(Meetings!K3))","v":"http://www.tabonline.com.au/2011/03/26/BR08.html"},{"$f":"IF(Meetings!L3=\"\",\"\",getAddress(Meetings!L3))","v":""},{"$f":"IF(Meetings!M3=\"\",\"\",getAddress(Meetings!M3))","v":""},{"$f":"IF(Meetings!N3=\"\",\"\",getAddress(Meetings!N3))","v":""},{"$f":"IF(Meetings!O3=\"\",\"\",getAddress(Meetings!O3))","v":""}]
[{"$f":"IF(Race!N1<>\"\",(CLEAN(TRIM(Race!C1))),\"\")","v":""},{"$f":"IF(A3<>\"\",Race!I1,\"\")","v":""},{"$f":"IF($C$1<>\"\",INDEX(Race!$A$1:$C20,MATCH(\"QN\",Race!$A1:$A$20,0)-4,3),\"\")","v":"CUTE EMILY"},{"$f":"IF(ISNA(VLOOKUP(C3,Race!$C$2:$E$15,2,FALSE)),\"\",(VLOOKUP(C3,Race!$C$2:$E$15,2,FALSE)))","v":4},{"$f":"IF(ISNA(VLOOKUP(C3,Race!$C$2:$E$15,3,FALSE)),\"\",(VLOOKUP(C3,Race!$C$2:$E$15,3,FALSE)))","v":1.4},{"$f":"IF(H3=\"\",\"\",IF(ISERROR(LEFT(G3,FIND(\"(\",G3,1)-1)),\"\",LEFT(G3,FIND(\"(\",G3,1)-1)))","v":"ROSEHILL "},{"$f":"IF(Meetings!B4=\"\",\"\",Meetings!B4)","v":"ROSEHILL (SR)"},{"$f":"IF(Meetings!D4=\"\",\"\",getAddress(Meetings!D4))","v":"http://www.tabonline.com.au/2011/03/26/SR01.html"},{"$f":"IF(Meetings!E4=\"\",\"\",getAddress(Meetings!E4))","v":"http://www.tabonline.com.au/2011/03/26/SR02.html"},{"$f":"IF(Meetings!F4=\"\",\"\",getAddress(Meetings!F4))","v":"http://www.tabonline.com.au/2011/03/26/SR03.html"},{"$f":"IF(Meetings!G4=\"\",\"\",getAddress(Meetings!G4))","v":"http://www.tabonline.com.au/2011/03/26/SR04.html"},{"$f":"IF(Meetings!H4=\"\",\"\",getAddress(Meetings!H4))","v":"http://www.tabonline.com.au/2011/03/26/SR05.html"},{"$f":"IF(Meetings!I4=\"\",\"\",getAddress(Meetings!I4))","v":"http://www.tabonline.com.au/2011/03/26/SR06.html"},{"$f":"IF(Meetings!J4=\"\",\"\",getAddress(Meetings!J4))","v":"http://www.tabonline.com.au/2011/03/26/SR07.html"},{"$f":"IF(Meetings!K4=\"\",\"\",getAddress(Meetings!K4))","v":"http://www.tabonline.com.au/2011/03/26/SR08.html"},{"$f":"IF(Meetings!L4=\"\",\"\",getAddress(Meetings!L4))","v":"http://www.tabonline.com.au/2011/03/26/SR09.html"},{"$f":"IF(Meetings!M4=\"\",\"\",getAddress(Meetings!M4))","v":""},{"$f":"IF(Meetings!N4=\"\",\"\",getAddress(Meetings!N4))","v":""},{"$f":"IF(Meetings!O4=\"\",\"\",getAddress(Meetings!O4))","v":""}]
[{"$f":"IF(Race!N2<>\"\",(CLEAN(TRIM(Race!C2))),\"\")","v":""},{"$f":"IF(A4<>\"\",Race!N2,\"\")","v":""},{"$f":"IF($C$1<>\"\",INDEX(Race!$A$1:$C21,MATCH(\"QN\",Race!$A2:$A$20,0)-2,3),\"\")","v":"KUHREIHEN"},{"$f":"IF(ISNA(VLOOKUP(C4,Race!$C$2:$E$15,2,FALSE)),\"\",(VLOOKUP(C4,Race!$C$2:$E$15,2,FALSE)))","v":0},{"$f":"IF(ISNA(VLOOKUP(C4,Race!$C$2:$E$15,3,FALSE)),\"\",(VLOOKUP(C4,Race!$C$2:$E$15,3,FALSE)))","v":2.5},{"$f":"IF(H4=\"\",\"\",IF(ISERROR(LEFT(G4,FIND(\"(\",G4,1)-1)),\"\",LEFT(G4,FIND(\"(\",G4,1)-1)))","v":"CAULFIELD "},{"$f":"IF(Meetings!B5=\"\",\"\",Meetings!B5)","v":"CAULFIELD (MR)"},{"$f":"IF(Meetings!D5=\"\",\"\",getAddress(Meetings!D5))","v":"http://www.tabonline.com.au/2011/03/26/MR01.html"},{"$f":"IF(Meetings!E5=\"\",\"\",getAddress(Meetings!E5))","v":"http://www.tabonline.com.au/2011/03/26/MR02.html"},{"$f":"IF(Meetings!F5=\"\",\"\",getAddress(Meetings!F5))","v":"http://www.tabonline.com.au/2011/03/26/MR03.html"},{"$f":"IF(Meetings!G5=\"\",\"\",getAddress(Meetings!G5))","v":"http://www.tabonline.com.au/2011/03/26/MR04.html"},{"$f":"IF(Meetings!H5=\"\",\"\",getAddress(Meetings!H5))","v":"http://www.tabonline.com.au/2011/03/26/MR05.html"},{"$f":"IF(Meetings!I5=\"\",\"\",getAddress(Meetings!I5))","v":"http://www.tabonline.com.au/2011/03/26/MR06.html"},{"$f":"IF(Meetings!J5=\"\",\"\",getAddress(Meetings!J5))","v":"http://www.tabonline.com.au/2011/03/26/MR07.html"},{"$f":"IF(Meetings!K5=\"\",\"\",getAddress(Meetings!K5))","v":"http://www.tabonline.com.au/2011/03/26/MR08.html"},{"$f":"IF(Meetings!L5=\"\",\"\",getAddress(Meetings!L5))","v":""},{"$f":"IF(Meetings!M5=\"\",\"\",getAddress(Meetings!M5))","v":""},{"$f":"IF(Meetings!N5=\"\",\"\",getAddress(Meetings!N5))","v":""},{"$f":"IF(Meetings!O5=\"\",\"\",getAddress(Meetings!O5))","v":""}]
[{"$f":"IF(Race!N3<>\"\",(CLEAN(TRIM(Race!C3))),\"\")","v":""},{"$f":"IF(A5<>\"\",Race!N3,\"\")","v":""},{"$f":"IF($C$1<>\"\",INDEX(Race!$A$1:$C22,MATCH(\"QN\",Race!$A3:$A$20,0)-0,3),\"\")","v":"GENERAL OFFER"},{"$f":"IF(ISNA(VLOOKUP(C5,Race!$C$2:$E$15,2,FALSE)),\"\",(VLOOKUP(C5,Race!$C$2:$E$15,2,FALSE)))","v":0},{"$f":"IF(ISNA(VLOOKUP(C5,Race!$C$2:$E$15,3,FALSE)),\"\",(VLOOKUP(C5,Race!$C$2:$E$15,3,FALSE)))","v":1.7},"GOLD COAST ",{"$f":"IF(Meetings!B6=\"\",\"\",Meetings!B6)","v":"GOLD COAST (QR)"},{"$f":"IF(Meetings!D6=\"\",\"\",getAddress(Meetings!D6))","v":"http://www.tabonline.com.au/2011/03/26/QR01.html"},{"$f":"IF(Meetings!E6=\"\",\"\",getAddress(Meetings!E6))","v":"http://www.tabonline.com.au/2011/03/26/QR02.html"},{"$f":"IF(Meetings!F6=\"\",\"\",getAddress(Meetings!F6))","v":"http://www.tabonline.com.au/2011/03/26/QR03.html"},{"$f":"IF(Meetings!G6=\"\",\"\",getAddress(Meetings!G6))","v":"http://www.tabonline.com.au/2011/03/26/QR04.html"},{"$f":"IF(Meetings!H6=\"\",\"\",getAddress(Meetings!H6))","v":"http://www.tabonline.com.au/2011/03/26/QR05.html"},{"$f":"IF(Meetings!I6=\"\",\"\",getAddress(Meetings!I6))","v":"http://www.tabonline.com.au/2011/03/26/QR06.html"},{"$f":"IF(Meetings!J6=\"\",\"\",getAddress(Meetings!J6))","v":"http://www.tabonline.com.au/2011/03/26/QR07.html"},{"$f":"IF(Meetings!K6=\"\",\"\",getAddress(Meetings!K6))","v":"http://www.tabonline.com.au/2011/03/26/QR08.html"},{"$f":"IF(Meetings!L6=\"\",\"\",getAddress(Meetings!L6))","v":""},{"$f":"IF(Meetings!M6=\"\",\"\",getAddress(Meetings!M6))","v":""},{"$f":"IF(Meetings!N6=\"\",\"\",getAddress(Meetings!N6))","v":""},{"$f":"IF(Meetings!O6=\"\",\"\",getAddress(Meetings!O6))","v":""}]
[{"$f":"IF(Race!N4<>\"\",(CLEAN(TRIM(Race!C4))),\"\")","v":""},{"$f":"IF(A6<>\"\",Race!N4,\"\")","v":""},null,null,null,"NEWCASTLE ",{"$f":"IF(Meetings!B7=\"\",\"\",Meetings!B7)","v":"NEWCASTLE (NR)"},{"$f":"IF(Meetings!D7=\"\",\"\",getAddress(Meetings!D7))","v":"http://www.tabonline.com.au/2011/03/26/NR01.html"},{"$f":"IF(Meetings!E7=\"\",\"\",getAddress(Meetings!E7))","v":"http://www.tabonline.com.au/2011/03/26/NR02.html"},{"$f":"IF(Meetings!F7=\"\",\"\",getAddress(Meetings!F7))","v":"http://www.tabonline.com.au/2011/03/26/NR03.html"},{"$f":"IF(Meetings!G7=\"\",\"\",getAddress(Meetings!G7))","v":"http://www.tabonline.com.au/2011/03/26/NR04.html"},{"$f":"IF(Meetings!H7=\"\",\"\",getAddress(Meetings!H7))","v":"http://www.tabonline.com.au/2011/03/26/NR05.html"},{"$f":"IF(Meetings!I7=\"\",\"\",getAddress(Meetings!I7))","v":"http://www.tabonline.com.au/2011/03/26/NR06.html"},{"$f":"IF(Meetings!J7=\"\",\"\",getAddress(Meetings!J7))","v":"http://www.tabonline.com.au/2011/03/26/NR07.html"},{"$f":"IF(Meetings!K7=\"\",\"\",getAddress(Meetings!K7))","v":"http://www.tabonline.com.au/2011/03/26/NR08.html"},{"$f":"IF(Meetings!L7=\"\",\"\",getAddress(Meetings!L7))","v":""},{"$f":"IF(Meetings!M7=\"\",\"\",getAddress(Meetings!M7))","v":""},{"$f":"IF(Meetings!N7=\"\",\"\",getAddress(Meetings!N7))","v":""},{"$f":"IF(Meetings!O7=\"\",\"\",getAddress(Meetings!O7))","v":""}]
[{"$f":"IF(Race!N5<>\"\",(CLEAN(TRIM(Race!C5))),\"\")","v":""},{"$f":"IF(A7<>\"\",Race!N5,\"\")","v":""},{"$f":"IF(A7<>\"\",Race!I5,\"\")","v":""},null,null,"COLAC ",{"$f":"IF(Meetings!B8=\"\",\"\",Meetings!B8)","v":"COLAC (VR)"},{"$f":"IF(Meetings!D8=\"\",\"\",getAddress(Meetings!D8))","v":"http://www.tabonline.com.au/2011/03/26/VR01.html"},{"$f":"IF(Meetings!E8=\"\",\"\",getAddress(Meetings!E8))","v":"http://www.tabonline.com.au/2011/03/26/VR02.html"},{"$f":"IF(Meetings!F8=\"\",\"\",getAddress(Meetings!F8))","v":"http://www.tabonline.com.au/2011/03/26/VR03.html"},{"$f":"IF(Meetings!G8=\"\",\"\",getAddress(Meetings!G8))","v":"http://www.tabonline.com.au/2011/03/26/VR04.html"},{"$f":"IF(Meetings!H8=\"\",\"\",getAddress(Meetings!H8))","v":"http://www.tabonline.com.au/2011/03/26/VR05.html"},{"$f":"IF(Meetings!I8=\"\",\"\",getAddress(Meetings!I8))","v":"http://www.tabonline.com.au/2011/03/26/VR06.html"},{"$f":"IF(Meetings!J8=\"\",\"\",getAddress(Meetings!J8))","v":"http://www.tabonline.com.au/2011/03/26/VR07.html"},{"$f":"IF(Meetings!K8=\"\",\"\",getAddress(Meetings!K8))","v":"http://www.tabonline.com.au/2011/03/26/VR08.html"},{"$f":"IF(Meetings!L8=\"\",\"\",getAddress(Meetings!L8))","v":""},{"$f":"IF(Meetings!M8=\"\",\"\",getAddress(Meetings!M8))","v":""},{"$f":"IF(Meetings!N8=\"\",\"\",getAddress(Meetings!N8))","v":""},{"$f":"IF(Meetings!O8=\"\",\"\",getAddress(Meetings!O8))","v":""}]
[{"$f":"IF(Race!N6<>\"\",(CLEAN(TRIM(Race!C6))),\"\")","v":""},{"$f":"IF(A8<>\"\",Race!N6,\"\")","v":""},{"$f":"IF(A8<>\"\",Race!I6,\"\")","v":""},null,null,"MORPHETTVILLE ",{"$f":"IF(Meetings!B9=\"\",\"\",Meetings!B9)","v":"MORPHETTVILLE (AR)"},{"$f":"IF(Meetings!D9=\"\",\"\",getAddress(Meetings!D9))","v":"http://www.tabonline.com.au/2011/03/26/AR01.html"},{"$f":"IF(Meetings!E9=\"\",\"\",getAddress(Meetings!E9))","v":"http://www.tabonline.com.au/2011/03/26/AR02.html"},{"$f":"IF(Meetings!F9=\"\",\"\",getAddress(Meetings!F9))","v":"http://www.tabonline.com.au/2011/03/26/AR03.html"},{"$f":"IF(Meetings!G9=\"\",\"\",getAddress(Meetings!G9))","v":"http://www.tabonline.com.au/2011/03/26/AR04.html"},{"$f":"IF(Meetings!H9=\"\",\"\",getAddress(Meetings!H9))","v":"http://www.tabonline.com.au/2011/03/26/AR05.html"},{"$f":"IF(Meetings!I9=\"\",\"\",getAddress(Meetings!I9))","v":"http://www.tabonline.com.au/2011/03/26/AR06.html"},{"$f":"IF(Meetings!J9=\"\",\"\",getAddress(Meetings!J9))","v":"http://www.tabonline.com.au/2011/03/26/AR07.html"},{"$f":"IF(Meetings!K9=\"\",\"\",getAddress(Meetings!K9))","v":"http://www.tabonline.com.au/2011/03/26/AR08.html"},{"$f":"IF(Meetings!L9=\"\",\"\",getAddress(Meetings!L9))","v":""},{"$f":"IF(Meetings!M9=\"\",\"\",getAddress(Meetings!M9))","v":""},{"$f":"IF(Meetings!N9=\"\",\"\",getAddress(Meetings!N9))","v":""},{"$f":"IF(Meetings!O9=\"\",\"\",getAddress(Meetings!O9))","v":""}]
[{"$f":"IF(Race!N7<>\"\",(CLEAN(TRIM(Race!C7))),\"\")","v":""},{"$f":"IF(A9<>\"\",Race!N7,\"\")","v":""},{"$f":"IF(A9<>\"\",Race!I7,\"\")","v":""},null,null,"GOULBURN ",{"$f":"IF(Meetings!B10=\"\",\"\",Meetings!B10)","v":"GOULBURN (CR)"},{"$f":"IF(Meetings!D10=\"\",\"\",getAddress(Meetings!D10))","v":"http://www.tabonline.com.au/2011/03/26/CR01.html"},{"$f":"IF(Meetings!E10=\"\",\"\",getAddress(Meetings!E10))","v":"http://www.tabonline.com.au/2011/03/26/CR02.html"},{"$f":"IF(Meetings!F10=\"\",\"\",getAddress(Meetings!F10))","v":"http://www.tabonline.com.au/2011/03/26/CR03.html"},{"$f":"IF(Meetings!G10=\"\",\"\",getAddress(Meetings!G10))","v":"http://www.tabonline.com.au/2011/03/26/CR04.html"},{"$f":"IF(Meetings!H10=\"\",\"\",getAddress(Meetings!H10))","v":"http://www.tabonline.com.au/2011/03/26/CR05.html"},{"$f":"IF(Meetings!I10=\"\",\"\",getAddress(Meetings!I10))","v":"http://www.tabonline.com.au/2011/03/26/CR06.html"},{"$f":"IF(Meetings!J10=\"\",\"\",getAddress(Meetings!J10))","v":""},{"$f":"IF(Meetings!K10=\"\",\"\",getAddress(Meetings!K10))","v":""},{"$f":"IF(Meetings!L10=\"\",\"\",getAddress(Meetings!L10))","v":""},{"$f":"IF(Meetings!M10=\"\",\"\",getAddress(Meetings!M10))","v":""},{"$f":"IF(Meetings!N10=\"\",\"\",getAddress(Meetings!N10))","v":""},{"$f":"IF(Meetings!O10=\"\",\"\",getAddress(Meetings!O10))","v":""}]
[{"$f":"IF(Race!N8<>\"\",(CLEAN(TRIM(Race!C8))),\"\")","v":""},{"$f":"IF(A10<>\"\",Race!N8,\"\")","v":""},{"$f":"IF(A10<>\"\",Race!I8,\"\")","v":""},null,null,"ASCOT ",{"$f":"IF(Meetings!B11=\"\",\"\",Meetings!B11)","v":"ASCOT (PR)"},{"$f":"IF(Meetings!D11=\"\",\"\",getAddress(Meetings!D11))","v":"http://www.tabonline.com.au/2011/03/26/PR01.html"},{"$f":"IF(Meetings!E11=\"\",\"\",getAddress(Meetings!E11))","v":"http://www.tabonline.com.au/2011/03/26/PR02.html"},{"$f":"IF(Meetings!F11=\"\",\"\",getAddress(Meetings!F11))","v":"http://www.tabonline.com.au/2011/03/26/PR03.html"},{"$f":"IF(Meetings!G11=\"\",\"\",getAddress(Meetings!G11))","v":"http://www.tabonline.com.au/2011/03/26/PR04.html"},{"$f":"IF(Meetings!H11=\"\",\"\",getAddress(Meetings!H11))","v":"http://www.tabonline.com.au/2011/03/26/PR05.html"},{"$f":"IF(Meetings!I11=\"\",\"\",getAddress(Meetings!I11))","v":"http://www.tabonline.com.au/2011/03/26/PR06.html"},{"$f":"IF(Meetings!J11=\"\",\"\",getAddress(Meetings!J11))","v":"http://www.tabonline.com.au/2011/03/26/PR07.html"},{"$f":"IF(Meetings!K11=\"\",\"\",getAddress(Meetings!K11))","v":"http://www.tabonline.com.au/2011/03/26/PR08.html"},{"$f":"IF(Meetings!L11=\"\",\"\",getAddress(Meetings!L11))","v":""},{"$f":"IF(Meetings!M11=\"\",\"\",getAddress(Meetings!M11))","v":""},{"$f":"IF(Meetings!N11=\"\",\"\",getAddress(Meetings!N11))","v":""},{"$f":"IF(Meetings!O11=\"\",\"\",getAddress(Meetings!O11))","v":""}]
[{"$f":"IF(Race!N9<>\"\",(CLEAN(TRIM(Race!C9))),\"\")","v":""},{"$f":"IF(A11<>\"\",Race!N9,\"\")","v":""},{"$f":"IF(A11<>\"\",Race!I9,\"\")","v":""},null,null,"TOOWOOMBA ",{"$f":"IF(Meetings!B12=\"\",\"\",Meetings!B12)","v":"TOOWOOMBA (ER)"},{"$f":"IF(Meetings!D12=\"\",\"\",getAddress(Meetings!D12))","v":"http://www.tabonline.com.au/2011/03/26/ER01.html"},{"$f":"IF(Meetings!E12=\"\",\"\",getAddress(Meetings!E12))","v":"http://www.tabonline.com.au/2011/03/26/ER02.html"},{"$f":"IF(Meetings!F12=\"\",\"\",getAddress(Meetings!F12))","v":"http://www.tabonline.com.au/2011/03/26/ER03.html"},{"$f":"IF(Meetings!G12=\"\",\"\",getAddress(Meetings!G12))","v":"http://www.tabonline.com.au/2011/03/26/ER04.html"},{"$f":"IF(Meetings!H12=\"\",\"\",getAddress(Meetings!H12))","v":"http://www.tabonline.com.au/2011/03/26/ER05.html"},{"$f":"IF(Meetings!I12=\"\",\"\",getAddress(Meetings!I12))","v":"http://www.tabonline.com.au/2011/03/26/ER06.html"},{"$f":"IF(Meetings!J12=\"\",\"\",getAddress(Meetings!J12))","v":"http://www.tabonline.com.au/2011/03/26/ER07.html"},{"$f":"IF(Meetings!K12=\"\",\"\",getAddress(Meetings!K12))","v":""},{"$f":"IF(Meetings!L12=\"\",\"\",getAddress(Meetings!L12))","v":""},{"$f":"IF(Meetings!M12=\"\",\"\",getAddress(Meetings!M12))","v":""},{"$f":"IF(Meetings!N12=\"\",\"\",getAddress(Meetings!N12))","v":""},{"$f":"IF(Meetings!O12=\"\",\"\",getAddress(Meetings!O12))","v":""}]
[{"$f":"IF(Race!N10<>\"\",(CLEAN(TRIM(Race!C10))),\"\")","v":""},{"$f":"IF(A12<>\"\",Race!N10,\"\")","v":""},{"$f":"IF(A12<>\"\",Race!I10,\"\")","v":""},null,null,"WELLINGTON ",{"$f":"IF(Meetings!B13=\"\",\"\",Meetings!B13)","v":"WELLINGTON (OR)"},{"$f":"IF(Meetings!D13=\"\",\"\",getAddress(Meetings!D13))","v":"http://www.tabonline.com.au/2011/03/26/OR01.html"},{"$f":"IF(Meetings!E13=\"\",\"\",getAddress(Meetings!E13))","v":"http://www.tabonline.com.au/2011/03/26/OR02.html"},{"$f":"IF(Meetings!F13=\"\",\"\",getAddress(Meetings!F13))","v":"http://www.tabonline.com.au/2011/03/26/OR03.html"},{"$f":"IF(Meetings!G13=\"\",\"\",getAddress(Meetings!G13))","v":"http://www.tabonline.com.au/2011/03/26/OR04.html"},{"$f":"IF(Meetings!H13=\"\",\"\",getAddress(Meetings!H13))","v":"http://www.tabonline.com.au/2011/03/26/OR05.html"},{"$f":"IF(Meetings!I13=\"\",\"\",getAddress(Meetings!I13))","v":"http://www.tabonline.com.au/2011/03/26/OR06.html"},{"$f":"IF(Meetings!J13=\"\",\"\",getAddress(Meetings!J13))","v":"http://www.tabonline.com.au/2011/03/26/OR07.html"},{"$f":"IF(Meetings!K13=\"\",\"\",getAddress(Meetings!K13))","v":""},{"$f":"IF(Meetings!L13=\"\",\"\",getAddress(Meetings!L13))","v":""},{"$f":"IF(Meetings!M13=\"\",\"\",getAddress(Meetings!M13))","v":""},{"$f":"IF(Meetings!N13=\"\",\"\",getAddress(Meetings!N13))","v":""},{"$f":"IF(Meetings!O13=\"\",\"\",getAddress(Meetings!O13))","v":""}]
[{"$f":"IF(Race!N11<>\"\",(CLEAN(TRIM(Race!C11))),\"\")","v":""},{"$f":"IF(A13<>\"\",Race!N11,\"\")","v":""},{"$f":"IF(A13<>\"\",Race!I11,\"\")","v":""},null,null,"EDENHOPE ",{"$f":"IF(Meetings!B14=\"\",\"\",Meetings!B14)","v":"EDENHOPE (ZR)"},{"$f":"IF(Meetings!D14=\"\",\"\",getAddress(Meetings!D14))","v":"http://www.tabonline.com.au/2011/03/26/ZR01.html"},{"$f":"IF(Meetings!E14=\"\",\"\",getAddress(Meetings!E14))","v":"http://www.tabonline.com.au/2011/03/26/ZR02.html"},{"$f":"IF(Meetings!F14=\"\",\"\",getAddress(Meetings!F14))","v":"http://www.tabonline.com.au/2011/03/26/ZR03.html"},{"$f":"IF(Meetings!G14=\"\",\"\",getAddress(Meetings!G14))","v":"http://www.tabonline.com.au/2011/03/26/ZR04.html"},{"$f":"IF(Meetings!H14=\"\",\"\",getAddress(Meetings!H14))","v":"http://www.tabonline.com.au/2011/03/26/ZR05.html"},{"$f":"IF(Meetings!I14=\"\",\"\",getAddress(Meetings!I14))","v":"http://www.tabonline.com.au/2011/03/26/ZR06.html"},{"$f":"IF(Meetings!J14=\"\",\"\",getAddress(Meetings!J14))","v":"http://www.tabonline.com.au/2011/03/26/ZR07.html"},{"$f":"IF(Meetings!K14=\"\",\"\",getAddress(Meetings!K14))","v":""},{"$f":"IF(Meetings!L14=\"\",\"\",getAddress(Meetings!L14))","v":""},{"$f":"IF(Meetings!M14=\"\",\"\",getAddress(Meetings!M14))","v":""},{"$f":"IF(Meetings!N14=\"\",\"\",getAddress(Meetings!N14))","v":""},{"$f":"IF(Meetings!O14=\"\",\"\",getAddress(Meetings!O14))","v":""}]
[{"$f":"IF(Race!N12<>\"\",(CLEAN(TRIM(Race!C12))),\"\")","v":""},{"$f":"IF(A14<>\"\",Race!N12,\"\")","v":""},{"$f":"IF(A14<>\"\",Race!I12,\"\")","v":""},null,null,"ALICE SPRINGS ",{"$f":"IF(Meetings!B15=\"\",\"\",Meetings!B15)","v":"ALICE SPRINGS (DR)"},{"$f":"IF(Meetings!D15=\"\",\"\",getAddress(Meetings!D15))","v":"http://www.tabonline.com.au/2011/03/26/DR01.html"},{"$f":"IF(Meetings!E15=\"\",\"\",getAddress(Meetings!E15))","v":"http://www.tabonline.com.au/2011/03/26/DR02.html"},{"$f":"IF(Meetings!F15=\"\",\"\",getAddress(Meetings!F15))","v":"http://www.tabonline.com.au/2011/03/26/DR03.html"},{"$f":"IF(Meetings!G15=\"\",\"\",getAddress(Meetings!G15))","v":"http://www.tabonline.com.au/2011/03/26/DR04.html"},{"$f":"IF(Meetings!H15=\"\",\"\",getAddress(Meetings!H15))","v":"http://www.tabonline.com.au/2011/03/26/DR05.html"},{"$f":"IF(Meetings!I15=\"\",\"\",getAddress(Meetings!I15))","v":"http://www.tabonline.com.au/2011/03/26/DR06.html"},{"$f":"IF(Meetings!J15=\"\",\"\",getAddress(Meetings!J15))","v":""},{"$f":"IF(Meetings!K15=\"\",\"\",getAddress(Meetings!K15))","v":""},{"$f":"IF(Meetings!L15=\"\",\"\",getAddress(Meetings!L15))","v":""},{"$f":"IF(Meetings!M15=\"\",\"\",getAddress(Meetings!M15))","v":""},{"$f":"IF(Meetings!N15=\"\",\"\",getAddress(Meetings!N15))","v":""},{"$f":"IF(Meetings!O15=\"\",\"\",getAddress(Meetings!O15))","v":""}]
[{"$f":"IF(Race!N13<>\"\",(CLEAN(TRIM(Race!C13))),\"\")","v":""},{"$f":"IF(A15<>\"\",Race!N13,\"\")","v":""},{"$f":"IF(A15<>\"\",Race!I13,\"\")","v":""},null,null,"LINGFIELD ",{"$f":"IF(Meetings!B16=\"\",\"\",Meetings!B16)","v":"LINGFIELD (BS)"},{"$f":"IF(Meetings!D16=\"\",\"\",getAddress(Meetings!D16))","v":"http://www.tabonline.com.au/2011/03/26/BS01.html"},{"$f":"IF(Meetings!E16=\"\",\"\",getAddress(Meetings!E16))","v":"http://www.tabonline.com.au/2011/03/26/BS02.html"},{"$f":"IF(Meetings!F16=\"\",\"\",getAddress(Meetings!F16))","v":"http://www.tabonline.com.au/2011/03/26/BS03.html"},{"$f":"IF(Meetings!G16=\"\",\"\",getAddress(Meetings!G16))","v":"http://www.tabonline.com.au/2011/03/26/BS04.html"},{"$f":"IF(Meetings!H16=\"\",\"\",getAddress(Meetings!H16))","v":""},{"$f":"IF(Meetings!I16=\"\",\"\",getAddress(Meetings!I16))","v":""},{"$f":"IF(Meetings!J16=\"\",\"\",getAddress(Meetings!J16))","v":""},{"$f":"IF(Meetings!K16=\"\",\"\",getAddress(Meetings!K16))","v":""},{"$f":"IF(Meetings!L16=\"\",\"\",getAddress(Meetings!L16))","v":""},{"$f":"IF(Meetings!M16=\"\",\"\",getAddress(Meetings!M16))","v":""},{"$f":"IF(Meetings!N16=\"\",\"\",getAddress(Meetings!N16))","v":""},{"$f":"IF(Meetings!O16=\"\",\"\",getAddress(Meetings!O16))","v":""}]
[{"$f":"IF(Race!N14<>\"\",(CLEAN(TRIM(Race!C14))),\"\")","v":""},{"$f":"IF(A16<>\"\",Race!N14,\"\")","v":""},{"$f":"IF(A16<>\"\",Race!I14,\"\")","v":""},null,null,"RICCARTON ",{"$f":"IF(Meetings!B17=\"\",\"\",Meetings!B17)","v":"RICCARTON (NS)"},{"$f":"IF(Meetings!D17=\"\",\"\",getAddress(Meetings!D17))","v":"http://www.tabonline.com.au/2011/03/26/NS01.html"},{"$f":"IF(Meetings!E17=\"\",\"\",getAddress(Meetings!E17))","v":"http://www.tabonline.com.au/2011/03/26/NS02.html"},{"$f":"IF(Meetings!F17=\"\",\"\",getAddress(Meetings!F17))","v":"http://www.tabonline.com.au/2011/03/26/NS03.html"},{"$f":"IF(Meetings!G17=\"\",\"\",getAddress(Meetings!G17))","v":"http://www.tabonline.com.au/2011/03/26/NS04.html"},{"$f":"IF(Meetings!H17=\"\",\"\",getAddress(Meetings!H17))","v":"http://www.tabonline.com.au/2011/03/26/NS05.html"},{"$f":"IF(Meetings!I17=\"\",\"\",getAddress(Meetings!I17))","v":"http://www.tabonline.com.au/2011/03/26/NS06.html"},{"$f":"IF(Meetings!J17=\"\",\"\",getAddress(Meetings!J17))","v":"http://www.tabonline.com.au/2011/03/26/NS07.html"},{"$f":"IF(Meetings!K17=\"\",\"\",getAddress(Meetings!K17))","v":"http://www.tabonline.com.au/2011/03/26/NS08.html"},{"$f":"IF(Meetings!L17=\"\",\"\",getAddress(Meetings!L17))","v":"http://www.tabonline.com.au/2011/03/26/NS09.html"},{"$f":"IF(Meetings!M17=\"\",\"\",getAddress(Meetings!M17))","v":"http://www.tabonline.com.au/2011/03/26/NS10.html"},{"$f":"IF(Meetings!N17=\"\",\"\",getAddress(Meetings!N17))","v":"http://www.tabonline.com.au/2011/03/26/NS11.html"},{"$f":"IF(Meetings!O17=\"\",\"\",getAddress(Meetings!O17))","v":""}]
[{"$f":"IF(Race!N15<>\"\",(CLEAN(TRIM(Race!C15))),\"\")","v":""},{"$f":"IF(A17<>\"\",Race!N15,\"\")","v":""},{"$f":"IF(A17<>\"\",Race!I15,\"\")","v":""},null,null,"TURFFONTEIN ",{"$f":"IF(Meetings!B18=\"\",\"\",Meetings!B18)","v":"TURFFONTEIN (AS)"},{"$f":"IF(Meetings!D18=\"\",\"\",getAddress(Meetings!D18))","v":"http://www.tabonline.com.au/2011/03/26/AS01.html"},{"$f":"IF(Meetings!E18=\"\",\"\",getAddress(Meetings!E18))","v":"http://www.tabonline.com.au/2011/03/26/AS02.html"},{"$f":"IF(Meetings!F18=\"\",\"\",getAddress(Meetings!F18))","v":"http://www.tabonline.com.au/2011/03/26/AS03.html"},{"$f":"IF(Meetings!G18=\"\",\"\",getAddress(Meetings!G18))","v":"http://www.tabonline.com.au/2011/03/26/AS04.html"},{"$f":"IF(Meetings!H18=\"\",\"\",getAddress(Meetings!H18))","v":"http://www.tabonline.com.au/2011/03/26/AS05.html"},{"$f":"IF(Meetings!I18=\"\",\"\",getAddress(Meetings!I18))","v":"http://www.tabonline.com.au/2011/03/26/AS06.html"},{"$f":"IF(Meetings!J18=\"\",\"\",getAddress(Meetings!J18))","v":"http://www.tabonline.com.au/2011/03/26/AS07.html"},{"$f":"IF(Meetings!K18=\"\",\"\",getAddress(Meetings!K18))","v":"http://www.tabonline.com.au/2011/03/26/AS08.html"},{"$f":"IF(Meetings!L18=\"\",\"\",getAddress(Meetings!L18))","v":""},{"$f":"IF(Meetings!M18=\"\",\"\",getAddress(Meetings!M18))","v":""},{"$f":"IF(Meetings!N18=\"\",\"\",getAddress(Meetings!N18))","v":""},{"$f":"IF(Meetings!O18=\"\",\"\",getAddress(Meetings!O18))","v":""}]
[{"$f":"IF(Race!N16<>\"\",(CLEAN(TRIM(Race!C16))),\"\")","v":"Name"},{"$f":"IF(A18<>\"\",Race!N16,\"\")","v":"Rtng"},{"$f":"IF(A18<>\"\",Race!I16,\"\")","v":"Bar"},null,null,"KEMPTON PARK ",{"$f":"IF(Meetings!B19=\"\",\"\",Meetings!B19)","v":"KEMPTON PARK (CS)"},{"$f":"IF(Meetings!D19=\"\",\"\",getAddress(Meetings!D19))","v":"http://www.tabonline.com.au/2011/03/26/CS01.html"},{"$f":"IF(Meetings!E19=\"\",\"\",getAddress(Meetings!E19))","v":"http://www.tabonline.com.au/2011/03/26/CS02.html"},{"$f":"IF(Meetings!F19=\"\",\"\",getAddress(Meetings!F19))","v":"http://www.tabonline.com.au/2011/03/26/CS03.html"},{"$f":"IF(Meetings!G19=\"\",\"\",getAddress(Meetings!G19))","v":""},{"$f":"IF(Meetings!H19=\"\",\"\",getAddress(Meetings!H19))","v":""},{"$f":"IF(Meetings!I19=\"\",\"\",getAddress(Meetings!I19))","v":""},{"$f":"IF(Meetings!J19=\"\",\"\",getAddress(Meetings!J19))","v":""},{"$f":"IF(Meetings!K19=\"\",\"\",getAddress(Meetings!K19))","v":""},{"$f":"IF(Meetings!L19=\"\",\"\",getAddress(Meetings!L19))","v":""},{"$f":"IF(Meetings!M19=\"\",\"\",getAddress(Meetings!M19))","v":""},{"$f":"IF(Meetings!N19=\"\",\"\",getAddress(Meetings!N19))","v":""},{"$f":"IF(Meetings!O19=\"\",\"\",getAddress(Meetings!O19))","v":""}]
[{"$f":"IF(Race!N17<>\"\",(CLEAN(TRIM(Race!C17))),\"\")","v":"ROCKSHAFT"},{"$f":"IF(A19<>\"\",Race!N17,\"\")","v":96},{"$f":"IF(A19<>\"\",Race!I17,\"\")","v":8},null,null,"TAURANGA ",{"$f":"IF(Meetings!B20=\"\",\"\",Meetings!B20)","v":"TAURANGA (ZS)"},{"$f":"IF(Meetings!D20=\"\",\"\",getAddress(Meetings!D20))","v":"http://www.tabonline.com.au/2011/03/26/ZS01.html"},{"$f":"IF(Meetings!E20=\"\",\"\",getAddress(Meetings!E20))","v":"http://www.tabonline.com.au/2011/03/26/ZS02.html"},{"$f":"IF(Meetings!F20=\"\",\"\",getAddress(Meetings!F20))","v":"http://www.tabonline.com.au/2011/03/26/ZS03.html"},{"$f":"IF(Meetings!G20=\"\",\"\",getAddress(Meetings!G20))","v":"http://www.tabonline.com.au/2011/03/26/ZS04.html"},{"$f":"IF(Meetings!H20=\"\",\"\",getAddress(Meetings!H20))","v":"http://www.tabonline.com.au/2011/03/26/ZS05.html"},{"$f":"IF(Meetings!I20=\"\",\"\",getAddress(Meetings!I20))","v":"http://www.tabonline.com.au/2011/03/26/ZS06.html"},{"$f":"IF(Meetings!J20=\"\",\"\",getAddress(Meetings!J20))","v":"http://www.tabonline.com.au/2011/03/26/ZS07.html"},{"$f":"IF(Meetings!K20=\"\",\"\",getAddress(Meetings!K20))","v":"http://www.tabonline.com.au/2011/03/26/ZS08.html"},{"$f":"IF(Meetings!L20=\"\",\"\",getAddress(Meetings!L20))","v":"http://www.tabonline.com.au/2011/03/26/ZS09.html"},{"$f":"IF(Meetings!M20=\"\",\"\",getAddress(Meetings!M20))","v":"http://www.tabonline.com.au/2011/03/26/ZS10.html"},{"$f":"IF(Meetings!N20=\"\",\"\",getAddress(Meetings!N20))","v":""},{"$f":"IF(Meetings!O20=\"\",\"\",getAddress(Meetings!O20))","v":""}]
[{"$f":"IF(Race!N18<>\"\",(CLEAN(TRIM(Race!C18))),\"\")","v":""},{"$f":"IF(A20<>\"\",Race!N18,\"\")","v":""},{"$f":"IF(A20<>\"\",Race!I18,\"\")","v":""},null,null,"",{"$f":"IF(Meetings!B21=\"\",\"\",Meetings!B21)","v":"DUBAI (DS)"},{"$f":"IF(Meetings!D21=\"\",\"\",getAddress(Meetings!D21))","v":""},{"$f":"IF(Meetings!E21=\"\",\"\",getAddress(Meetings!E21))","v":"http://www.tabonline.com.au/2011/03/26/DS02.html"},{"$f":"IF(Meetings!F21=\"\",\"\",getAddress(Meetings!F21))","v":"http://www.tabonline.com.au/2011/03/26/DS03.html"},{"$f":"IF(Meetings!G21=\"\",\"\",getAddress(Meetings!G21))","v":"http://www.tabonline.com.au/2011/03/26/DS04.html"},{"$f":"IF(Meetings!H21=\"\",\"\",getAddress(Meetings!H21))","v":"http://www.tabonline.com.au/2011/03/26/DS05.html"},{"$f":"IF(Meetings!I21=\"\",\"\",getAddress(Meetings!I21))","v":"http://www.tabonline.com.au/2011/03/26/DS06.html"},{"$f":"IF(Meetings!J21=\"\",\"\",getAddress(Meetings!J21))","v":""},{"$f":"IF(Meetings!K21=\"\",\"\",getAddress(Meetings!K21))","v":""},{"$f":"IF(Meetings!L21=\"\",\"\",getAddress(Meetings!L21))","v":""},{"$f":"IF(Meetings!M21=\"\",\"\",getAddress(Meetings!M21))","v":""},{"$f":"IF(Meetings!N21=\"\",\"\",getAddress(Meetings!N21))","v":""},{"$f":"IF(Meetings!O21=\"\",\"\",getAddress(Meetings!O21))","v":""}]
[{"$f":"IF(Race!N19<>\"\",(CLEAN(TRIM(Race!C19))),\"\")","v":"GENERAL OFFER"},{"$f":"IF(A21<>\"\",Race!N19,\"\")","v":91},{"$f":"IF(A21<>\"\",Race!I19,\"\")","v":11},null,null,{"$error":"#VALUE!"},{"$f":"IF(Meetings!B22=\"\",\"\",Meetings!B22)","v":""},{"$f":"IF(Meetings!D22=\"\",\"\",getAddress(Meetings!D22))","v":{"$error":"#VALUE!"}},{"$f":"IF(Meetings!E22=\"\",\"\",getAddress(Meetings!E22))","v":{"$error":"#VALUE!"}},{"$f":"IF(Meetings!F22=\"\",\"\",getAddress(Meetings!F22))","v":{"$error":"#VALUE!"}},{"$f":"IF(Meetings!G22=\"\",\"\",getAddress(Meetings!G22))","v":{"$error":"#VALUE!"}},{"$f":"IF(Meetings!H22=\"\",\"\",getAddress(Meetings!H22))","v":{"$error":"#VALUE!"}},{"$f":"IF(Meetings!I22=\"\",\"\",getAddress(Meetings!I22))","v":{"$error":"#VALUE!"}},{"$f":"IF(Meetings!J22=\"\",\"\",getAddress(Meetings!J22))","v":{"$error":"#VALUE!"}},{"$f":"IF(Meetings!K22=\"\",\"\",getAddress(Meetings!K22))","v":{"$error":"#VALUE!"}},{"$f":"IF(Meetings!L22=\"\",\"\",getAddress(Meetings!L22))","v":{"$error":"#VALUE!"}},{"$f":"IF(Meetings!M22=\"\",\"\",getAddress(Meetings!M22))","v":{"$error":"#VALUE!"}},{"$f":"IF(Meetings!N22=\"\",\"\",getAddress(Meetings!N22))","v":{"$error":"#VALUE!"}},{"$f":"IF(Meetings!O22=\"\",\"\",getAddress(Meetings!O22))","v":{"$error":"#VALUE!"}}]
[{"$f":"IF(Race!N20<>\"\",(CLEAN(TRIM(Race!C20))),\"\")","v":"KING'S SHILLING"},{"$f":"IF(A22<>\"\",Race!N20,\"\")","v":64},{"$f":"IF(A22<>\"\",Race!I20,\"\")","v":2},null,null,"ALBION PARK ",{"$f":"IF(Meetings!B23=\"\",\"\",Meetings!B23)","v":"ALBION PARK (BT)"},{"$f":"IF(Meetings!D23=\"\",\"\",getAddress(Meetings!D23))","v":"http://www.tabonline.com.au/2011/03/26/BT01.html"},{"$f":"IF(Meetings!E23=\"\",\"\",getAddress(Meetings!E23))","v":"http://www.tabonline.com.au/2011/03/26/BT02.html"},{"$f":"IF(Meetings!F23=\"\",\"\",getAddress(Meetings!F23))","v":"http://www.tabonline.com.au/2011/03/26/BT03.html"},{"$f":"IF(Meetings!G23=\"\",\"\",getAddress(Meetings!G23))","v":"http://www.tabonline.com.au/2011/03/26/BT04.html"},{"$f":"IF(Meetings!H23=\"\",\"\",getAddress(Meetings!H23))","v":"http://www.tabonline.com.au/2011/03/26/BT05.html"},{"$f":"IF(Meetings!I23=\"\",\"\",getAddress(Meetings!I23))","v":"http://www.tabonline.com.au/2011/03/26/BT06.html"},{"$f":"IF(Meetings!J23=\"\",\"\",getAddress(Meetings!J23))","v":"http://www.tabonline.com.au/2011/03/26/BT07.html"},{"$f":"IF(Meetings!K23=\"\",\"\",getAddress(Meetings!K23))","v":"http://www.tabonline.com.au/2011/03/26/BT08.html"},{"$f":"IF(Meetings!L23=\"\",\"\",getAddress(Meetings!L23))","v":""},{"$f":"IF(Meetings!M23=\"\",\"\",getAddress(Meetings!M23))","v":""},{"$f":"IF(Meetings!N23=\"\",\"\",getAddress(Meetings!N23))","v":""},{"$f":"IF(Meetings!O23=\"\",\"\",getAddress(Meetings!O23))","v":""}]
[{"$f":"IF(Race!N21<>\"\",(CLEAN(TRIM(Race!C21))),\"\")","v":"KUHREIHEN"},{"$f":"IF(A23<>\"\",Race!N21,\"\")","v":84},{"$f":"IF(A23<>\"\",Race!I21,\"\")","v":6},null,null,"BATHURST ",{"$f":"IF(Meetings!B24=\"\",\"\",Meetings!B24)","v":"BATHURST (ST)"},{"$f":"IF(Meetings!D24=\"\",\"\",getAddress(Meetings!D24))","v":"http://www.tabonline.com.au/2011/03/26/ST01.html"},{"$f":"IF(Meetings!E24=\"\",\"\",getAddress(Meetings!E24))","v":"http://www.tabonline.com.au/2011/03/26/ST02.html"},{"$f":"IF(Meetings!F24=\"\",\"\",getAddress(Meetings!F24))","v":"http://www.tabonline.com.au/2011/03/26/ST03.html"},{"$f":"IF(Meetings!G24=\"\",\"\",getAddress(Meetings!G24))","v":"http://www.tabonline.com.au/2011/03/26/ST04.html"},{"$f":"IF(Meetings!H24=\"\",\"\",getAddress(Meetings!H24))","v":"http://www.tabonline.com.au/2011/03/26/ST05.html"},{"$f":"IF(Meetings!I24=\"\",\"\",getAddress(Meetings!I24))","v":"http://www.tabonline.com.au/2011/03/26/ST06.html"},{"$f":"IF(Meetings!J24=\"\",\"\",getAddress(Meetings!J24))","v":"http://www.tabonline.com.au/2011/03/26/ST07.html"},{"$f":"IF(Meetings!K24=\"\",\"\",getAddress(Meetings!K24))","v":"http://www.tabonline.com.au/2011/03/26/ST08.html"},{"$f":"IF(Meetings!L24=\"\",\"\",getAddress(Meetings!L24))","v":"http://www.tabonline.com.au/2011/03/26/ST09.html"},{"$f":"IF(Meetings!M24=\"\",\"\",getAddress(Meetings!M24))","v":"http://www.tabonline.com.au/2011/03/26/ST10.html"},{"$f":"IF(Meetings!N24=\"\",\"\",getAddress(Meetings!N24))","v":""},{"$f":"IF(Meetings!O24=\"\",\"\",getAddress(Meetings!O24))","v":""}]
[{"$f":"IF(Race!N22<>\"\",(CLEAN(TRIM(Race!C22))),\"\")","v":"RIVER OF GLORY"},{"$f":"IF(A24<>\"\",Race!N22,\"\")","v":64},{"$f":"IF(A24<>\"\",Race!I22,\"\")","v":1},null,null,"KILMORE ",{"$f":"IF(Meetings!B25=\"\",\"\",Meetings!B25)","v":"KILMORE (MT)"},{"$f":"IF(Meetings!D25=\"\",\"\",getAddress(Meetings!D25))","v":"http://www.tabonline.com.au/2011/03/26/MT01.html"},{"$f":"IF(Meetings!E25=\"\",\"\",getAddress(Meetings!E25))","v":"http://www.tabonline.com.au/2011/03/26/MT02.html"},{"$f":"IF(Meetings!F25=\"\",\"\",getAddress(Meetings!F25))","v":"http://www.tabonline.com.au/2011/03/26/MT03.html"},{"$f":"IF(Meetings!G25=\"\",\"\",getAddress(Meetings!G25))","v":"http://www.tabonline.com.au/2011/03/26/MT04.html"},{"$f":"IF(Meetings!H25=\"\",\"\",getAddress(Meetings!H25))","v":"http://www.tabonline.com.au/2011/03/26/MT05.html"},{"$f":"IF(Meetings!I25=\"\",\"\",getAddress(Meetings!I25))","v":"http://www.tabonline.com.au/2011/03/26/MT06.html"},{"$f":"IF(Meetings!J25=\"\",\"\",getAddress(Meetings!J25))","v":"http://www.tabonline.com.au/2011/03/26/MT07.html"},{"$f":"IF(Meetings!K25=\"\",\"\",getAddress(Meetings!K25))","v":"http://www.tabonline.com.au/2011/03/26/MT08.html"},{"$f":"IF(Meetings!L25=\"\",\"\",getAddress(Meetings!L25))","v":""},{"$f":"IF(Meetings!M25=\"\",\"\",getAddress(Meetings!M25))","v":""},{"$f":"IF(Meetings!N25=\"\",\"\",getAddress(Meetings!N25))","v":""},{"$f":"IF(Meetings!O25=\"\",\"\",getAddress(Meetings!O25))","v":""}]
[{"$f":"IF(Race!N23<>\"\",(CLEAN(TRIM(Race!C23))),\"\")","v":""},{"$f":"IF(A25<>\"\",Race!N23,\"\")","v":""},{"$f":"IF(A25<>\"\",Race!I23,\"\")","v":""},null,null,"GLOBE DERBY ",{"$f":"IF(Meetings!B26=\"\",\"\",Meetings!B26)","v":"GLOBE DERBY (AT)"},{"$f":"IF(Meetings!D26=\"\",\"\",getAddress(Meetings!D26))","v":"http://www.tabonline.com.au/2011/03/26/AT01.html"},{"$f":"IF(Meetings!E26=\"\",\"\",getAddress(Meetings!E26))","v":"http://www.tabonline.com.au/2011/03/26/AT02.html"},{"$f":"IF(Meetings!F26=\"\",\"\",getAddress(Meetings!F26))","v":"http://www.tabonline.com.au/2011/03/26/AT03.html"},{"$f":"IF(Meetings!G26=\"\",\"\",getAddress(Meetings!G26))","v":"http://www.tabonline.com.au/2011/03/26/AT04.html"},{"$f":"IF(Meetings!H26=\"\",\"\",getAddress(Meetings!H26))","v":"http://www.tabonline.com.au/2011/03/26/AT05.html"},{"$f":"IF(Meetings!I26=\"\",\"\",getAddress(Meetings!I26))","v":"http://www.tabonline.com.au/2011/03/26/AT06.html"},{"$f":"IF(Meetings!J26=\"\",\"\",getAddress(Meetings!J26))","v":"http://www.tabonline.com.au/2011/03/26/AT07.html"},{"$f":"IF(Meetings!K26=\"\",\"\",getAddress(Meetings!K26))","v":"http://www.tabonline.com.au/2011/03/26/AT08.html"},{"$f":"IF(Meetings!L26=\"\",\"\",getAddress(Meetings!L26))","v":""},{"$f":"IF(Meetings!M26=\"\",\"\",getAddress(Meetings!M26))","v":""},{"$f":"IF(Meetings!N26=\"\",\"\",getAddress(Meetings!N26))","v":""},{"$f":"IF(Meetings!O26=\"\",\"\",getAddress(Meetings!O26))","v":""}]
[{"$f":"IF(Race!N24<>\"\",(CLEAN(TRIM(Race!C24))),\"\")","v":"RICCARDO THE GREAT"},{"$f":"IF(A26<>\"\",Race!N24,\"\")","v":85},{"$f":"IF(A26<>\"\",Race!I24,\"\")","v":5},null,null,"GLOUCESTER PARK ",{"$f":"IF(Meetings!B27=\"\",\"\",Meetings!B27)","v":"GLOUCESTER PARK (PT)"},{"$f":"IF(Meetings!D27=\"\",\"\",getAddress(Meetings!D27))","v":"http://www.tabonline.com.au/2011/03/26/PT01.html"},{"$f":"IF(Meetings!E27=\"\",\"\",getAddress(Meetings!E27))","v":"http://www.tabonline.com.au/2011/03/26/PT02.html"},{"$f":"IF(Meetings!F27=\"\",\"\",getAddress(Meetings!F27))","v":"http://www.tabonline.com.au/2011/03/26/PT03.html"},{"$f":"IF(Meetings!G27=\"\",\"\",getAddress(Meetings!G27))","v":"http://www.tabonline.com.au/2011/03/26/PT04.html"},{"$f":"IF(Meetings!H27=\"\",\"\",getAddress(Meetings!H27))","v":"http://www.tabonline.com.au/2011/03/26/PT05.html"},{"$f":"IF(Meetings!I27=\"\",\"\",getAddress(Meetings!I27))","v":"http://www.tabonline.com.au/2011/03/26/PT06.html"},{"$f":"IF(Meetings!J27=\"\",\"\",getAddress(Meetings!J27))","v":"http://www.tabonline.com.au/2011/03/26/PT07.html"},{"$f":"IF(Meetings!K27=\"\",\"\",getAddress(Meetings!K27))","v":"http://www.tabonline.com.au/2011/03/26/PT08.html"},{"$f":"IF(Meetings!L27=\"\",\"\",getAddress(Meetings!L27))","v":""},{"$f":"IF(Meetings!M27=\"\",\"\",getAddress(Meetings!M27))","v":""},{"$f":"IF(Meetings!N27=\"\",\"\",getAddress(Meetings!N27))","v":""},{"$f":"IF(Meetings!O27=\"\",\"\",getAddress(Meetings!O27))","v":""}]
[{"$f":"IF(Race!N25<>\"\",(CLEAN(TRIM(Race!C25))),\"\")","v":"CUTE EMILY"},{"$f":"IF(A27<>\"\",Race!N25,\"\")","v":88},{"$f":"IF(A27<>\"\",Race!I25,\"\")","v":12},null,null,"ASCOT PARK ",{"$f":"IF(Meetings!B28=\"\",\"\",Meetings!B28)","v":"ASCOT PARK (ZT)"},{"$f":"IF(Meetings!D28=\"\",\"\",getAddress(Meetings!D28))","v":"http://www.tabonline.com.au/2011/03/26/ZT01.html"},{"$f":"IF(Meetings!E28=\"\",\"\",getAddress(Meetings!E28))","v":"http://www.tabonline.com.au/2011/03/26/ZT02.html"},{"$f":"IF(Meetings!F28=\"\",\"\",getAddress(Meetings!F28))","v":"http://www.tabonline.com.au/2011/03/26/ZT03.html"},{"$f":"IF(Meetings!G28=\"\",\"\",getAddress(Meetings!G28))","v":"http://www.tabonline.com.au/2011/03/26/ZT04.html"},{"$f":"IF(Meetings!H28=\"\",\"\",getAddress(Meetings!H28))","v":"http://www.tabonline.com.au/2011/03/26/ZT05.html"},{"$f":"IF(Meetings!I28=\"\",\"\",getAddress(Meetings!I28))","v":"http://www.tabonline.com.au/2011/03/26/ZT06.html"},{"$f":"IF(Meetings!J28=\"\",\"\",getAddress(Meetings!J28))","v":"http://www.tabonline.com.au/2011/03/26/ZT07.html"},{"$f":"IF(Meetings!K28=\"\",\"\",getAddress(Meetings!K28))","v":"http://www.tabonline.com.au/2011/03/26/ZT08.html"},{"$f":"IF(Meetings!L28=\"\",\"\",getAddress(Meetings!L28))","v":"http://www.tabonline.com.au/2011/03/26/ZT09.html"},{"$f":"IF(Meetings!M28=\"\",\"\",getAddress(Meetings!M28))","v":"http://www.tabonline.com.au/2011/03/26/ZT10.html"},{"$f":"IF(Meetings!N28=\"\",\"\",getAddress(Meetings!N28))","v":""},{"$f":"IF(Meetings!O28=\"\",\"\",getAddress(Meetings!O28))","v":""}]
[{"$f":"IF(Race!N26<>\"\",(CLEAN(TRIM(Race!C26))),\"\")","v":""},{"$f":"IF(A28<>\"\",Race!N26,\"\")","v":""},{"$f":"IF(A28<>\"\",Race!I26,\"\")","v":""},null,null,{"$error":"#VALUE!"},{"$f":"IF(Meetings!B29=\"\",\"\",Meetings!B29)","v":""},{"$f":"IF(Meetings!D29=\"\",\"\",getAddress(Meetings!D29))","v":{"$error":"#VALUE!"}},{"$f":"IF(Meetings!E29=\"\",\"\",getAddress(Meetings!E29))","v":{"$error":"#VALUE!"}},{"$f":"IF(Meetings!F29=\"\",\"\",getAddress(Meetings!F29))","v":{"$error":"#VALUE!"}},{"$f":"IF(Meetings!G29=\"\",\"\",getAddress(Meetings!G29))","v":{"$error":"#VALUE!"}},{"$f":"IF(Meetings!H29=\"\",\"\",getAddress(Meetings!H29))","v":{"$error":"#VALUE!"}},{"$f":"IF(Meetings!I29=\"\",\"\",getAddress(Meetings!I29))","v":{"$error":"#VALUE!"}},{"$f":"IF(Meetings!J29=\"\",\"\",getAddress(Meetings!J29))","v":{"$error":"#VALUE!"}},{"$f":"IF(Meetings!K29=\"\",\"\",getAddress(Meetings!K29))","v":{"$error":"#VALUE!"}},{"$f":"IF(Meetings!L29=\"\",\"\",getAddress(Meetings!L29))","v":{"$error":"#VALUE!"}},{"$f":"IF(Meetings!M29=\"\",\"\",getAddress(Meetings!M29))","v":{"$error":"#VALUE!"}},{"$f":"IF(Meetings!N29=\"\",\"\",getAddress(Meetings!N29))","v":{"$error":"#VALUE!"}},{"$f":"IF(Meetings!O29=\"\",\"\",getAddress(Meetings!O29))","v":{"$error":"#VALUE!"}}]
[{"$f":"IF(Race!N27<>\"\",(CLEAN(TRIM(Race!C27))),\"\")","v":"ALANZA"},{"$f":"IF(A29<>\"\",Race!N27,\"\")","v":79},{"$f":"IF(A29<>\"\",Race!I27,\"\")","v":7},null,null,"WENTWORTH PARK ",{"$f":"IF(Meetings!B30=\"\",\"\",Meetings!B30)","v":"WENTWORTH PARK (SG)"},{"$f":"IF(Meetings!D30=\"\",\"\",getAddress(Meetings!D30))","v":"http://www.tabonline.com.au/2011/03/26/SG01.html"},{"$f":"IF(Meetings!E30=\"\",\"\",getAddress(Meetings!E30))","v":"http://www.tabonline.com.au/2011/03/26/SG02.html"},{"$f":"IF(Meetings!F30=\"\",\"\",getAddress(Meetings!F30))","v":"http://www.tabonline.com.au/2011/03/26/SG03.html"},{"$f":"IF(Meetings!G30=\"\",\"\",getAddress(Meetings!G30))","v":"http://www.tabonline.com.au/2011/03/26/SG04.html"},{"$f":"IF(Meetings!H30=\"\",\"\",getAddress(Meetings!H30))","v":"http://www.tabonline.com.au/2011/03/26/SG05.html"},{"$f":"IF(Meetings!I30=\"\",\"\",getAddress(Meetings!I30))","v":"http://www.tabonline.com.au/2011/03/26/SG06.html"},{"$f":"IF(Meetings!J30=\"\",\"\",getAddress(Meetings!J30))","v":"http://www.tabonline.com.au/2011/03/26/SG07.html"},{"$f":"IF(Meetings!K30=\"\",\"\",getAddress(Meetings!K30))","v":"http://www.tabonline.com.au/2011/03/26/SG08.html"},{"$f":"IF(Meetings!L30=\"\",\"\",getAddress(Meetings!L30))","v":"http://www.tabonline.com.au/2011/03/26/SG09.html"},{"$f":"IF(Meetings!M30=\"\",\"\",getAddress(Meetings!M30))","v":"http://www.tabonline.com.au/2011/03/26/SG10.html"},{"$f":"IF(Meetings!N30=\"\",\"\",getAddress(Meetings!N30))","v":""},{"$f":"IF(Meetings!O30=\"\",\"\",getAddress(Meetings!O30))","v":""}]
[{"$f":"IF(Race!N28<>\"\",(CLEAN(TRIM(Race!C28))),\"\")","v":"TIGRESSIVE"},{"$f":"IF(A30<>\"\",Race!N28,\"\")","v":79},{"$f":"IF(A30<>\"\",Race!I28,\"\")","v":10},null,null,"THE MEADOWS ",{"$f":"IF(Meetings!B31=\"\",\"\",Meetings!B31)","v":"THE MEADOWS (MG)"},{"$f":"IF(Meetings!D31=\"\",\"\",getAddress(Meetings!D31))","v":"http://www.tabonline.com.au/2011/03/26/MG01.html"},{"$f":"IF(Meetings!E31=\"\",\"\",getAddress(Meetings!E31))","v":"http://www.tabonline.com.au/2011/03/26/MG02.html"},{"$f":"IF(Meetings!F31=\"\",\"\",getAddress(Meetings!F31))","v":"http://www.tabonline.com.au/2011/03/26/MG03.html"},{"$f":"IF(Meetings!G31=\"\",\"\",getAddress(Meetings!G31))","v":"http://www.tabonline.com.au/2011/03/26/MG04.html"},{"$f":"IF(Meetings!H31=\"\",\"\",getAddress(Meetings!H31))","v":"http://www.tabonline.com.au/2011/03/26/MG05.html"},{"$f":"IF(Meetings!I31=\"\",\"\",getAddress(Meetings!I31))","v":"http://www.tabonline.com.au/2011/03/26/MG06.html"},{"$f":"IF(Meetings!J31=\"\",\"\",getAddress(Meetings!J31))","v":"http://www.tabonline.com.au/2011/03/26/MG07.html"},{"$f":"IF(Meetings!K31=\"\",\"\",getAddress(Meetings!K31))","v":"http://www.tabonline.com.au/2011/03/26/MG08.html"},{"$f":"IF(Meetings!L31=\"\",\"\",getAddress(Meetings!L31))","v":"http://www.tabonline.com.au/2011/03/26/MG09.html"},{"$f":"IF(Meetings!M31=\"\",\"\",getAddress(Meetings!M31))","v":"http://www.tabonline.com.au/2011/03/26/MG10.html"},{"$f":"IF(Meetings!N31=\"\",\"\",getAddress(Meetings!N31))","v":"http://www.tabonline.com.au/2011/03/26/MG11.html"},{"$f":"IF(Meetings!O31=\"\",\"\",getAddress(Meetings!O31))","v":""}]
[{"$f":"IF(Race!N29<>\"\",(CLEAN(TRIM(Race!C29))),\"\")","v":""},{"$f":"IF(A31<>\"\",Race!N29,\"\")","v":""},{"$f":"IF(A31<>\"\",Race!I29,\"\")","v":""},null,null,"RICHMOND ",{"$f":"IF(Meetings!B32=\"\",\"\",Meetings!B32)","v":"RICHMOND (NG)"},{"$f":"IF(Meetings!D32=\"\",\"\",getAddress(Meetings!D32))","v":"http://www.tabonline.com.au/2011/03/26/NG01.html"},{"$f":"IF(Meetings!E32=\"\",\"\",getAddress(Meetings!E32))","v":"http://www.tabonline.com.au/2011/03/26/NG02.html"},{"$f":"IF(Meetings!F32=\"\",\"\",getAddress(Meetings!F32))","v":"http://www.tabonline.com.au/2011/03/26/NG03.html"},{"$f":"IF(Meetings!G32=\"\",\"\",getAddress(Meetings!G32))","v":"http://www.tabonline.com.au/2011/03/26/NG04.html"},{"$f":"IF(Meetings!H32=\"\",\"\",getAddress(Meetings!H32))","v":"http://www.tabonline.com.au/2011/03/26/NG05.html"},{"$f":"IF(Meetings!I32=\"\",\"\",getAddress(Meetings!I32))","v":"http://www.tabonline.com.au/2011/03/26/NG06.html"},{"$f":"IF(Meetings!J32=\"\",\"\",getAddress(Meetings!J32))","v":"http://www.tabonline.com.au/2011/03/26/NG07.html"},{"$f":"IF(Meetings!K32=\"\",\"\",getAddress(Meetings!K32))","v":"http://www.tabonline.com.au/2011/03/26/NG08.html"},{"$f":"IF(Meetings!L32=\"\",\"\",getAddress(Meetings!L32))","v":"http://www.tabonline.com.au/2011/03/26/NG09.html"},{"$f":"IF(Meetings!M32=\"\",\"\",getAddress(Meetings!M32))","v":"http://www.tabonline.com.au/2011/03/26/NG10.html"},{"$f":"IF(Meetings!N32=\"\",\"\",getAddress(Meetings!N32))","v":""},{"$f":"IF(Meetings!O32=\"\",\"\",getAddress(Meetings!O32))","v":""}]
[{"$f":"IF(Race!N30<>\"\",(CLEAN(TRIM(Race!C30))),\"\")","v":""},{"$f":"IF(A32<>\"\",Race!N30,\"\")","v":""},{"$f":"IF(A32<>\"\",Race!I30,\"\")","v":""},null,null,"WARRNAMBOOL ",{"$f":"IF(Meetings!B33=\"\",\"\",Meetings!B33)","v":"WARRNAMBOOL (VG)"},{"$f":"IF(Meetings!D33=\"\",\"\",getAddress(Meetings!D33))","v":"http://www.tabonline.com.au/2011/03/26/VG01.html"},{"$f":"IF(Meetings!E33=\"\",\"\",getAddress(Meetings!E33))","v":"http://www.tabonline.com.au/2011/03/26/VG02.html"},{"$f":"IF(Meetings!F33=\"\",\"\",getAddress(Meetings!F33))","v":"http://www.tabonline.com.au/2011/03/26/VG03.html"},{"$f":"IF(Meetings!G33=\"\",\"\",getAddress(Meetings!G33))","v":"http://www.tabonline.com.au/2011/03/26/VG04.html"},{"$f":"IF(Meetings!H33=\"\",\"\",getAddress(Meetings!H33))","v":"http://www.tabonline.com.au/2011/03/26/VG05.html"},{"$f":"IF(Meetings!I33=\"\",\"\",getAddress(Meetings!I33))","v":"http://www.tabonline.com.au/2011/03/26/VG06.html"},{"$f":"IF(Meetings!J33=\"\",\"\",getAddress(Meetings!J33))","v":"http://www.tabonline.com.au/2011/03/26/VG07.html"},{"$f":"IF(Meetings!K33=\"\",\"\",getAddress(Meetings!K33))","v":"http://www.tabonline.com.au/2011/03/26/VG08.html"},{"$f":"IF(Meetings!L33=\"\",\"\",getAddress(Meetings!L33))","v":"http://www.tabonline.com.au/2011/03/26/VG09.html"},{"$f":"IF(Meetings!M33=\"\",\"\",getAddress(Meetings!M33))","v":"http://www.tabonline.com.au/2011/03/26/VG10.html"},{"$f":"IF(Meetings!N33=\"\",\"\",getAddress(Meetings!N33))","v":"http://www.tabonline.com.au/2011/03/26/VG11.html"},{"$f":"IF(Meetings!O33=\"\",\"\",getAddress(Meetings!O33))","v":"http://www.tabonline.com.au/2011/03/26/VG12.html"}]
[{"$f":"IF(Race!N31<>\"\",(CLEAN(TRIM(Race!C31))),\"\")","v":""},{"$f":"IF(A33<>\"\",Race!N31,\"\")","v":""},{"$f":"IF(A33<>\"\",Race!I31,\"\")","v":""},null,null,"THE GARDENS ",{"$f":"IF(Meetings!B34=\"\",\"\",Meetings!B34)","v":"THE GARDENS (CG)"},{"$f":"IF(Meetings!D34=\"\",\"\",getAddress(Meetings!D34))","v":"http://www.tabonline.com.au/2011/03/26/CG01.html"},{"$f":"IF(Meetings!E34=\"\",\"\",getAddress(Meetings!E34))","v":"http://www.tabonline.com.au/2011/03/26/CG02.html"},{"$f":"IF(Meetings!F34=\"\",\"\",getAddress(Meetings!F34))","v":"http://www.tabonline.com.au/2011/03/26/CG03.html"},{"$f":"IF(Meetings!G34=\"\",\"\",getAddress(Meetings!G34))","v":"http://www.tabonline.com.au/2011/03/26/CG04.html"},{"$f":"IF(Meetings!H34=\"\",\"\",getAddress(Meetings!H34))","v":"http://www.tabonline.com.au/2011/03/26/CG05.html"},{"$f":"IF(Meetings!I34=\"\",\"\",getAddress(Meetings!I34))","v":"http://www.tabonline.com.au/2011/03/26/CG06.html"},{"$f":"IF(Meetings!J34=\"\",\"\",getAddress(Meetings!J34))","v":"http://www.tabonline.com.au/2011/03/26/CG07.html"},{"$f":"IF(Meetings!K34=\"\",\"\",getAddress(Meetings!K34))","v":"http://www.tabonline.com.au/2011/03/26/CG08.html"},{"$f":"IF(Meetings!L34=\"\",\"\",getAddress(Meetings!L34))","v":"http://www.tabonline.com.au/2011/03/26/CG09.html"},{"$f":"IF(Meetings!M34=\"\",\"\",getAddress(Meetings!M34))","v":"http://www.tabonline.com.au/2011/03/26/CG10.html"},{"$f":"IF(Meetings!N34=\"\",\"\",getAddress(Meetings!N34))","v":""},{"$f":"IF(Meetings!O34=\"\",\"\",getAddress(Meetings!O34))","v":""}]
[{"$f":"IF(Race!N32<>\"\",(CLEAN(TRIM(Race!C32))),\"\")","v":""},{"$f":"IF(A34<>\"\",Race!N32,\"\")","v":""},{"$f":"IF(A34<>\"\",Race!I32,\"\")","v":""},{"$nulls":4},{"$f":"IF(Meetings!D36=\"\",\"\",getAddress(Meetings!D36))","v":""},{"$f":"IF(Meetings!E36=\"\",\"\",getAddress(Meetings!E36))","v":""},{"$f":"IF(Meetings!F36=\"\",\"\",getAddress(Meetings!F36))","v":""},{"$f":"IF(Meetings!G36=\"\",\"\",getAddress(Meetings!G36))","v":""},{"$f":"IF(Meetings!H36=\"\",\"\",getAddress(Meetings!H36))","v":""},{"$f":"IF(Meetings!I36=\"\",\"\",getAddress(Meetings!I36))","v":""},{"$f":"IF(Meetings!J36=\"\",\"\",getAddress(Meetings!J36))","v":""},{"$f":"IF(Meetings!K36=\"\",\"\",getAddress(Meetings!K36))","v":""},{"$f":"IF(Meetings!L36=\"\",\"\",getAddress(Meetings!L36))","v":""},{"$f":"IF(Meetings!M36=\"\",\"\",getAddress(Meetings!M36))","v":""}]
[{"$f":"IF(Race!N33<>\"\",(CLEAN(TRIM(Race!C33))),\"\")","v":""},{"$f":"IF(A35<>\"\",Race!N33,\"\")","v":""},{"$f":"IF(A35<>\"\",Race!I33,\"\")","v":""},{"$nulls":4},{"$f":"IF(Meetings!D37=\"\",\"\",getAddress(Meetings!D37))","v":""},{"$f":"IF(Meetings!E37=\"\",\"\",getAddress(Meetings!E37))","v":""},{"$f":"IF(Meetings!F37=\"\",\"\",getAddress(Meetings!F37))","v":""},{"$f":"IF(Meetings!G37=\"\",\"\",getAddress(Meetings!G37))","v":""},{"$f":"IF(Meetings!H37=\"\",\"\",getAddress(Meetings!H37))","v":""},{"$f":"IF(Meetings!I37=\"\",\"\",getAddress(Meetings!I37))","v":""},{"$f":"IF(Meetings!J37=\"\",\"\",getAddress(Meetings!J37))","v":""},{"$f":"IF(Meetings!K37=\"\",\"\",getAddress(Meetings!K37))","v":""},{"$f":"IF(Meetings!L37=\"\",\"\",getAddress(Meetings!L37))","v":""},{"$f":"IF(Meetings!M37=\"\",\"\",getAddress(Meetings!M37))","v":""}]
[{"$f":"IF(Race!N34<>\"\",(CLEAN(TRIM(Race!C34))),\"\")","v":""},{"$f":"IF(A36<>\"\",Race!N34,\"\")","v":""},{"$f":"IF(A36<>\"\",Race!I34,\"\")","v":""},{"$nulls":4},{"$f":"IF(Meetings!D38=\"\",\"\",getAddress(Meetings!D38))","v":""},{"$f":"IF(Meetings!E38=\"\",\"\",getAddress(Meetings!E38))","v":""},{"$f":"IF(Meetings!F38=\"\",\"\",getAddress(Meetings!F38))","v":""},{"$f":"IF(Meetings!G38=\"\",\"\",getAddress(Meetings!G38))","v":""},{"$f":"IF(Meetings!H38=\"\",\"\",getAddress(Meetings!H38))","v":""},{"$f":"IF(Meetings!I38=\"\",\"\",getAddress(Meetings!I38))","v":""},{"$f":"IF(Meetings!J38=\"\",\"\",getAddress(Meetings!J38))","v":""},{"$f":"IF(Meetings!K38=\"\",\"\",getAddress(Meetings!K38))","v":""},{"$f":"IF(Meetings!L38=\"\",\"\",getAddress(Meetings!L38))","v":""},{"$f":"IF(Meetings!M38=\"\",\"\",getAddress(Meetings!M38))","v":""}]
[null,null,{"$f":"IF(A37<>\"\",Race!I35,\"\")","v":""},{"$nulls":4},{"$f":"IF(Meetings!D39=\"\",\"\",getAddress(Meetings!D39))","v":""},{"$f":"IF(Meetings!E39=\"\",\"\",getAddress(Meetings!E39))","v":""},{"$f":"IF(Meetings!F39=\"\",\"\",getAddress(Meetings!F39))","v":""},{"$f":"IF(Meetings!G39=\"\",\"\",getAddress(Meetings!G39))","v":""},{"$f":"IF(Meetings!H39=\"\",\"\",getAddress(Meetings!H39))","v":""},{"$f":"IF(Meetings!I39=\"\",\"\",getAddress(Meetings!I39))","v":""},{"$f":"IF(Meetings!J39=\"\",\"\",getAddress(Meetings!J39))","v":""},{"$f":"IF(Meetings!K39=\"\",\"\",getAddress(Meetings!K39))","v":""},{"$f":"IF(Meetings!L39=\"\",\"\",getAddress(Meetings!L39))","v":""},{"$f":"IF(Meetings!M39=\"\",\"\",getAddress(Meetings!M39))","v":""}]
[null,null,{"$f":"IF(A38<>\"\",Race!I36,\"\")","v":""},{"$nulls":4},{"$f":"IF(Meetings!D40=\"\",\"\",getAddress(Meetings!D40))","v":""},{"$f":"IF(Meetings!E40=\"\",\"\",getAddress(Meetings!E40))","v":""},{"$f":"IF(Meetings!F40=\"\",\"\",getAddress(Meetings!F40))","v":""},{"$f":"IF(Meetings!G40=\"\",\"\",getAddress(Meetings!G40))","v":""},{"$f":"IF(Meetings!H40=\"\",\"\",getAddress(Meetings!H40))","v":""},{"$f":"IF(Meetings!I40=\"\",\"\",getAddress(Meetings!I40))","v":""},{"$f":"IF(Meetings!J40=\"\",\"\",getAddress(Meetings!J40))","v":""},{"$f":"IF(Meetings!K40=\"\",\"\",getAddress(Meetings!K40))","v":""},{"$f":"IF(Meetings!L40=\"\",\"\",getAddress(Meetings!L40))","v":""},{"$f":"IF(Meetings!M40=\"\",\"\",getAddress(Meetings!M40))","v":""}]
[null,null,{"$f":"IF(A39<>\"\",Race!I37,\"\")","v":""},{"$nulls":4},{"$f":"IF(Meetings!D41=\"\",\"\",getAddress(Meetings!D41))","v":""},{"$f":"IF(Meetings!E41=\"\",\"\",getAddress(Meetings!E41))","v":""},{"$f":"IF(Meetings!F41=\"\",\"\",getAddress(Meetings!F41))","v":""},{"$f":"IF(Meetings!G41=\"\",\"\",getAddress(Meetings!G41))","v":""},{"$f":"IF(Meetings!H41=\"\",\"\",getAddress(Meetings!H41))","v":""},{"$f":"IF(Meetings!I41=\"\",\"\",getAddress(Meetings!I41))","v":""},{"$f":"IF(Meetings!J41=\"\",\"\",getAddress(Meetings!J41))","v":""},{"$f":"IF(Meetings!K41=\"\",\"\",getAddress(Meetings!K41))","v":""},{"$f":"IF(Meetings!L41=\"\",\"\",getAddress(Meetings!L41))","v":""},{"$f":"IF(Meetings!M41=\"\",\"\",getAddress(Meetings!M41))","v":""}]
[null,null,{"$f":"IF(A40<>\"\",Race!I38,\"\")","v":""},{"$nulls":4},{"$f":"IF(Meetings!D42=\"\",\"\",getAddress(Meetings!D42))","v":""},{"$f":"IF(Meetings!E42=\"\",\"\",getAddress(Meetings!E42))","v":""},{"$f":"IF(Meetings!F42=\"\",\"\",getAddress(Meetings!F42))","v":""},{"$f":"IF(Meetings!G42=\"\",\"\",getAddress(Meetings!G42))","v":""},{"$f":"IF(Meetings!H42=\"\",\"\",getAddress(Meetings!H42))","v":""},{"$f":"IF(Meetings!I42=\"\",\"\",getAddress(Meetings!I42))","v":""},{"$f":"IF(Meetings!J42=\"\",\"\",getAddress(Meetings!J42))","v":""},{"$f":"IF(Meetings!K42=\"\",\"\",getAddress(Meetings!K42))","v":""},{"$f":"IF(Meetings!L42=\"\",\"\",getAddress(Meetings!L42))","v":""},{"$f":"IF(Meetings!M42=\"\",\"\",getAddress(Meetings!M42))","v":""}]
[null,null,{"$f":"IF(A41<>\"\",Race!I39,\"\")","v":""},{"$nulls":4},{"$f":"IF(Meetings!D43=\"\",\"\",getAddress(Meetings!D43))","v":""},{"$f":"IF(Meetings!E43=\"\",\"\",getAddress(Meetings!E43))","v":""},{"$f":"IF(Meetings!F43=\"\",\"\",getAddress(Meetings!F43))","v":""},{"$f":"IF(Meetings!G43=\"\",\"\",getAddress(Meetings!G43))","v":""},{"$f":"IF(Meetings!H43=\"\",\"\",getAddress(Meetings!H43))","v":""},{"$f":"IF(Meetings!I43=\"\",\"\",getAddress(Meetings!I43))","v":""},{"$f":"IF(Meetings!J43=\"\",\"\",getAddress(Meetings!J43))","v":""},{"$f":"IF(Meetings!K43=\"\",\"\",getAddress(Meetings!K43))","v":""},{"$f":"IF(Meetings!L43=\"\",\"\",getAddress(Meetings!L43))","v":""},{"$f":"IF(Meetings!M43=\"\",\"\",getAddress(Meetings!M43))","v":""}]
[null,null,{"$f":"IF(A42<>\"\",Race!I40,\"\")","v":""},{"$nulls":4},{"$f":"IF(Meetings!D44=\"\",\"\",getAddress(Meetings!D44))","v":""},{"$f":"IF(Meetings!E44=\"\",\"\",getAddress(Meetings!E44))","v":""},{"$f":"IF(Meetings!F44=\"\",\"\",getAddress(Meetings!F44))","v":""},{"$f":"IF(Meetings!G44=\"\",\"\",getAddress(Meetings!G44))","v":""},{"$f":"IF(Meetings!H44=\"\",\"\",getAddress(Meetings!H44))","v":""},{"$f":"IF(Meetings!I44=\"\",\"\",getAddress(Meetings!I44))","v":""},{"$f":"IF(Meetings!J44=\"\",\"\",getAddress(Meetings!J44))","v":""},{"$f":"IF(Meetings!K44=\"\",\"\",getAddress(Meetings!K44))","v":""},{"$f":"IF(Meetings!L44=\"\",\"\",getAddress(Meetings!L44))","v":""},{"$f":"IF(Meetings!M44=\"\",\"\",getAddress(Meetings!M44))","v":""}]
[null,null,{"$f":"IF(A43<>\"\",Race!I41,\"\")","v":""},{"$nulls":4},{"$f":"IF(Meetings!D45=\"\",\"\",getAddress(Meetings!D45))","v":""},{"$f":"IF(Meetings!E45=\"\",\"\",getAddress(Meetings!E45))","v":""},{"$f":"IF(Meetings!F45=\"\",\"\",getAddress(Meetings!F45))","v":""},{"$f":"IF(Meetings!G45=\"\",\"\",getAddress(Meetings!G45))","v":""},{"$f":"IF(Meetings!H45=\"\",\"\",getAddress(Meetings!H45))","v":""},{"$f":"IF(Meetings!I45=\"\",\"\",getAddress(Meetings!I45))","v":""},{"$f":"IF(Meetings!J45=\"\",\"\",getAddress(Meetings!J45))","v":""},{"$f":"IF(Meetings!K45=\"\",\"\",getAddress(Meetings!K45))","v":""},{"$f":"IF(Meetings!L45=\"\",\"\",getAddress(Meetings!L45))","v":""},{"$f":"IF(Meetings!M45=\"\",\"\",getAddress(Meetings!M45))","v":""}]
[null,null,{"$f":"IF(A44<>\"\",Race!I42,\"\")","v":""},{"$nulls":4},{"$f":"IF(Meetings!D46=\"\",\"\",getAddress(Meetings!D46))","v":""},{"$f":"IF(Meetings!E46=\"\",\"\",getAddress(Meetings!E46))","v":""},{"$f":"IF(Meetings!F46=\"\",\"\",getAddress(Meetings!F46))","v":""},{"$f":"IF(Meetings!G46=\"\",\"\",getAddress(Meetings!G46))","v":""},{"$f":"IF(Meetings!H46=\"\",\"\",getAddress(Meetings!H46))","v":""},{"$f":"IF(Meetings!I46=\"\",\"\",getAddress(Meetings!I46))","v":""},{"$f":"IF(Meetings!J46=\"\",\"\",getAddress(Meetings!J46))","v":""},{"$f":"IF(Meetings!K46=\"\",\"\",getAddress(Meetings!K46))","v":""},{"$f":"IF(Meetings!L46=\"\",\"\",getAddress(Meetings!L46))","v":""},{"$f":"IF(Meetings!M46=\"\",\"\",getAddress(Meetings!M46))","v":""}]
[null,null,{"$f":"IF(A45<>\"\",Race!I43,\"\")","v":""},{"$nulls":4},{"$f":"IF(Meetings!D47=\"\",\"\",getAddress(Meetings!D47))","v":""},{"$f":"IF(Meetings!E47=\"\",\"\",getAddress(Meetings!E47))","v":""},{"$f":"IF(Meetings!F47=\"\",\"\",getAddress(Meetings!F47))","v":""},{"$f":"IF(Meetings!G47=\"\",\"\",getAddress(Meetings!G47))","v":""},{"$f":"IF(Meetings!H47=\"\",\"\",getAddress(Meetings!H47))","v":""},{"$f":"IF(Meetings!I47=\"\",\"\",getAddress(Meetings!I47))","v":""},{"$f":"IF(Meetings!J47=\"\",\"\",getAddress(Meetings!J47))","v":""},{"$f":"IF(Meetings!K47=\"\",\"\",getAddress(Meetings!K47))","v":""},{"$f":"IF(Meetings!L47=\"\",\"\",getAddress(Meetings!L47))","v":""},{"$f":"IF(Meetings!M47=\"\",\"\",getAddress(Meetings!M47))","v":""}]

{"sheet":"Instructions","index":2,"n_rows":10,"n_cols":11,"rows_kept":10,"cut":false,"hidden":false,"merged":[]}
[]
[]
[]
[]
[null,"Instructions"]
[]
[null,"You need to get the race code from",null,null,null,"http://www.racingandsports.com.au/form-guide/",{"$nulls":4},"click on each venue and get the last set of numbers from the address bar."]
[null,"On the \"Neurals\" sheet press \"Start\" press \"OK\" for todays date or put in a date, there is a box on the right that has the days races, hightlight a race and press \"Select\"  put in race code then 1st and last race numbers for that venue then press the \"Import\" button,"]
[null,"the race will be imported, if the top Neurals selection is also the unitab top rated it will copy to the \"Selections\" sheet."]
[null,"Each race will cycle through for that meeting, when done change the meeting and the race numbers and press import again."]

{"sheet":"Meetings","index":3,"n_rows":35,"n_cols":16,"rows_kept":35,"cut":false,"hidden":false,"merged":[[1,0,1,2],[28,0,28,2],[21,0,21,2]]}
[]
["Races",null,null,1,2,3,4,5,6,7,8,9,10,11,12]
[null,"DOOMBEN (BR)","Fields","3,5,4 F4","17m F4","57m F4","2:00 F4","2:40 F4","3:20 F4","4:00 F4","4:40 F4"]
[null,"ROSEHILL (SR)","Fields","7,3,11 F4","8,6,3 F4","7m F4","47m F4","1:50 F4","2:30 F4","3:10 F4","3:50 F4","4:30 F4"]
[null,"CAULFIELD (MR)","Fields","9,5,3 F4","9,6,7 F4","27m F4","1:30 F4","2:10 F4","2:50 F4","3:30 F4","4:10 F4"]
[null,"GOLD COAST (QR)","Fields","6,3,2 F4","2m F4","42m F4","1:45 F4","2:25 F4","3:05 F4","3:45 F4","4:25 F4"]
[null,"NEWCASTLE (NR)","Fields","2,1,9 ","Interim ","32m ","01:35:00","02:15:00","02:55:00","03:35:00","04:15:00"]
[null,"COLAC (VR)","Fields","2,4,8 ","12m ","52m ","01:55:00","02:35:00","03:15:00","03:55:00","04:35:00"]
[null,"MORPHETTVILLE (AR)","Fields","Interim F4","37m F4","1:40 F4","2:20 F4","3:00 F4","3:40 F4","4:20 F4","4:55 F4"]
[null,"GOULBURN (CR)","Fields","39m ","01:42:00","02:22:00","03:01:00","03:41:00","04:21:00"]
[null,"ASCOT (PR)","Fields","2:45 F4","3:25 F4","4:05 F4","4:45 F4","5:20 F4","5:55 F4","6:30 F4","7:05 F4"]
[null,"TOOWOOMBA (ER)","Fields","6:05 F4","6:45 F4","7:22 F4","7:57 F4","8:35 F4","9:07 F4","9:37 F4"]
[null,"WELLINGTON (OR)","Fields","4,8,12 ","12,10,4 ","1,7,6 ","2,6,3 ","22m ","01:25:00","02:05:00"]
[null,"EDENHOPE (ZR)","Fields","4,7,8 ","19m ","59m ","02:02:00","02:41:00","03:21:00","04:01:00"]
[null,"ALICE SPRINGS (DR)","Fields","03:14:00","03:49:00","04:29:00","05:05:00","05:44:00","06:21:00"]
[null,"LINGFIELD (BS)","Fields","12:00am ","12:35am ","1:10am ","1:40am "]
[null,"RICCARTON (NS)","Fields","3,8,6 ","9,5,1 ","1,4,6 ","11,6,3 ","1,7,3 ","5,2,9 ","5,3,7 ","23m ","01:26:00","02:06:00","02:45:00"]
[null,"TURFFONTEIN (AS)","Fields","08:55:00","09:30:00","10:10:00","10:50:00","11:30:00","12:05am ","12:40am ","1:20am "]
[null,"KEMPTON PARK (CS)","Fields","12:30am ","1:00am ","1:35am "]
[null,"TAURANGA (ZS)","Fields","13,8,14 ","8,7,5 ","8,3,4 ","2,3,4 ","4,10,3 ","3m ","43m ","01:46:00","02:26:00","03:05:00"]
[null,"DUBAI (DS)","Fields",null,"11:15:00","11:50:00","12:25am ","1:05am ","1:45am "]
["Trots",null,null,1,2,3,4,5,6,7,8,9,10,11,12]
[null,"ALBION PARK (BT)","Fields","5:10 F4","5:40 F4","6:08 F4","6:40 F4","7:10 F4","7:40 F4","8:10 F4","8:40 F4"]
[null,"BATHURST (ST)","Fields","05:15:00","05:45:00","06:17:00","06:50:00","07:15:00","07:45:00","08:15:00","08:45:00","09:15:00","09:45:00"]
[null,"KILMORE (MT)","Fields","05:25:00","06:00:00","06:33:00","07:00:00","07:32:00","08:02:00","08:30:00","09:00:00",{"$nulls":4},"3,7,8 "]
[null,"GLOBE DERBY (AT)","Fields","5:50 F4","6:22 F4","6:54 F4","7:25 F4","7:52 F4","8:22 F4","8:52 F4","9:22 F4"]
[null,"GLOUCESTER PARK (PT)","Fields","07:21:00","07:51:00","08:21:00","08:51:00","09:19:00","09:44:00","10:17:00","10:42:00"]
[null,"ASCOT PARK (ZT)","Fields","5,2,4 ","10,6,17 ","15,12,3 ","6,10,13 ","14,15,4 ","1,2,4 ","13m ","53m ","01:56:00","02:35:00"]
["Greyhounds",null,null,1,2,3,4,5,6,7,8,9,10,11,12]
[null,"WENTWORTH PARK (SG)","Fields","06:27:00","06:48:00","07:08:00","07:30:00","07:50:00","08:07:00","08:27:00","8:50 F4","09:12:00","09:35:00"]
[null,"THE MEADOWS (MG)","Fields","06:13:00","06:38:00","06:58:00","07:20:00","07:37:00","08:00:00","08:20:00","08:38:00","08:57:00","09:20:00","09:42:00"]
[null,"RICHMOND (NG)","Fields","05:54:00","06:12:00","06:37:00","06:57:00","07:19:00","07:39:00","07:56:00","8:14 F4","08:34:00","08:56:00"]
[null,"WARRNAMBOOL (VG)","Fields","04:39:00","04:59:00","05:19:00","05:39:00","05:59:00","06:18:00","06:43:00","07:04:00","07:27:00","07:44:00","08:06:00","08:26:00"]
[null,"THE GARDENS (CG)","Fields","04:26:00","04:49:00","05:09:00","05:29:00","05:49:00","06:07:00","06:32:00","06:53:00","07:13:00","07:35:00"]
[null,"CANNINGTON (PG)","Fields","09:05:00","09:27:00","09:50:00","10:07:00","10:27:00","10:47:00","11:05:00","11:22:00","11:40:00","11:57:00","12:12am "]

{"sheet":"Race","index":4,"n_rows":38,"n_cols":14,"rows_kept":38,"cut":false,"hidden":false,"merged":[]}
[]
["CAULFIELD",null,"MR 1","PAYING"]
[]
["2011-03-26","2YO HANDICAP",null,null,"Fixed Price"]
["RADIO TAB","1-9-8-3","STEVE MORAN","3-1-6-5","Late Mail 9","1200M","OVERCAST","DEAD(4)"]
[]
[{"$nulls":6},"SCR 2 7 10"]
[9,null,"CUTE EMILY",4,1.4]
[5,null,"KUHREIHEN",null,2.5]
[3,null,"GENERAL OFFER",null,1.7]
[]
["QN","5* 9",17.8,null,null,null,"TF","9* 5* 3",103.2]
["EX","9* 5",28.9,null,null,null,"A2","5* 9",6.6]
["F4","9* 5* 3* 1",268.60000000000002,{"$nulls":4},"3* 9",3.6]
[{"$nulls":7},"3* 5",9.5]
["No.",null,"Name","11:26:00","Win","Plc",null,"Rider  ","Bar","Wght",null,"Form","L3S","Rtng"]
[1,null,"ROCKSHAFT",2.6,2.9,1.1000000000000001,null,"J MASKIELL(A)",8,58,null,"D",611,96]
[2,null,"CARAVAGGIO",{"$nulls":4},"SCRATCHED",4]
[3,null,"GENERAL OFFER",7,6.7,1.7,null,"L CURRIE",11,55.5,null,"D",621,91]
[4,null,"KING'S SHILLING",19.600000000000001,38.4,6.2,null,"JACK HILL(A)",2,55.5,null,null,null,64]
[5,null,"KUHREIHEN",8.5,11.6,2.5,null,"J MOTT",6,55.5,null,null,null,84]
[6,null,"RIVER OF GLORY",11.4,20.2,4.4000000000000004,null,"B EGAN(A)",1,55.5,null,null,null,64]
[7,null,"RAFFLES PEGASUS",{"$nulls":4},"SCRATCHED",9]
[8,null,"RICCARDO THE GREAT",12.4,14.5,2.8,null,"D YENDALL",5,54.5,null,null,43,85]
[9,null,"CUTE EMILY",3.9,4,1.4,null,"L MEECH",12,53.5,null,null,1,88]
[10,null,"PLUCKY BELLE",{"$nulls":4},"SCRATCHED",3]
[11,null,"ALANZA",24,41.4,6.1,null,"P MERTENS",7,53,null,null,"3X4",79]
[12,null,"TIGRESSIVE",44.9,80.5,10.5,null,"D SMITH",10,53,null,null,5,79]
[]
["UNiTAB Pool Totals"]
["WN",63651,"QN",9674,"TF",31580]
["PL",24976,"EX",4523,"F4",5604]
[null,null,"A2",2268]
[]
["<< MR  1  2  3  4  5  6  7  8  DD/TT/QD  XD Riders  Fixed Price >>"]
[]
["Help","Gambling Advice","TAB Home","Refresh"]
["© Copyright UNiTAB Ltd","Created: Sat, 26 Mar 2011 11:39:08 Aust EST"]

{"sheet":"Selections","index":5,"n_rows":1,"n_cols":10,"rows_kept":1,"cut":false,"hidden":false,"merged":[]}
["Venue",null,"Race",null,"No","Runner",null,null,"Win","Place"]