{"text_format":"2","workbook":"xlsx","n_sheets":6,"sheets":["Neurals","Data","Instructions","Meetings","Race","Selections"],"not_rendered":{"charts":0,"images":0,"macros":1,"external_links":0,"defined_names":1154,"comments":0,"pivot_tables":0},"unopened":[],"bounds":{"document_bytes":16777216,"sheet_cells":100000,"run_cost":"one","rows_first":2000,"rows_last":500,"rows_between":2000,"halvings":0,"cell_chars":16384,"cell_head_chars":4096},"cells_cut":0,"cells_raw":0,"read":"whole","date_system":"1900"}

{"sheet":"Neurals","index":0,"n_rows":68,"n_cols":32,"rows_kept":68,"cut":false,"hidden":false,"merged":[[2,5,2,7],[1,8,2,10],[2,14,2,15]]}
[{"$nulls":20},{"$f":"IF(Race!D2=\"Paying\",\"Paying\",\"\")","v":"Paying"},{"$f":"SUM(AA1:AA3)","v":27},{"$f":"IF(AA1<>\"\",B3,\"\")","v":"SUNSHINE COAST"},null,{"$f":"IF(AA1<>\"\",E3,\"\")","v":9},{"$f":"IF(AA1=\"\",\"\",\"Fav\")","v":"Fav"},{"$f":"IF(SUM(Y11:Y36)>0,SUM(Y11:Y36),\"\")","v":9},{"$f":"IF(AA1=\"\",\"\",IF(ISNA(CLEAN(TRIM((VLOOKUP(AA1,$Y$11:$Z$36,2,FALSE))))),\"\",CLEAN(TRIM((VLOOKUP(AA1,$Y$11:$Z$36,2,FALSE))))))","v":"Mallard"},null,null,{"$f":"IF(U1<>\"\",IF(ISNA(VLOOKUP(AB1,Data!$C$3:$E$5,2,FALSE)),\"\",(VLOOKUP(AB1,Data!$C$3:$E$5,2,FALSE))),\"\")","v":""},{"$f":"IF(U1<>\"\",IF(ISNA(VLOOKUP(AB1,Data!$C$3:$E$5,1,FALSE)),\"\",(VLOOKUP(AB1,Data!$C$3:$E$5,3,FALSE))),\"\")","v":""}]
[null,"Race Venue",null,"Race Code","1st Race No","Last Race No",{"$nulls":6},"WT",null,"Min Price",{"$nulls":7},{"$f":"IF(AA2<>\"\",B3,\"\")","v":"SUNSHINE COAST"},null,{"$f":"IF(AA2<>\"\",E3,\"\")","v":9},{"$f":"IF(AA2=\"\",\"\",\"CP/FR\")","v":"CP/FR"},{"$f":"IF(SUM(Y41:Y67)>0,SUM(Y41:Y67),\"\")","v":9},{"$f":"IF(AA2=\"\",\"\",IF(ISNA(CLEAN(TRIM((VLOOKUP(AA2,$Y$41:$Z$65,2,FALSE))))),\"\",(CLEAN(TRIM((VLOOKUP(AA2,$Y$41:$Z$65,2,FALSE)))))))","v":"Mallard"},null,null,{"$f":"IF(U1<>\"\",IF(ISNA(VLOOKUP(AB2,Data!$C$3:$E$5,2,FALSE)),\"\",(VLOOKUP(AB2,Data!$C$3:$E$5,2,FALSE))),\"\")","v":""},{"$f":"IF(U1<>\"\",IF(ISNA(VLOOKUP(AB2,Data!$C$3:$E$5,1,FALSE)),\"\",(VLOOKUP(AB2,Data!$C$3:$E$5,3,FALSE))),\"\")","v":""}]
[null,"SUNSHINE COAST",null,"16324",9,8,{"$nulls":6},2,null,2,{"$nulls":7},{"$f":"IF(AA3<>\"\",B3,\"\")","v":"SUNSHINE COAST"},null,{"$f":"IF(AA3<>\"\",E3,\"\")","v":9},{"$f":"IF(AA3<>\"\",AA39,\"\")","v":3.2},{"$f":"IF(AA39<O3,\"\",IF(AB39<>\"\",AB39,\"\"))","v":9},{"$f":"IF(AA3=\"\",\"\",IF(ISNA(CLEAN(TRIM((VLOOKUP(AA3,$B$36:$C$71,2,FALSE))))),\"\",(CLEAN(TRIM((VLOOKUP(AA3,$B$36:$C$71,2,FALSE)))))))","v":"Mallard"},null,null,{"$f":"IF(U1<>\"\",IF(ISNA(VLOOKUP(AB3,Data!$C$3:$E$5,2,FALSE)),\"\",(VLOOKUP(AB3,Data!$C$3:$E$5,2,FALSE))),\"\")","v":""},{"$f":"IF(U1<>\"\",IF(ISNA(VLOOKUP(AB3,Data!$C$3:$E$5,1,FALSE)),\"\",(VLOOKUP(AB3,Data!$C$3:$E$5,3,FALSE))),\"\")","v":""}]
[]
[]
[]
[]
[null,{"$f":"B3","v":"SUNSHINE COAST"},null,"Race",{"$f":"E3","v":9}]
[null,null,{"$f":"LARGE(C11:C40,1)","v":282.5},null,{"$f":"LARGE(E11:E40,1)","v":47},{"$nulls":24},"Todays Venues"]
["TAB","HORSE","NR","HCP","CP","CF","TIM","SCR","JA","TA","JT","BP","WET","CRS","D","$","DLR",{"$nulls":5},"Unitab Rated",null,null,"Runner"]
[1," Enemyatthegate",133,null,7,14,52,0,5,3,8,7,0,4,5,12,17,{"$nulls":4},{"$f":"CLEAN(TRIM(B11))","v":"Enemyatthegate"},{"$f":"IF(ISNA(VLOOKUP(V11,Data!$A$1:'Data'!$B$200,2,FALSE)),\"\",(VLOOKUP(V11,Data!$A$1:'Data'!$B$200,2,FALSE)))","v":92},null,{"$f":"IF(W11=100,IF(C11=$C$9,A11,\"\"),\"\")","v":""},{"$f":"IF(Y11=\"\",\"\",CLEAN(TRIM(B11)))","v":""}]
[2," Rocky Habit",0,null,0,0,0,1,0,0,0,0,0,0,0,0,0,{"$nulls":4},{"$f":"CLEAN(TRIM(B12))","v":"Rocky Habit"},{"$f":"IF(ISNA(VLOOKUP(V12,Data!$A$1:'Data'!$B$200,2,FALSE)),\"\",(VLOOKUP(V12,Data!$A$1:'Data'!$B$200,2,FALSE)))","v":""},null,"",{"$f":"IF(Y12=\"\",\"\",CLEAN(TRIM(B12)))","v":""},null,null,null,{"$f":"IF(Data!F2=\"\",\"\",CLEAN(TRIM(Data!F2)))","v":"WARWICK FARM"},null,{"$f":"IF(ISNA(VLOOKUP(AD12,Data!$V$1:'Data'!$X$100,3,FALSE)),\"\",VLOOKUP(AD12,Data!$V$1:'Data'!$X$100,3,FALSE))","v":"16331"}]
[3," Nauticat",93,null,7,0,1,0,18,15,18,13,0,5,7,9,1,{"$nulls":4},"Nauticat",{"$f":"IF(ISNA(VLOOKUP(V13,Data!$A$1:'Data'!$B$200,2,FALSE)),\"\",(VLOOKUP(V13,Data!$A$1:'Data'!$B$200,2,FALSE)))","v":89},null,"","",null,null,null,{"$f":"IF(Data!F3=\"\",\"\",CLEAN(TRIM(Data!F3)))","v":"SUNSHINE COAST"},null,{"$f":"IF(ISNA(VLOOKUP(AD13,Data!$V$1:'Data'!$X$100,3,FALSE)),\"\",VLOOKUP(AD13,Data!$V$1:'Data'!$X$100,3,FALSE))","v":"16324"}]
[4," Newland Warrior",69,null,5,1,1,0,3,15,3,14,0,5,5,17,1,{"$nulls":4},"Newland Warrior",{"$f":"IF(ISNA(VLOOKUP(V14,Data!$A$1:'Data'!$B$200,2,FALSE)),\"\",(VLOOKUP(V14,Data!$A$1:'Data'!$B$200,2,FALSE)))","v":88},null,"","",null,null,null,{"$f":"IF(Data!F4=\"\",\"\",CLEAN(TRIM(Data!F4)))","v":"WELLINGTON"},null,{"$f":"IF(ISNA(VLOOKUP(AD14,Data!$V$1:'Data'!$X$100,3,FALSE)),\"\",VLOOKUP(AD14,Data!$V$1:'Data'!$X$100,3,FALSE))","v":"16330"}]
[5," Portuguese",0,null,0,0,0,1,0,0,0,0,0,0,0,0,0,{"$nulls":4},"Portuguese",{"$f":"IF(ISNA(VLOOKUP(V15,Data!$A$1:'Data'!$B$200,2,FALSE)),\"\",(VLOOKUP(V15,Data!$A$1:'Data'!$B$200,2,FALSE)))","v":""},null,"","",null,null,null,{"$f":"IF(Data!F5=\"\",\"\",CLEAN(TRIM(Data!F5)))","v":"CRANBOURNE"},null,{"$f":"IF(ISNA(VLOOKUP(AD15,Data!$V$1:'Data'!$X$100,3,FALSE)),\"\",VLOOKUP(AD15,Data!$V$1:'Data'!$X$100,3,FALSE))","v":"16325"}]
[6," By Choice",0,null,0,0,0,1,0,0,0,0,0,0,0,0,0,{"$nulls":4},"By Choice",{"$f":"IF(ISNA(VLOOKUP(V16,Data!$A$1:'Data'!$B$200,2,FALSE)),\"\",(VLOOKUP(V16,Data!$A$1:'Data'!$B$200,2,FALSE)))","v":""},null,"","",null,null,null,{"$f":"IF(Data!F6=\"\",\"\",CLEAN(TRIM(Data!F6)))","v":"GAWLER"},null,{"$f":"IF(ISNA(VLOOKUP(AD16,Data!$V$1:'Data'!$X$100,3,FALSE)),\"\",VLOOKUP(AD16,Data!$V$1:'Data'!$X$100,3,FALSE))","v":"16326"}]
[7," Path To Freedom",118.5,null,39,1,1,0,15,3,20,13,0,8,5,13,1,{"$nulls":4},"Path To Freedom",{"$f":"IF(ISNA(VLOOKUP(V17,Data!$A$1:'Data'!$B$200,2,FALSE)),\"\",(VLOOKUP(V17,Data!$A$1:'Data'!$B$200,2,FALSE)))","v":94},null,"","",null,null,null,{"$f":"IF(Data!F7=\"\",\"\",CLEAN(TRIM(Data!F7)))","v":"GERALDTON"},null,{"$f":"IF(ISNA(VLOOKUP(AD17,Data!$V$1:'Data'!$X$100,3,FALSE)),\"\",VLOOKUP(AD17,Data!$V$1:'Data'!$X$100,3,FALSE))","v":"16302"}]
[8," Munbura Flyer",0,null,0,0,0,1,0,0,0,0,0,0,0,0,0,{"$nulls":4},"Munbura Flyer",{"$f":"IF(ISNA(VLOOKUP(V18,Data!$A$1:'Data'!$B$200,2,FALSE)),\"\",(VLOOKUP(V18,Data!$A$1:'Data'!$B$200,2,FALSE)))","v":""},null,"","",null,null,null,{"$f":"IF(Data!F8=\"\",\"\",CLEAN(TRIM(Data!F8)))","v":"WANGARATTA"},null,{"$f":"IF(ISNA(VLOOKUP(AD18,Data!$V$1:'Data'!$X$100,3,FALSE)),\"\",VLOOKUP(AD18,Data!$V$1:'Data'!$X$100,3,FALSE))","v":"16329"}]
[9," Mallard",282.5,null,47,64,72,0,18,18,18,9,0,5,5,12,16,{"$nulls":4},"Mallard",{"$f":"IF(ISNA(VLOOKUP(V19,Data!$A$1:'Data'!$B$200,2,FALSE)),\"\",(VLOOKUP(V19,Data!$A$1:'Data'!$B$200,2,FALSE)))","v":100},null,9,"Mallard",null,null,null,{"$f":"IF(Data!F9=\"\",\"\",CLEAN(TRIM(Data!F9)))","v":"HOBART"},null,{"$f":"IF(ISNA(VLOOKUP(AD19,Data!$V$1:'Data'!$X$100,3,FALSE)),\"\",VLOOKUP(AD19,Data!$V$1:'Data'!$X$100,3,FALSE))","v":"16293"}]
[10," Illude",0,null,0,0,0,1,0,0,0,0,0,0,0,0,0,{"$nulls":4},"Illude",{"$f":"IF(ISNA(VLOOKUP(V20,Data!$A$1:'Data'!$B$200,2,FALSE)),\"\",(VLOOKUP(V20,Data!$A$1:'Data'!$B$200,2,FALSE)))","v":""},null,"","",null,null,null,{"$f":"IF(Data!F10=\"\",\"\",CLEAN(TRIM(Data!F10)))","v":"MACKAY"},null,{"$f":"IF(ISNA(VLOOKUP(AD20,Data!$V$1:'Data'!$X$100,3,FALSE)),\"\",VLOOKUP(AD20,Data!$V$1:'Data'!$X$100,3,FALSE))","v":"16327"}]
[11," Waasies Shadow",0,null,0,0,0,1,0,0,0,0,0,0,0,0,0,{"$nulls":4},"Waasies Shadow",{"$f":"IF(ISNA(VLOOKUP(V21,Data!$A$1:'Data'!$B$200,2,FALSE)),\"\",(VLOOKUP(V21,Data!$A$1:'Data'!$B$200,2,FALSE)))","v":""},null,"","",null,null,null,{"$f":"IF(Data!F11=\"\",\"\",CLEAN(TRIM(Data!F11)))","v":"KRANJI"},null,{"$f":"IF(ISNA(VLOOKUP(AD21,Data!$V$1:'Data'!$X$100,3,FALSE)),\"\",VLOOKUP(AD21,Data!$V$1:'Data'!$X$100,3,FALSE))","v":""}]
[12," At Sundown",0,null,0,0,0,1,0,0,0,0,0,0,0,0,0,{"$nulls":4},"At Sundown",{"$f":"IF(ISNA(VLOOKUP(V22,Data!$A$1:'Data'!$B$200,2,FALSE)),\"\",(VLOOKUP(V22,Data!$A$1:'Data'!$B$200,2,FALSE)))","v":""},null,"","",null,null,null,{"$f":"IF(Data!F12=\"\",\"\",CLEAN(TRIM(Data!F12)))","v":"SCOTTSVILLE"},null,{"$f":"IF(ISNA(VLOOKUP(AD22,Data!$V$1:'Data'!$X$100,3,FALSE)),\"\",VLOOKUP(AD22,Data!$V$1:'Data'!$X$100,3,FALSE))","v":"16282"}]
[13," Rascal",84,null,4,1,6,0,15,5,5,13,0,6,9,4,16,{"$nulls":4},"Rascal",{"$f":"IF(ISNA(VLOOKUP(V23,Data!$A$1:'Data'!$B$200,2,FALSE)),\"\",(VLOOKUP(V23,Data!$A$1:'Data'!$B$200,2,FALSE)))","v":84},null,"","",null,null,null,{"$f":"IF(Data!F13=\"\",\"\",CLEAN(TRIM(Data!F13)))","v":"UK"},null,{"$f":"IF(ISNA(VLOOKUP(AD23,Data!$V$1:'Data'!$X$100,3,FALSE)),\"\",VLOOKUP(AD23,Data!$V$1:'Data'!$X$100,3,FALSE))","v":""}]
[14," Russian Royalty",145.5,null,11,51,25,0,3,3,8,11,0,8,6,3,18,{"$nulls":4},"Russian Royalty",{"$f":"IF(ISNA(VLOOKUP(V24,Data!$A$1:'Data'!$B$200,2,FALSE)),\"\",(VLOOKUP(V24,Data!$A$1:'Data'!$B$200,2,FALSE)))","v":91},null,"","",null,null,null,{"$f":"IF(Data!F14=\"\",\"\",CLEAN(TRIM(Data!F14)))","v":"ENGLAND"},null,{"$f":"IF(ISNA(VLOOKUP(AD24,Data!$V$1:'Data'!$X$100,3,FALSE)),\"\",VLOOKUP(AD24,Data!$V$1:'Data'!$X$100,3,FALSE))","v":""}]
[15," Jameson Aich",89,null,6,3,5,0,10,18,8,10,0,5,3,8,14,{"$nulls":7},"","",null,null,null,{"$f":"IF(Data!F15=\"\",\"\",CLEAN(TRIM(Data!F15)))","v":"SHA TIN"},null,{"$f":"IF(ISNA(VLOOKUP(AD25,Data!$V$1:'Data'!$X$100,3,FALSE)),\"\",VLOOKUP(AD25,Data!$V$1:'Data'!$X$100,3,FALSE))","v":"16332"}]
[16," St Orientair",79,null,7,0,1,0,5,28,8,12,0,5,5,8,1,{"$nulls":7},"","",null,null,null,{"$f":"IF(Data!F16=\"\",\"\",CLEAN(TRIM(Data!F16)))","v":"WAIPUKURAU"},null,{"$f":"IF(ISNA(VLOOKUP(AD26,Data!$V$1:'Data'!$X$100,3,FALSE)),\"\",VLOOKUP(AD26,Data!$V$1:'Data'!$X$100,3,FALSE))","v":"16307"}]
[17," Finagle",159.5,null,17,6,54,0,8,15,10,14,0,8,7,5,16,{"$nulls":7},"","",null,null,null,{"$f":"IF(Data!F17=\"\",\"\",CLEAN(TRIM(Data!F17)))","v":"LEOPARDSTOWN"},null,{"$f":"IF(ISNA(VLOOKUP(AD27,Data!$V$1:'Data'!$X$100,3,FALSE)),\"\",VLOOKUP(AD27,Data!$V$1:'Data'!$X$100,3,FALSE))","v":""}]
[18," Crown The Warrior",50.5,null,5,1,1,0,10,3,5,12,0,2,5,6,1,{"$nulls":7},"","",null,null,null,{"$f":"IF(Data!F18=\"\",\"\",CLEAN(TRIM(Data!F18)))","v":""},null,{"$f":"IF(ISNA(VLOOKUP(AD28,Data!$V$1:'Data'!$X$100,3,FALSE)),\"\",VLOOKUP(AD28,Data!$V$1:'Data'!$X$100,3,FALSE))","v":""}]
[19," Bradash",42,null,1,0,1,0,5,8,8,11,0,3,3,2,1,{"$nulls":7},"","",null,null,null,{"$f":"IF(Data!F19=\"\",\"\",CLEAN(TRIM(Data!F19)))","v":"TAMWORTH"},null,{"$f":"IF(ISNA(VLOOKUP(AD29,Data!$V$1:'Data'!$X$100,3,FALSE)),\"\",VLOOKUP(AD29,Data!$V$1:'Data'!$X$100,3,FALSE))","v":""}]
[20," El Conde",68.5,null,6,0,1,0,8,18,13,6,0,5,5,7,1,{"$nulls":7},"","",null,null,null,{"$f":"IF(Data!F20=\"\",\"\",CLEAN(TRIM(Data!F20)))","v":"ECHUCA"},null,{"$f":"IF(ISNA(VLOOKUP(AD30,Data!$V$1:'Data'!$X$100,3,FALSE)),\"\",VLOOKUP(AD30,Data!$V$1:'Data'!$X$100,3,FALSE))","v":""}]
[21," Cavallo D'Oro",92,null,6,26,9,0,3,3,5,10,0,7,4,4,16,{"$nulls":7},"","",null,null,null,{"$f":"IF(Data!F21=\"\",\"\",CLEAN(TRIM(Data!F21)))","v":"CRANBOURNE"},null,{"$f":"IF(ISNA(VLOOKUP(AD31,Data!$V$1:'Data'!$X$100,3,FALSE)),\"\",VLOOKUP(AD31,Data!$V$1:'Data'!$X$100,3,FALSE))","v":"16325"}]
[{"$nulls":24},"","",null,null,null,{"$f":"IF(Data!F22=\"\",\"\",CLEAN(TRIM(Data!F22)))","v":"METHVEN"},null,{"$f":"IF(ISNA(VLOOKUP(AD32,Data!$V$1:'Data'!$X$100,3,FALSE)),\"\",VLOOKUP(AD32,Data!$V$1:'Data'!$X$100,3,FALSE))","v":""}]
[{"$nulls":24},"","",null,null,null,{"$f":"IF(Data!F23=\"\",\"\",CLEAN(TRIM(Data!F23)))","v":"LAUNCESTON"},null,{"$f":"IF(ISNA(VLOOKUP(AD33,Data!$V$1:'Data'!$X$100,3,FALSE)),\"\",VLOOKUP(AD33,Data!$V$1:'Data'!$X$100,3,FALSE))","v":""}]
[{"$nulls":24},"","",null,null,null,{"$f":"IF(Data!F24=\"\",\"\",CLEAN(TRIM(Data!F24)))","v":"UNITED STATES"},null,{"$f":"IF(ISNA(VLOOKUP(AD34,Data!$V$1:'Data'!$X$100,3,FALSE)),\"\",VLOOKUP(AD34,Data!$V$1:'Data'!$X$100,3,FALSE))","v":""}]
[{"$nulls":24},"","",null,null,null,{"$f":"IF(Data!F25=\"\",\"\",CLEAN(TRIM(Data!F25)))","v":""},null,{"$f":"IF(ISNA(VLOOKUP(AD35,Data!$V$1:'Data'!$X$100,3,FALSE)),\"\",VLOOKUP(AD35,Data!$V$1:'Data'!$X$100,3,FALSE))","v":""}]
[{"$nulls":24},"","",null,null,null,{"$f":"IF(Data!F26=\"\",\"\",CLEAN(TRIM(Data!F26)))","v":"CRANBOURNE"},null,{"$f":"IF(ISNA(VLOOKUP(AD36,Data!$V$1:'Data'!$X$100,3,FALSE)),\"\",VLOOKUP(AD36,Data!$V$1:'Data'!$X$100,3,FALSE))","v":"16325"}]
[]
[]
[{"$nulls":14},{"$f":"LARGE(O41:O70,1)","v":33},{"$nulls":11},{"$f":"SMALL(R41:R70,1)","v":3.2},{"$f":"LARGE(AB41:AB71,1)","v":9}]
["INC","TAB","HORSE","RFS","DLS","12m","BRR","SCR","FORM","COND","CONS","BP","JOCK","JC","FR","EM","PER","DIV","DInc",null,null,null,"Barrier",null,null,"Runner"]
[null,1," Enemyatthegate ",5,11,30,null,0,{"$nulls":5},0,24.5,8.5,0.63,201,null,null,null,{"$f":"CLEAN(TRIM(C41))","v":"Enemyatthegate"},{"$f":"IF(V41=\"\",\"\",IF(ISNA(VLOOKUP(V41,Data!$A$1:'Data'!$C$200,3,FALSE)),\"\",(VLOOKUP(V41,Data!$A$1:'Data'!$C$200,3,FALSE))))","v":17},null,{"$f":"IF(W41=\"\",\"\",IF(W41>4,IF(AND(E11=$E$9,O41=$O$39),B41,\"\"),\"\"))","v":""},{"$f":"IF(Y41=\"\",\"\",CLEAN(TRIM(C41)))","v":""},{"$f":"IF(R41=$AA$39,R41,\"\")","v":""},{"$f":"IF(AA41<>\"\",B41,\"\")","v":""}]
[null,2," Rocky Habit ","FU ",556,null,null,1,{"$nulls":5},0,null,null,null,"scr",null,null,null,{"$f":"CLEAN(TRIM(C42))","v":"Rocky Habit"},{"$f":"IF(V42=\"\",\"\",IF(ISNA(VLOOKUP(V42,Data!$A$1:'Data'!$C$200,3,FALSE)),\"\",(VLOOKUP(V42,Data!$A$1:'Data'!$C$200,3,FALSE))))","v":""},null,{"$f":"IF(W42=\"\",\"\",IF(W42>4,IF(AND(E12=$E$9,O42=$O$39),B42,\"\"),\"\"))","v":""},{"$f":"IF(Y42=\"\",\"\",CLEAN(TRIM(C42)))","v":""},{"$f":"IF(R42=$AA$39,R42,\"\")","v":""},{"$f":"IF(AA42<>\"\",B42,\"\")","v":""}]
[null,3," Nauticat ","FU ",133,33.5,null,0,{"$nulls":5},0,28,5,4.42,21,null,null,null,"Nauticat",{"$f":"IF(V43=\"\",\"\",IF(ISNA(VLOOKUP(V43,Data!$A$1:'Data'!$C$200,3,FALSE)),\"\",(VLOOKUP(V43,Data!$A$1:'Data'!$C$200,3,FALSE))))","v":10},null,"","","",""]
[null,4," Newland Warrior ","FU ",129,27.5,null,0,{"$nulls":5},0,20.5,12.5,0.32,301,null,null,null,"Newland Warrior",{"$f":"IF(V44=\"\",\"\",IF(ISNA(VLOOKUP(V44,Data!$A$1:'Data'!$C$200,3,FALSE)),\"\",(VLOOKUP(V44,Data!$A$1:'Data'!$C$200,3,FALSE))))","v":6},null,"","","",""]
[null,5," Portuguese ","FU ",183,25.5,null,1,{"$nulls":5},0,null,null,null,"scr",null,null,null,"Portuguese",{"$f":"IF(V45=\"\",\"\",IF(ISNA(VLOOKUP(V45,Data!$A$1:'Data'!$C$200,3,FALSE)),\"\",(VLOOKUP(V45,Data!$A$1:'Data'!$C$200,3,FALSE))))","v":""},null,"","","",""]
[null,6," By Choice ",5,16,31,null,1,{"$nulls":5},0,null,null,null,"scr",null,null,null,"By Choice",{"$f":"IF(V46=\"\",\"\",IF(ISNA(VLOOKUP(V46,Data!$A$1:'Data'!$C$200,3,FALSE)),\"\",(VLOOKUP(V46,Data!$A$1:'Data'!$C$200,3,FALSE))))","v":""},null,"","","",""]
[null,7," Path To Freedom ","FU ",90,33.5,null,0,{"$nulls":5},0,28.5,4.5,6.32,16,null,null,null,"Path To Freedom",{"$f":"IF(V47=\"\",\"\",IF(ISNA(VLOOKUP(V47,Data!$A$1:'Data'!$C$200,3,FALSE)),\"\",(VLOOKUP(V47,Data!$A$1:'Data'!$C$200,3,FALSE))))","v":7},null,"","","",""]
[null,8," Munbura Flyer ",3,14,30.5,null,1,{"$nulls":5},0,null,null,null,"scr",null,null,null,"Munbura Flyer",{"$f":"IF(V48=\"\",\"\",IF(ISNA(VLOOKUP(V48,Data!$A$1:'Data'!$C$200,3,FALSE)),\"\",(VLOOKUP(V48,Data!$A$1:'Data'!$C$200,3,FALSE))))","v":""},null,"","","",""]
[null,9," Mallard ",3,18,33,null,0,{"$nulls":5},0,33,0,31.58,3.2,null,null,null,"Mallard",{"$f":"IF(V49=\"\",\"\",IF(ISNA(VLOOKUP(V49,Data!$A$1:'Data'!$C$200,3,FALSE)),\"\",(VLOOKUP(V49,Data!$A$1:'Data'!$C$200,3,FALSE))))","v":16},null,9,"Mallard",3.2,9]
[null,10," Illude ","FU ",135,31.5,null,1,{"$nulls":5},0,null,null,null,"scr",null,null,null,"Illude",{"$f":"IF(V50=\"\",\"\",IF(ISNA(VLOOKUP(V50,Data!$A$1:'Data'!$C$200,3,FALSE)),\"\",(VLOOKUP(V50,Data!$A$1:'Data'!$C$200,3,FALSE))))","v":""},null,"",{"$f":"IF(Y50=\"\",\"\",CLEAN(TRIM(C50)))","v":""},"",""]
[null,11," Waasies Shadow ","FU ",134,32.5,null,1,{"$nulls":5},0,null,null,null,"scr",null,null,null,"Waasies Shadow",{"$f":"IF(V51=\"\",\"\",IF(ISNA(VLOOKUP(V51,Data!$A$1:'Data'!$C$200,3,FALSE)),\"\",(VLOOKUP(V51,Data!$A$1:'Data'!$C$200,3,FALSE))))","v":""},null,"","","",""]
[null,12," At Sundown ","SU ",15,27.5,null,1,{"$nulls":5},0,null,null,null,"scr",null,null,null,"At Sundown",{"$f":"IF(V52=\"\",\"\",IF(ISNA(VLOOKUP(V52,Data!$A$1:'Data'!$C$200,3,FALSE)),\"\",(VLOOKUP(V52,Data!$A$1:'Data'!$C$200,3,FALSE))))","v":""},null,"","","",""]
[null,13," Rascal ",4,14,22.5,null,0,{"$nulls":5},0,22,11,0.32,301,null,null,null,"Rascal",{"$f":"IF(V53=\"\",\"\",IF(ISNA(VLOOKUP(V53,Data!$A$1:'Data'!$C$200,3,FALSE)),\"\",(VLOOKUP(V53,Data!$A$1:'Data'!$C$200,3,FALSE))))","v":2},null,"","","",""]
[null,14," Russian Royalty ",7,10,32,null,0,{"$nulls":5},0,28,5,4.42,21,null,null,null,"Russian Royalty",{"$f":"IF(V54=\"\",\"\",IF(ISNA(VLOOKUP(V54,Data!$A$1:'Data'!$C$200,3,FALSE)),\"\",(VLOOKUP(V54,Data!$A$1:'Data'!$C$200,3,FALSE))))","v":14},null,"","","",""]
[null,15," Jameson Aich ","SU ",22,35.5,null,0,{"$nulls":5},0,26.5,6.5,1.89,51,null,null,null,"Jameson Aich",{"$f":"IF(V55=\"\",\"\",IF(ISNA(VLOOKUP(V55,Data!$A$1:'Data'!$C$200,3,FALSE)),\"\",(VLOOKUP(V55,Data!$A$1:'Data'!$C$200,3,FALSE))))","v":9},null,"",{"$f":"IF(Y55=\"\",\"\",CLEAN(TRIM(C55)))","v":""},"",""]
[null,16," St Orientair ","FU ",114,31,null,0,{"$nulls":5},2,26.5,6.5,1.89,51,null,null,null,"St Orientair",{"$f":"IF(V56=\"\",\"\",IF(ISNA(VLOOKUP(V56,Data!$A$1:'Data'!$C$200,3,FALSE)),\"\",(VLOOKUP(V56,Data!$A$1:'Data'!$C$200,3,FALSE))))","v":""},null,"","","",""]
[null,17," Finagle ",7,14,31,null,0,{"$nulls":5},0,31.5,1.5,21.16,4.8,null,null,null,"Finagle",{"$f":"IF(V57=\"\",\"\",IF(ISNA(VLOOKUP(V57,Data!$A$1:'Data'!$C$200,3,FALSE)),\"\",(VLOOKUP(V57,Data!$A$1:'Data'!$C$200,3,FALSE))))","v":""},null,"","","",""]
[null,18," Crown The Warrior ","FU ",168,25.5,null,0,{"$nulls":5},1.5,22.5,10.5,0.32,301,null,null,null,"Crown The Warrior",{"$f":"IF(V58=\"\",\"\",IF(ISNA(VLOOKUP(V58,Data!$A$1:'Data'!$C$200,3,FALSE)),\"\",(VLOOKUP(V58,Data!$A$1:'Data'!$C$200,3,FALSE))))","v":""},null,"","","",""]
[null,19," Bradash ","FU ",425,null,null,0,{"$nulls":5},3,23,10,0.32,301,null,null,null,"Bradash",{"$f":"IF(V59=\"\",\"\",IF(ISNA(VLOOKUP(V59,Data!$A$1:'Data'!$C$200,3,FALSE)),\"\",(VLOOKUP(V59,Data!$A$1:'Data'!$C$200,3,FALSE))))","v":""},null,"","","",""]
[null,20," El Conde ","FU ",98,30.5,null,0,{"$nulls":5},0,22.5,10.5,0.32,301,null,null,null,"El Conde",{"$f":"IF(V60=\"\",\"\",IF(ISNA(VLOOKUP(V60,Data!$A$1:'Data'!$C$200,3,FALSE)),\"\",(VLOOKUP(V60,Data!$A$1:'Data'!$C$200,3,FALSE))))","v":""},null,"","","",""]
[null,21," Cavallo D'Oro ",8,14,29.5,null,0,{"$nulls":5},0,30.5,2.5,15.79,6.5,null,null,null,"Cavallo D'Oro",{"$f":"IF(V61=\"\",\"\",IF(ISNA(VLOOKUP(V61,Data!$A$1:'Data'!$C$200,3,FALSE)),\"\",(VLOOKUP(V61,Data!$A$1:'Data'!$C$200,3,FALSE))))","v":""},null,"","","",""]
[{"$nulls":6},"Clear","Clear","Clear","Clear","Clear","Clear",{"$nulls":9},"",{"$f":"IF(V62=\"\",\"\",IF(ISNA(VLOOKUP(V62,Data!$A$1:'Data'!$C$200,3,FALSE)),\"\",(VLOOKUP(V62,Data!$A$1:'Data'!$C$200,3,FALSE))))","v":""},null,"","","",""]
[{"$nulls":21},"",{"$f":"IF(V63=\"\",\"\",IF(ISNA(VLOOKUP(V63,Data!$A$1:'Data'!$C$200,3,FALSE)),\"\",(VLOOKUP(V63,Data!$A$1:'Data'!$C$200,3,FALSE))))","v":""},null,"","","",""]
[{"$nulls":21},"",{"$f":"IF(V64=\"\",\"\",IF(ISNA(VLOOKUP(V64,Data!$A$1:'Data'!$C$200,3,FALSE)),\"\",(VLOOKUP(V64,Data!$A$1:'Data'!$C$200,3,FALSE))))","v":""},null,"",{"$f":"IF(Y64=\"\",\"\",CLEAN(TRIM(C64)))","v":""},"",""]
[{"$nulls":21},"",{"$f":"IF(V65=\"\",\"\",IF(ISNA(VLOOKUP(V65,Data!$A$1:'Data'!$C$200,3,FALSE)),\"\",(VLOOKUP(V65,Data!$A$1:'Data'!$C$200,3,FALSE))))","v":""},null,"","","",""]
[{"$nulls":21},"",{"$f":"IF(V66=\"\",\"\",IF(ISNA(VLOOKUP(V66,Data!$A$1:'Data'!$C$200,3,FALSE)),\"\",(VLOOKUP(V66,Data!$A$1:'Data'!$C$200,3,FALSE))))","v":""},null,"","","",""]
[{"$nulls":24},"","","",""]
[{"$nulls":24},"","","",""]

{"sheet":"Data","index":1,"n_rows":45,"n_cols":24,"rows_kept":45,"cut":false,"hidden":false,"merged":[]}
[{"$f":"Neurals!B3","v":"SUNSHINE COAST"},{"$f":"Neurals!E3","v":9},{"$f":"Neurals!U1","v":"Paying"},null,"2011-03-27",null,{"$f":"IF(ISNA(VLOOKUP(A1,F2:Q40,B1+2,FALSE)),\"\",VLOOKUP(A1,F2:Q40,B1+2,FALSE))","v":""},{"$nulls":14},{"$f":"IF(W1<>\"\",CLEAN(TRIM(Meetings!W1)),\"\")","v":""},{"$f":"IF(Meetings!W1=\"\",\"\",getAddress(Meetings!W1))","v":""},{"$f":"IF(W1=\"\",\"\",RIGHT(W1,LEN(W1)-FIND(\"=\",W1,1)))","v":""}]
[{"$nulls":5},{"$f":"IF(G2=\"\",\"\",IF(ISERROR(CLEAN(TRIM((LEFT(G2,FIND(\"(\",G2,1)-1))))),\"\",CLEAN(TRIM(LEFT(G2,FIND(\"(\",G2,1)-1)))))","v":"WARWICK FARM"},{"$f":"IF(Meetings!B3=\"\",\"\",Meetings!B3)","v":"WARWICK FARM (SR)"},{"$f":"IF(Meetings!D3=\"\",\"\",getAddress(Meetings!D3))","v":"http://www.tabonline.com.au/2011/03/27/SR01.html"},{"$f":"IF(Meetings!E3=\"\",\"\",getAddress(Meetings!E3))","v":"http://www.tabonline.com.au/2011/03/27/SR02.html"},{"$f":"IF(Meetings!F3=\"\",\"\",getAddress(Meetings!F3))","v":"http://www.tabonline.com.au/2011/03/27/SR03.html"},{"$f":"IF(Meetings!G3=\"\",\"\",getAddress(Meetings!G3))","v":"http://www.tabonline.com.au/2011/03/27/SR04.html"},{"$f":"IF(Meetings!H3=\"\",\"\",getAddress(Meetings!H3))","v":"http://www.tabonline.com.au/2011/03/27/SR05.html"},{"$f":"IF(Meetings!I3=\"\",\"\",getAddress(Meetings!I3))","v":"http://www.tabonline.com.au/2011/03/27/SR06.html"},{"$f":"IF(Meetings!J3=\"\",\"\",getAddress(Meetings!J3))","v":"http://www.tabonline.com.au/2011/03/27/SR07.html"},{"$f":"IF(Meetings!K3=\"\",\"\",getAddress(Meetings!K3))","v":"http://www.tabonline.com.au/2011/03/27/SR08.html"},{"$f":"IF(Meetings!L3=\"\",\"\",getAddress(Meetings!L3))","v":""},{"$f":"IF(Meetings!M3=\"\",\"\",getAddress(Meetings!M3))","v":""},{"$f":"IF(Meetings!N3=\"\",\"\",getAddress(Meetings!N3))","v":""},{"$f":"IF(Meetings!O3=\"\",\"\",getAddress(Meetings!O3))","v":""},null,null,{"$f":"IF(W2<>\"\",CLEAN(TRIM(Meetings!W2)),\"\")","v":""},{"$f":"IF(Meetings!W2=\"\",\"\",getAddress(Meetings!W2))","v":""},{"$f":"IF(W2=\"\",\"\",RIGHT(W2,LEN(W2)-FIND(\"=\",W2,1)))","v":""}]
[{"$f":"IF(Race!N1<>\"\",(CLEAN(TRIM(Race!C1))),\"\")","v":""},{"$f":"IF(A3<>\"\",Race!I1,\"\")","v":""},{"$f":"IF($C$1<>\"\",CLEAN(TRIM(INDEX(Race!$A$1:$C20,MATCH(\"QN\",Race!$A1:$A$20,0)-4,3))),\"\")","v":"JAMESON AICH"},{"$f":"IF(ISNA(VLOOKUP(C3,Race!$C$2:$E$15,2,FALSE)),\"\",(VLOOKUP(C3,Race!$C$2:$E$15,2,FALSE)))","v":44.2},{"$f":"IF(ISNA(VLOOKUP(C3,Race!$C$2:$E$15,3,FALSE)),\"\",(VLOOKUP(C3,Race!$C$2:$E$15,3,FALSE)))","v":10.6},{"$f":"IF(G3=\"\",\"\",IF(ISERROR(CLEAN(TRIM((LEFT(G3,FIND(\"(\",G3,1)-1))))),\"\",CLEAN(TRIM(LEFT(G3,FIND(\"(\",G3,1)-1)))))","v":"SUNSHINE COAST"},{"$f":"IF(Meetings!B4=\"\",\"\",Meetings!B4)","v":"SUNSHINE COAST (QR)"},{"$f":"IF(Meetings!D4=\"\",\"\",getAddress(Meetings!D4))","v":"http://www.tabonline.com.au/2011/03/27/QR01.html"},{"$f":"IF(Meetings!E4=\"\",\"\",getAddress(Meetings!E4))","v":"http://www.tabonline.com.au/2011/03/27/QR02.html"},{"$f":"IF(Meetings!F4=\"\",\"\",getAddress(Meetings!F4))","v":"http://www.tabonline.com.au/2011/03/27/QR03.html"},{"$f":"IF(Meetings!G4=\"\",\"\",getAddress(Meetings!G4))","v":"http://www.tabonline.com.au/2011/03/27/QR04.html"},{"$f":"IF(Meetings!H4=\"\",\"\",getAddress(Meetings!H4))","v":"http://www.tabonline.com.au/2011/03/27/QR05.html"},{"$f":"IF(Meetings!I4=\"\",\"\",getAddress(Meetings!I4))","v":"http://www.tabonline.com.au/2011/03/27/QR06.html"},{"$f":"IF(Meetings!J4=\"\",\"\",getAddress(Meetings!J4))","v":"http://www.tabonline.com.au/2011/03/27/QR07.html"},{"$f":"IF(Meetings!K4=\"\",\"\",getAddress(Meetings!K4))","v":"http://www.tabonline.com.au/2011/03/27/QR08.html"},{"$f":"IF(Meetings!L4=\"\",\"\",getAddress(Meetings!L4))","v":""},{"$f":"IF(Meetings!M4=\"\",\"\",getAddress(Meetings!M4))","v":""},{"$f":"IF(Meetings!N4=\"\",\"\",getAddress(Meetings!N4))","v":""},{"$f":"IF(Meetings!O4=\"\",\"\",getAddress(Meetings!O4))","v":""},null,null,{"$f":"IF(W3<>\"\",CLEAN(TRIM(Meetings!W3)),\"\")","v":""},{"$f":"IF(Meetings!W3=\"\",\"\",getAddress(Meetings!W3))","v":""},""]
[{"$f":"IF(Race!N2<>\"\",(CLEAN(TRIM(Race!C2))),\"\")","v":""},{"$f":"IF(A4<>\"\",Race!N2,\"\")","v":""},{"$f":"IF($C$1<>\"\",CLEAN(TRIM(INDEX(Race!$A$1:$C21,MATCH(\"QN\",Race!$A2:$A$20,0)-2,3))),\"\")","v":"FINAGLE"},{"$f":"IF(ISNA(VLOOKUP(C4,Race!$C$2:$E$15,2,FALSE)),\"\",(VLOOKUP(C4,Race!$C$2:$E$15,2,FALSE)))","v":0},{"$f":"IF(ISNA(VLOOKUP(C4,Race!$C$2:$E$15,3,FALSE)),\"\",(VLOOKUP(C4,Race!$C$2:$E$15,3,FALSE)))","v":2.8},"WELLINGTON",{"$f":"IF(Meetings!B5=\"\",\"\",Meetings!B5)","v":"WELLINGTON (NR)"},{"$f":"IF(Meetings!D5=\"\",\"\",getAddress(Meetings!D5))","v":"http://www.tabonline.com.au/2011/03/27/NR01.html"},{"$f":"IF(Meetings!E5=\"\",\"\",getAddress(Meetings!E5))","v":"http://www.tabonline.com.au/2011/03/27/NR02.html"},{"$f":"IF(Meetings!F5=\"\",\"\",getAddress(Meetings!F5))","v":"http://www.tabonline.com.au/2011/03/27/NR03.html"},{"$f":"IF(Meetings!G5=\"\",\"\",getAddress(Meetings!G5))","v":"http://www.tabonline.com.au/2011/03/27/NR04.html"},{"$f":"IF(Meetings!H5=\"\",\"\",getAddress(Meetings!H5))","v":"http://www.tabonline.com.au/2011/03/27/NR05.html"},{"$f":"IF(Meetings!I5=\"\",\"\",getAddress(Meetings!I5))","v":"http://www.tabonline.com.au/2011/03/27/NR06.html"},{"$f":"IF(Meetings!J5=\"\",\"\",getAddress(Meetings!J5))","v":"http://www.tabonline.com.au/2011/03/27/NR07.html"},{"$f":"IF(Meetings!K5=\"\",\"\",getAddress(Meetings!K5))","v":"http://www.tabonline.com.au/2011/03/27/NR08.html"},{"$f":"IF(Meetings!L5=\"\",\"\",getAddress(Meetings!L5))","v":""},{"$f":"IF(Meetings!M5=\"\",\"\",getAddress(Meetings!M5))","v":""},{"$f":"IF(Meetings!N5=\"\",\"\",getAddress(Meetings!N5))","v":""},{"$f":"IF(Meetings!O5=\"\",\"\",getAddress(Meetings!O5))","v":""},null,null,{"$f":"IF(W4<>\"\",CLEAN(TRIM(Meetings!W4)),\"\")","v":""},{"$f":"IF(Meetings!W4=\"\",\"\",getAddress(Meetings!W4))","v":""},""]
[{"$f":"IF(Race!N3<>\"\",(CLEAN(TRIM(Race!C3))),\"\")","v":""},{"$f":"IF(A5<>\"\",Race!N3,\"\")","v":""},{"$f":"IF($C$1<>\"\",CLEAN(TRIM(INDEX(Race!$A$1:$C22,MATCH(\"QN\",Race!$A3:$A$20,0)-0,3))),\"\")","v":"RASCAL"},{"$f":"IF(ISNA(VLOOKUP(C5,Race!$C$2:$E$15,2,FALSE)),\"\",(VLOOKUP(C5,Race!$C$2:$E$15,2,FALSE)))","v":0},{"$f":"IF(ISNA(VLOOKUP(C5,Race!$C$2:$E$15,3,FALSE)),\"\",(VLOOKUP(C5,Race!$C$2:$E$15,3,FALSE)))","v":11.4},"CRANBOURNE",{"$f":"IF(Meetings!B6=\"\",\"\",Meetings!B6)","v":"CRANBOURNE (VR)"},{"$f":"IF(Meetings!D6=\"\",\"\",getAddress(Meetings!D6))","v":"http://www.tabonline.com.au/2011/03/27/VR01.html"},{"$f":"IF(Meetings!E6=\"\",\"\",getAddress(Meetings!E6))","v":"http://www.tabonline.com.au/2011/03/27/VR02.html"},{"$f":"IF(Meetings!F6=\"\",\"\",getAddress(Meetings!F6))","v":"http://www.tabonline.com.au/2011/03/27/VR03.html"},{"$f":"IF(Meetings!G6=\"\",\"\",getAddress(Meetings!G6))","v":"http://www.tabonline.com.au/2011/03/27/VR04.html"},{"$f":"IF(Meetings!H6=\"\",\"\",getAddress(Meetings!H6))","v":"http://www.tabonline.com.au/2011/03/27/VR05.html"},{"$f":"IF(Meetings!I6=\"\",\"\",getAddress(Meetings!I6))","v":"http://www.tabonline.com.au/2011/03/27/VR06.html"},{"$f":"IF(Meetings!J6=\"\",\"\",getAddress(Meetings!J6))","v":"http://www.tabonline.com.au/2011/03/27/VR07.html"},{"$f":"IF(Meetings!K6=\"\",\"\",getAddress(Meetings!K6))","v":"http://www.tabonline.com.au/2011/03/27/VR08.html"},{"$f":"IF(Meetings!L6=\"\",\"\",getAddress(Meetings!L6))","v":"http://www.tabonline.com.au/2011/03/27/VR09.html"},{"$f":"IF(Meetings!M6=\"\",\"\",getAddress(Meetings!M6))","v":""},{"$f":"IF(Meetings!N6=\"\",\"\",getAddress(Meetings!N6))","v":""},{"$f":"IF(Meetings!O6=\"\",\"\",getAddress(Meetings!O6))","v":""},null,null,{"$f":"IF(W5<>\"\",CLEAN(TRIM(Meetings!W5)),\"\")","v":""},{"$f":"IF(Meetings!W5=\"\",\"\",getAddress(Meetings!W5))","v":""},""]
[{"$f":"IF(Race!N4<>\"\",(CLEAN(TRIM(Race!C4))),\"\")","v":""},{"$f":"IF(A6<>\"\",Race!N4,\"\")","v":""},null,null,null,"GAWLER",{"$f":"IF(Meetings!B7=\"\",\"\",Meetings!B7)","v":"GAWLER (AR)"},{"$f":"IF(Meetings!D7=\"\",\"\",getAddress(Meetings!D7))","v":"http://www.tabonline.com.au/2011/03/27/AR01.html"},{"$f":"IF(Meetings!E7=\"\",\"\",getAddress(Meetings!E7))","v":"http://www.tabonline.com.au/2011/03/27/AR02.html"},{"$f":"IF(Meetings!F7=\"\",\"\",getAddress(Meetings!F7))","v":"http://www.tabonline.com.au/2011/03/27/AR03.html"},{"$f":"IF(Meetings!G7=\"\",\"\",getAddress(Meetings!G7))","v":"http://www.tabonline.com.au/2011/03/27/AR04.html"},{"$f":"IF(Meetings!H7=\"\",\"\",getAddress(Meetings!H7))","v":"http://www.tabonline.com.au/2011/03/27/AR05.html"},{"$f":"IF(Meetings!I7=\"\",\"\",getAddress(Meetings!I7))","v":"http://www.tabonline.com.au/2011/03/27/AR06.html"},{"$f":"IF(Meetings!J7=\"\",\"\",getAddress(Meetings!J7))","v":"http://www.tabonline.com.au/2011/03/27/AR07.html"},{"$f":"IF(Meetings!K7=\"\",\"\",getAddress(Meetings!K7))","v":"http://www.tabonline.com.au/2011/03/27/AR08.html"},{"$f":"IF(Meetings!L7=\"\",\"\",getAddress(Meetings!L7))","v":""},{"$f":"IF(Meetings!M7=\"\",\"\",getAddress(Meetings!M7))","v":""},{"$f":"IF(Meetings!N7=\"\",\"\",getAddress(Meetings!N7))","v":""},{"$f":"IF(Meetings!O7=\"\",\"\",getAddress(Meetings!O7))","v":""},null,null,{"$f":"IF(W6<>\"\",CLEAN(TRIM(Meetings!W6)),\"\")","v":""},{"$f":"IF(Meetings!W6=\"\",\"\",getAddress(Meetings!W6))","v":""},""]
[{"$f":"IF(Race!N5<>\"\",(CLEAN(TRIM(Race!C5))),\"\")","v":""},{"$f":"IF(A7<>\"\",Race!N5,\"\")","v":""},{"$f":"IF(A7<>\"\",Race!I5,\"\")","v":""},null,null,"GERALDTON",{"$f":"IF(Meetings!B8=\"\",\"\",Meetings!B8)","v":"GERALDTON (PR)"},{"$f":"IF(Meetings!D8=\"\",\"\",getAddress(Meetings!D8))","v":"http://www.tabonline.com.au/2011/03/27/PR01.html"},{"$f":"IF(Meetings!E8=\"\",\"\",getAddress(Meetings!E8))","v":"http://www.tabonline.com.au/2011/03/27/PR02.html"},{"$f":"IF(Meetings!F8=\"\",\"\",getAddress(Meetings!F8))","v":"http://www.tabonline.com.au/2011/03/27/PR03.html"},{"$f":"IF(Meetings!G8=\"\",\"\",getAddress(Meetings!G8))","v":"http://www.tabonline.com.au/2011/03/27/PR04.html"},{"$f":"IF(Meetings!H8=\"\",\"\",getAddress(Meetings!H8))","v":"http://www.tabonline.com.au/2011/03/27/PR05.html"},{"$f":"IF(Meetings!I8=\"\",\"\",getAddress(Meetings!I8))","v":"http://www.tabonline.com.au/2011/03/27/PR06.html"},{"$f":"IF(Meetings!J8=\"\",\"\",getAddress(Meetings!J8))","v":"http://www.tabonline.com.au/2011/03/27/PR07.html"},{"$f":"IF(Meetings!K8=\"\",\"\",getAddress(Meetings!K8))","v":"http://www.tabonline.com.au/2011/03/27/PR08.html"},{"$f":"IF(Meetings!L8=\"\",\"\",getAddress(Meetings!L8))","v":""},{"$f":"IF(Meetings!M8=\"\",\"\",getAddress(Meetings!M8))","v":""},{"$f":"IF(Meetings!N8=\"\",\"\",getAddress(Meetings!N8))","v":""},{"$f":"IF(Meetings!O8=\"\",\"\",getAddress(Meetings!O8))","v":""},null,null,{"$f":"IF(W7<>\"\",CLEAN(TRIM(Meetings!W7)),\"\")","v":""},{"$f":"IF(Meetings!W7=\"\",\"\",getAddress(Meetings!W7))","v":""},""]
[{"$f":"IF(Race!N6<>\"\",(CLEAN(TRIM(Race!C6))),\"\")","v":""},{"$f":"IF(A8<>\"\",Race!N6,\"\")","v":""},{"$f":"IF(A8<>\"\",Race!I6,\"\")","v":""},null,null,"WANGARATTA",{"$f":"IF(Meetings!B9=\"\",\"\",Meetings!B9)","v":"WANGARATTA (ER)"},{"$f":"IF(Meetings!D9=\"\",\"\",getAddress(Meetings!D9))","v":"http://www.tabonline.com.au/2011/03/27/ER01.html"},{"$f":"IF(Meetings!E9=\"\",\"\",getAddress(Meetings!E9))","v":"http://www.tabonline.com.au/2011/03/27/ER02.html"},{"$f":"IF(Meetings!F9=\"\",\"\",getAddress(Meetings!F9))","v":"http://www.tabonline.com.au/2011/03/27/ER03.html"},{"$f":"IF(Meetings!G9=\"\",\"\",getAddress(Meetings!G9))","v":"http://www.tabonline.com.au/2011/03/27/ER04.html"},{"$f":"IF(Meetings!H9=\"\",\"\",getAddress(Meetings!H9))","v":"http://www.tabonline.com.au/2011/03/27/ER05.html"},{"$f":"IF(Meetings!I9=\"\",\"\",getAddress(Meetings!I9))","v":"http://www.tabonline.com.au/2011/03/27/ER06.html"},{"$f":"IF(Meetings!J9=\"\",\"\",getAddress(Meetings!J9))","v":"http://www.tabonline.com.au/2011/03/27/ER07.html"},{"$f":"IF(Meetings!K9=\"\",\"\",getAddress(Meetings!K9))","v":""},{"$f":"IF(Meetings!L9=\"\",\"\",getAddress(Meetings!L9))","v":""},{"$f":"IF(Meetings!M9=\"\",\"\",getAddress(Meetings!M9))","v":""},{"$f":"IF(Meetings!N9=\"\",\"\",getAddress(Meetings!N9))","v":""},{"$f":"IF(Meetings!O9=\"\",\"\",getAddress(Meetings!O9))","v":""},null,null,{"$f":"IF(W8<>\"\",CLEAN(TRIM(Meetings!W8)),\"\")","v":""},{"$f":"IF(Meetings!W8=\"\",\"\",getAddress(Meetings!W8))","v":""},""]
[{"$f":"IF(Race!N7<>\"\",(CLEAN(TRIM(Race!C7))),\"\")","v":""},{"$f":"IF(A9<>\"\",Race!N7,\"\")","v":""},{"$f":"IF(A9<>\"\",Race!I7,\"\")","v":""},null,null,"HOBART",{"$f":"IF(Meetings!B10=\"\",\"\",Meetings!B10)","v":"HOBART (TR)"},{"$f":"IF(Meetings!D10=\"\",\"\",getAddress(Meetings!D10))","v":"http://www.tabonline.com.au/2011/03/27/TR01.html"},{"$f":"IF(Meetings!E10=\"\",\"\",getAddress(Meetings!E10))","v":"http://www.tabonline.com.au/2011/03/27/TR02.html"},{"$f":"IF(Meetings!F10=\"\",\"\",getAddress(Meetings!F10))","v":"http://www.tabonline.com.au/2011/03/27/TR03.html"},{"$f":"IF(Meetings!G10=\"\",\"\",getAddress(Meetings!G10))","v":"http://www.tabonline.com.au/2011/03/27/TR04.html"},{"$f":"IF(Meetings!H10=\"\",\"\",getAddress(Meetings!H10))","v":"http://www.tabonline.com.au/2011/03/27/TR05.html"},{"$f":"IF(Meetings!I10=\"\",\"\",getAddress(Meetings!I10))","v":"http://www.tabonline.com.au/2011/03/27/TR06.html"},{"$f":"IF(Meetings!J10=\"\",\"\",getAddress(Meetings!J10))","v":"http://www.tabonline.com.au/2011/03/27/TR07.html"},{"$f":"IF(Meetings!K10=\"\",\"\",getAddress(Meetings!K10))","v":"http://www.tabonline.com.au/2011/03/27/TR08.html"},{"$f":"IF(Meetings!L10=\"\",\"\",getAddress(Meetings!L10))","v":""},{"$f":"IF(Meetings!M10=\"\",\"\",getAddress(Meetings!M10))","v":""},{"$f":"IF(Meetings!N10=\"\",\"\",getAddress(Meetings!N10))","v":""},{"$f":"IF(Meetings!O10=\"\",\"\",getAddress(Meetings!O10))","v":""},null,null,{"$f":"IF(W9<>\"\",CLEAN(TRIM(Meetings!W9)),\"\")","v":""},{"$f":"IF(Meetings!W9=\"\",\"\",getAddress(Meetings!W9))","v":""},""]
[{"$f":"IF(Race!N8<>\"\",(CLEAN(TRIM(Race!C8))),\"\")","v":""},{"$f":"IF(A10<>\"\",Race!N8,\"\")","v":""},{"$f":"IF(A10<>\"\",Race!I8,\"\")","v":""},null,null,"MACKAY",{"$f":"IF(Meetings!B11=\"\",\"\",Meetings!B11)","v":"MACKAY (IR)"},{"$f":"IF(Meetings!D11=\"\",\"\",getAddress(Meetings!D11))","v":"http://www.tabonline.com.au/2011/03/27/IR01.html"},{"$f":"IF(Meetings!E11=\"\",\"\",getAddress(Meetings!E11))","v":"http://www.tabonline.com.au/2011/03/27/IR02.html"},{"$f":"IF(Meetings!F11=\"\",\"\",getAddress(Meetings!F11))","v":"http://www.tabonline.com.au/2011/03/27/IR03.html"},{"$f":"IF(Meetings!G11=\"\",\"\",getAddress(Meetings!G11))","v":"http://www.tabonline.com.au/2011/03/27/IR04.html"},{"$f":"IF(Meetings!H11=\"\",\"\",getAddress(Meetings!H11))","v":"http://www.tabonline.com.au/2011/03/27/IR05.html"},{"$f":"IF(Meetings!I11=\"\",\"\",getAddress(Meetings!I11))","v":"http://www.tabonline.com.au/2011/03/27/IR06.html"},{"$f":"IF(Meetings!J11=\"\",\"\",getAddress(Meetings!J11))","v":"http://www.tabonline.com.au/2011/03/27/IR07.html"},{"$f":"IF(Meetings!K11=\"\",\"\",getAddress(Meetings!K11))","v":""},{"$f":"IF(Meetings!L11=\"\",\"\",getAddress(Meetings!L11))","v":""},{"$f":"IF(Meetings!M11=\"\",\"\",getAddress(Meetings!M11))","v":""},{"$f":"IF(Meetings!N11=\"\",\"\",getAddress(Meetings!N11))","v":""},{"$f":"IF(Meetings!O11=\"\",\"\",getAddress(Meetings!O11))","v":""},null,null,{"$f":"IF(W10<>\"\",CLEAN(TRIM(Meetings!W10)),\"\")","v":""},{"$f":"IF(Meetings!W10=\"\",\"\",getAddress(Meetings!W10))","v":""},""]
[{"$f":"IF(Race!N9<>\"\",(CLEAN(TRIM(Race!C9))),\"\")","v":""},{"$f":"IF(A11<>\"\",Race!N9,\"\")","v":""},{"$f":"IF(A11<>\"\",Race!I9,\"\")","v":""},null,null,"KRANJI",{"$f":"IF(Meetings!B12=\"\",\"\",Meetings!B12)","v":"KRANJI (SS)"},{"$f":"IF(Meetings!D12=\"\",\"\",getAddress(Meetings!D12))","v":"http://www.tabonline.com.au/2011/03/27/SS01.html"},{"$f":"IF(Meetings!E12=\"\",\"\",getAddress(Meetings!E12))","v":"http://www.tabonline.com.au/2011/03/27/SS02.html"},{"$f":"IF(Meetings!F12=\"\",\"\",getAddress(Meetings!F12))","v":"http://www.tabonline.com.au/2011/03/27/SS03.html"},{"$f":"IF(Meetings!G12=\"\",\"\",getAddress(Meetings!G12))","v":"http://www.tabonline.com.au/2011/03/27/SS04.html"},{"$f":"IF(Meetings!H12=\"\",\"\",getAddress(Meetings!H12))","v":"http://www.tabonline.com.au/2011/03/27/SS05.html"},{"$f":"IF(Meetings!I12=\"\",\"\",getAddress(Meetings!I12))","v":"http://www.tabonline.com.au/2011/03/27/SS06.html"},{"$f":"IF(Meetings!J12=\"\",\"\",getAddress(Meetings!J12))","v":"http://www.tabonline.com.au/2011/03/27/SS07.html"},{"$f":"IF(Meetings!K12=\"\",\"\",getAddress(Meetings!K12))","v":"http://www.tabonline.com.au/2011/03/27/SS08.html"},{"$f":"IF(Meetings!L12=\"\",\"\",getAddress(Meetings!L12))","v":"http://www.tabonline.com.au/2011/03/27/SS09.html"},{"$f":"IF(Meetings!M12=\"\",\"\",getAddress(Meetings!M12))","v":"http://www.tabonline.com.au/2011/03/27/SS10.html"},{"$f":"IF(Meetings!N12=\"\",\"\",getAddress(Meetings!N12))","v":"http://www.tabonline.com.au/2011/03/27/SS11.html"},{"$f":"IF(Meetings!O12=\"\",\"\",getAddress(Meetings!O12))","v":""},null,null,{"$f":"IF(W11<>\"\",CLEAN(TRIM(Meetings!W11)),\"\")","v":""},{"$f":"IF(Meetings!W11=\"\",\"\",getAddress(Meetings!W11))","v":""},""]
[{"$f":"IF(Race!N10<>\"\",(CLEAN(TRIM(Race!C10))),\"\")","v":""},{"$f":"IF(A12<>\"\",Race!N10,\"\")","v":""},{"$f":"IF(A12<>\"\",Race!I10,\"\")","v":""},null,null,"SCOTTSVILLE",{"$f":"IF(Meetings!B13=\"\",\"\",Meetings!B13)","v":"SCOTTSVILLE (AS)"},{"$f":"IF(Meetings!D13=\"\",\"\",getAddress(Meetings!D13))","v":"http://www.tabonline.com.au/2011/03/27/AS01.html"},{"$f":"IF(Meetings!E13=\"\",\"\",getAddress(Meetings!E13))","v":"http://www.tabonline.com.au/2011/03/27/AS02.html"},{"$f":"IF(Meetings!F13=\"\",\"\",getAddress(Meetings!F13))","v":"http://www.tabonline.com.au/2011/03/27/AS03.html"},{"$f":"IF(Meetings!G13=\"\",\"\",getAddress(Meetings!G13))","v":"http://www.tabonline.com.au/2011/03/27/AS04.html"},{"$f":"IF(Meetings!H13=\"\",\"\",getAddress(Meetings!H13))","v":"http://www.tabonline.com.au/2011/03/27/AS05.html"},{"$f":"IF(Meetings!I13=\"\",\"\",getAddress(Meetings!I13))","v":"http://www.tabonline.com.au/2011/03/27/AS06.html"},{"$f":"IF(Meetings!J13=\"\",\"\",getAddress(Meetings!J13))","v":"http://www.tabonline.com.au/2011/03/27/AS07.html"},{"$f":"IF(Meetings!K13=\"\",\"\",getAddress(Meetings!K13))","v":"http://www.tabonline.com.au/2011/03/27/AS08.html"},{"$f":"IF(Meetings!L13=\"\",\"\",getAddress(Meetings!L13))","v":"http://www.tabonline.com.au/2011/03/27/AS09.html"},{"$f":"IF(Meetings!M13=\"\",\"\",getAddress(Meetings!M13))","v":""},{"$f":"IF(Meetings!N13=\"\",\"\",getAddress(Meetings!N13))","v":""},{"$f":"IF(Meetings!O13=\"\",\"\",getAddress(Meetings!O13))","v":""},null,null,{"$f":"IF(W12<>\"\",CLEAN(TRIM(Meetings!W12)),\"\")","v":""},{"$f":"IF(Meetings!W12=\"\",\"\",getAddress(Meetings!W12))","v":""},""]
[{"$f":"IF(Race!N11<>\"\",(CLEAN(TRIM(Race!C11))),\"\")","v":""},{"$f":"IF(A13<>\"\",Race!N11,\"\")","v":""},{"$f":"IF(A13<>\"\",Race!I11,\"\")","v":""},null,null,"UK",{"$f":"IF(Meetings!B14=\"\",\"\",Meetings!B14)","v":"UK (CS)"},{"$f":"IF(Meetings!D14=\"\",\"\",getAddress(Meetings!D14))","v":"http://www.tabonline.com.au/2011/03/27/CS01.html"},{"$f":"IF(Meetings!E14=\"\",\"\",getAddress(Meetings!E14))","v":"http://www.tabonline.com.au/2011/03/27/CS02.html"},{"$f":"IF(Meetings!F14=\"\",\"\",getAddress(Meetings!F14))","v":"http://www.tabonline.com.au/2011/03/27/CS03.html"},{"$f":"IF(Meetings!G14=\"\",\"\",getAddress(Meetings!G14))","v":""},{"$f":"IF(Meetings!H14=\"\",\"\",getAddress(Meetings!H14))","v":""},{"$f":"IF(Meetings!I14=\"\",\"\",getAddress(Meetings!I14))","v":""},{"$f":"IF(Meetings!J14=\"\",\"\",getAddress(Meetings!J14))","v":""},{"$f":"IF(Meetings!K14=\"\",\"\",getAddress(Meetings!K14))","v":""},{"$f":"IF(Meetings!L14=\"\",\"\",getAddress(Meetings!L14))","v":""},{"$f":"IF(Meetings!M14=\"\",\"\",getAddress(Meetings!M14))","v":""},{"$f":"IF(Meetings!N14=\"\",\"\",getAddress(Meetings!N14))","v":""},{"$f":"IF(Meetings!O14=\"\",\"\",getAddress(Meetings!O14))","v":""},null,null,{"$f":"IF(W13<>\"\",CLEAN(TRIM(Meetings!W13)),\"\")","v":""},{"$f":"IF(Meetings!W13=\"\",\"\",getAddress(Meetings!W13))","v":""},""]
[{"$f":"IF(Race!N12<>\"\",(CLEAN(TRIM(Race!C12))),\"\")","v":""},{"$f":"IF(A14<>\"\",Race!N12,\"\")","v":""},{"$f":"IF(A14<>\"\",Race!I12,\"\")","v":""},null,null,"ENGLAND",{"$f":"IF(Meetings!B15=\"\",\"\",Meetings!B15)","v":"ENGLAND (ES)"},{"$f":"IF(Meetings!D15=\"\",\"\",getAddress(Meetings!D15))","v":"http://www.tabonline.com.au/2011/03/27/ES01.html"},{"$f":"IF(Meetings!E15=\"\",\"\",getAddress(Meetings!E15))","v":"http://www.tabonline.com.au/2011/03/27/ES02.html"},{"$f":"IF(Meetings!F15=\"\",\"\",getAddress(Meetings!F15))","v":"http://www.tabonline.com.au/2011/03/27/ES03.html"},{"$f":"IF(Meetings!G15=\"\",\"\",getAddress(Meetings!G15))","v":"http://www.tabonline.com.au/2011/03/27/ES04.html"},{"$f":"IF(Meetings!H15=\"\",\"\",getAddress(Meetings!H15))","v":""},{"$f":"IF(Meetings!I15=\"\",\"\",getAddress(Meetings!I15))","v":""},{"$f":"IF(Meetings!J15=\"\",\"\",getAddress(Meetings!J15))","v":""},{"$f":"IF(Meetings!K15=\"\",\"\",getAddress(Meetings!K15))","v":""},{"$f":"IF(Meetings!L15=\"\",\"\",getAddress(Meetings!L15))","v":""},{"$f":"IF(Meetings!M15=\"\",\"\",getAddress(Meetings!M15))","v":""},{"$f":"IF(Meetings!N15=\"\",\"\",getAddress(Meetings!N15))","v":""},{"$f":"IF(Meetings!O15=\"\",\"\",getAddress(Meetings!O15))","v":""},null,null,{"$f":"IF(W14<>\"\",CLEAN(TRIM(Meetings!W14)),\"\")","v":"Cranbourne"},{"$f":"IF(Meetings!W14=\"\",\"\",getAddress(Meetings!W14))","v":"http://www.racingandsports.com.au/form-guide/meeting.asp?meeting=16325"},"16325"]
[{"$f":"IF(Race!N13<>\"\",(CLEAN(TRIM(Race!C13))),\"\")","v":""},{"$f":"IF(A15<>\"\",Race!N13,\"\")","v":""},{"$f":"IF(A15<>\"\",Race!I13,\"\")","v":""},null,null,"SHA TIN",{"$f":"IF(Meetings!B16=\"\",\"\",Meetings!B16)","v":"SHA TIN (OS)"},{"$f":"IF(Meetings!D16=\"\",\"\",getAddress(Meetings!D16))","v":"http://www.tabonline.com.au/2011/03/27/OS01.html"},{"$f":"IF(Meetings!E16=\"\",\"\",getAddress(Meetings!E16))","v":"http://www.tabonline.com.au/2011/03/27/OS02.html"},{"$f":"IF(Meetings!F16=\"\",\"\",getAddress(Meetings!F16))","v":"http://www.tabonline.com.au/2011/03/27/OS03.html"},{"$f":"IF(Meetings!G16=\"\",\"\",getAddress(Meetings!G16))","v":"http://www.tabonline.com.au/2011/03/27/OS04.html"},{"$f":"IF(Meetings!H16=\"\",\"\",getAddress(Meetings!H16))","v":"http://www.tabonline.com.au/2011/03/27/OS05.html"},{"$f":"IF(Meetings!I16=\"\",\"\",getAddress(Meetings!I16))","v":"http://www.tabonline.com.au/2011/03/27/OS06.html"},{"$f":"IF(Meetings!J16=\"\",\"\",getAddress(Meetings!J16))","v":"http://www.tabonline.com.au/2011/03/27/OS07.html"},{"$f":"IF(Meetings!K16=\"\",\"\",getAddress(Meetings!K16))","v":"http://www.tabonline.com.au/2011/03/27/OS08.html"},{"$f":"IF(Meetings!L16=\"\",\"\",getAddress(Meetings!L16))","v":"http://www.tabonline.com.au/2011/03/27/OS09.html"},{"$f":"IF(Meetings!M16=\"\",\"\",getAddress(Meetings!M16))","v":"http://www.tabonline.com.au/2011/03/27/OS10.html"},{"$f":"IF(Meetings!N16=\"\",\"\",getAddress(Meetings!N16))","v":""},{"$f":"IF(Meetings!O16=\"\",\"\",getAddress(Meetings!O16))","v":""},null,null,{"$f":"IF(W15<>\"\",CLEAN(TRIM(Meetings!W15)),\"\")","v":"Gawler"},{"$f":"IF(Meetings!W15=\"\",\"\",getAddress(Meetings!W15))","v":"http://www.racingandsports.com.au/form-guide/meeting.asp?meeting=16326"},"16326"]
[{"$f":"IF(Race!N14<>\"\",(CLEAN(TRIM(Race!C14))),\"\")","v":""},{"$f":"IF(A16<>\"\",Race!N14,\"\")","v":""},{"$f":"IF(A16<>\"\",Race!I14,\"\")","v":""},null,null,"WAIPUKURAU",{"$f":"IF(Meetings!B17=\"\",\"\",Meetings!B17)","v":"WAIPUKURAU (ZS)"},{"$f":"IF(Meetings!D17=\"\",\"\",getAddress(Meetings!D17))","v":"http://www.tabonline.com.au/2011/03/27/ZS01.html"},{"$f":"IF(Meetings!E17=\"\",\"\",getAddress(Meetings!E17))","v":"http://www.tabonline.com.au/2011/03/27/ZS02.html"},{"$f":"IF(Meetings!F17=\"\",\"\",getAddress(Meetings!F17))","v":"http://www.tabonline.com.au/2011/03/27/ZS03.html"},{"$f":"IF(Meetings!G17=\"\",\"\",getAddress(Meetings!G17))","v":"http://www.tabonline.com.au/2011/03/27/ZS04.html"},{"$f":"IF(Meetings!H17=\"\",\"\",getAddress(Meetings!H17))","v":"http://www.tabonline.com.au/2011/03/27/ZS05.html"},{"$f":"IF(Meetings!I17=\"\",\"\",getAddress(Meetings!I17))","v":"http://www.tabonline.com.au/2011/03/27/ZS06.html"},{"$f":"IF(Meetings!J17=\"\",\"\",getAddress(Meetings!J17))","v":"http://www.tabonline.com.au/2011/03/27/ZS07.html"},{"$f":"IF(Meetings!K17=\"\",\"\",getAddress(Meetings!K17))","v":"http://www.tabonline.com.au/2011/03/27/ZS08.html"},{"$f":"IF(Meetings!L17=\"\",\"\",getAddress(Meetings!L17))","v":"http://www.tabonline.com.au/2011/03/27/ZS09.html"},{"$f":"IF(Meetings!M17=\"\",\"\",getAddress(Meetings!M17))","v":""},{"$f":"IF(Meetings!N17=\"\",\"\",getAddress(Meetings!N17))","v":""},{"$f":"IF(Meetings!O17=\"\",\"\",getAddress(Meetings!O17))","v":""},null,null,{"$f":"IF(W16<>\"\",CLEAN(TRIM(Meetings!W16)),\"\")","v":"Geraldton"},{"$f":"IF(Meetings!W16=\"\",\"\",getAddress(Meetings!W16))","v":"http://www.racingandsports.com.au/form-guide/meeting.asp?meeting=16302"},"16302"]
[{"$f":"IF(Race!N15<>\"\",(CLEAN(TRIM(Race!C15))),\"\")","v":""},{"$f":"IF(A17<>\"\",Race!N15,\"\")","v":""},{"$f":"IF(A17<>\"\",Race!I15,\"\")","v":""},null,null,"LEOPARDSTOWN",{"$f":"IF(Meetings!B18=\"\",\"\",Meetings!B18)","v":"LEOPARDSTOWN (IS)"},{"$f":"IF(Meetings!D18=\"\",\"\",getAddress(Meetings!D18))","v":"http://www.tabonline.com.au/2011/03/27/IS01.html"},{"$f":"IF(Meetings!E18=\"\",\"\",getAddress(Meetings!E18))","v":"http://www.tabonline.com.au/2011/03/27/IS02.html"},{"$f":"IF(Meetings!F18=\"\",\"\",getAddress(Meetings!F18))","v":"http://www.tabonline.com.au/2011/03/27/IS03.html"},{"$f":"IF(Meetings!G18=\"\",\"\",getAddress(Meetings!G18))","v":""},{"$f":"IF(Meetings!H18=\"\",\"\",getAddress(Meetings!H18))","v":""},{"$f":"IF(Meetings!I18=\"\",\"\",getAddress(Meetings!I18))","v":""},{"$f":"IF(Meetings!J18=\"\",\"\",getAddress(Meetings!J18))","v":""},{"$f":"IF(Meetings!K18=\"\",\"\",getAddress(Meetings!K18))","v":""},{"$f":"IF(Meetings!L18=\"\",\"\",getAddress(Meetings!L18))","v":""},{"$f":"IF(Meetings!M18=\"\",\"\",getAddress(Meetings!M18))","v":""},{"$f":"IF(Meetings!N18=\"\",\"\",getAddress(Meetings!N18))","v":""},{"$f":"IF(Meetings!O18=\"\",\"\",getAddress(Meetings!O18))","v":""},null,null,{"$f":"IF(W17<>\"\",CLEAN(TRIM(Meetings!W17)),\"\")","v":"Hobart"},{"$f":"IF(Meetings!W17=\"\",\"\",getAddress(Meetings!W17))","v":"http://www.racingandsports.com.au/form-guide/meeting.asp?meeting=16293"},"16293"]
[{"$f":"IF(Race!N16<>\"\",(CLEAN(TRIM(Race!C16))),\"\")","v":""},{"$f":"IF(A18<>\"\",Race!N16,\"\")","v":""},{"$f":"IF(A18<>\"\",Race!I16,\"\")","v":""},null,null,"",{"$f":"IF(Meetings!B19=\"\",\"\",Meetings!B19)","v":""},{"$f":"IF(Meetings!D19=\"\",\"\",getAddress(Meetings!D19))","v":{"$error":"#VALUE!"}},{"$f":"IF(Meetings!E19=\"\",\"\",getAddress(Meetings!E19))","v":{"$error":"#VALUE!"}},{"$f":"IF(Meetings!F19=\"\",\"\",getAddress(Meetings!F19))","v":{"$error":"#VALUE!"}},{"$f":"IF(Meetings!G19=\"\",\"\",getAddress(Meetings!G19))","v":{"$error":"#VALUE!"}},{"$f":"IF(Meetings!H19=\"\",\"\",getAddress(Meetings!H19))","v":{"$error":"#VALUE!"}},{"$f":"IF(Meetings!I19=\"\",\"\",getAddress(Meetings!I19))","v":{"$error":"#VALUE!"}},{"$f":"IF(Meetings!J19=\"\",\"\",getAddress(Meetings!J19))","v":{"$error":"#VALUE!"}},{"$f":"IF(Meetings!K19=\"\",\"\",getAddress(Meetings!K19))","v":{"$error":"#VALUE!"}},{"$f":"IF(Meetings!L19=\"\",\"\",getAddress(Meetings!L19))","v":{"$error":"#VALUE!"}},{"$f":"IF(Meetings!M19=\"\",\"\",getAddress(Meetings!M19))","v":{"$error":"#VALUE!"}},{"$f":"IF(Meetings!N19=\"\",\"\",getAddress(Meetings!N19))","v":{"$error":"#VALUE!"}},{"$f":"IF(Meetings!O19=\"\",\"\",getAddress(Meetings!O19))","v":{"$error":"#VALUE!"}},null,null,{"$f":"IF(W18<>\"\",CLEAN(TRIM(Meetings!W18)),\"\")","v":"Mackay"},{"$f":"IF(Meetings!W18=\"\",\"\",getAddress(Meetings!W18))","v":"http://www.racingandsports.com.au/form-guide/meeting.asp?meeting=16327"},"16327"]
[{"$f":"IF(Race!N17<>\"\",(CLEAN(TRIM(Race!C17))),\"\")","v":""},{"$f":"IF(A19<>\"\",Race!N17,\"\")","v":""},{"$f":"IF(A19<>\"\",Race!I17,\"\")","v":""},null,null,"TAMWORTH",{"$f":"IF(Meetings!B20=\"\",\"\",Meetings!B20)","v":"TAMWORTH (ST)"},{"$f":"IF(Meetings!D20=\"\",\"\",getAddress(Meetings!D20))","v":"http://www.tabonline.com.au/2011/03/27/ST01.html"},{"$f":"IF(Meetings!E20=\"\",\"\",getAddress(Meetings!E20))","v":"http://www.tabonline.com.au/2011/03/27/ST02.html"},{"$f":"IF(Meetings!F20=\"\",\"\",getAddress(Meetings!F20))","v":"http://www.tabonline.com.au/2011/03/27/ST03.html"},{"$f":"IF(Meetings!G20=\"\",\"\",getAddress(Meetings!G20))","v":"http://www.tabonline.com.au/2011/03/27/ST04.html"},{"$f":"IF(Meetings!H20=\"\",\"\",getAddress(Meetings!H20))","v":"http://www.tabonline.com.au/2011/03/27/ST05.html"},{"$f":"IF(Meetings!I20=\"\",\"\",getAddress(Meetings!I20))","v":"http://www.tabonline.com.au/2011/03/27/ST06.html"},{"$f":"IF(Meetings!J20=\"\",\"\",getAddress(Meetings!J20))","v":"http://www.tabonline.com.au/2011/03/27/ST07.html"},{"$f":"IF(Meetings!K20=\"\",\"\",getAddress(Meetings!K20))","v":"http://www.tabonline.com.au/2011/03/27/ST08.html"},{"$f":"IF(Meetings!L20=\"\",\"\",getAddress(Meetings!L20))","v":""},{"$f":"IF(Meetings!M20=\"\",\"\",getAddress(Meetings!M20))","v":""},{"$f":"IF(Meetings!N20=\"\",\"\",getAddress(Meetings!N20))","v":""},{"$f":"IF(Meetings!O20=\"\",\"\",getAddress(Meetings!O20))","v":""},null,null,{"$f":"IF(W19<>\"\",CLEAN(TRIM(Meetings!W19)),\"\")","v":"Sunshine Coast"},{"$f":"IF(Meetings!W19=\"\",\"\",getAddress(Meetings!W19))","v":"http://www.racingandsports.com.au/form-guide/meeting.asp?meeting=16324"},"16324"]
[{"$f":"IF(Race!N18<>\"\",(CLEAN(TRIM(Race!C18))),\"\")","v":""},{"$f":"IF(A20<>\"\",Race!N18,\"\")","v":""},{"$f":"IF(A20<>\"\",Race!I18,\"\")","v":""},null,null,"ECHUCA",{"$f":"IF(Meetings!B21=\"\",\"\",Meetings!B21)","v":"ECHUCA (MT)"},{"$f":"IF(Meetings!D21=\"\",\"\",getAddress(Meetings!D21))","v":"http://www.tabonline.com.au/2011/03/27/MT01.html"},{"$f":"IF(Meetings!E21=\"\",\"\",getAddress(Meetings!E21))","v":"http://www.tabonline.com.au/2011/03/27/MT02.html"},{"$f":"IF(Meetings!F21=\"\",\"\",getAddress(Meetings!F21))","v":"http://www.tabonline.com.au/2011/03/27/MT03.html"},{"$f":"IF(Meetings!G21=\"\",\"\",getAddress(Meetings!G21))","v":"http://www.tabonline.com.au/2011/03/27/MT04.html"},{"$f":"IF(Meetings!H21=\"\",\"\",getAddress(Meetings!H21))","v":"http://www.tabonline.com.au/2011/03/27/MT05.html"},{"$f":"IF(Meetings!I21=\"\",\"\",getAddress(Meetings!I21))","v":"http://www.tabonline.com.au/2011/03/27/MT06.html"},{"$f":"IF(Meetings!J21=\"\",\"\",getAddress(Meetings!J21))","v":"http://www.tabonline.com.au/2011/03/27/MT07.html"},{"$f":"IF(Meetings!K21=\"\",\"\",getAddress(Meetings!K21))","v":"http://www.tabonline.com.au/2011/03/27/MT08.html"},{"$f":"IF(Meetings!L21=\"\",\"\",getAddress(Meetings!L21))","v":""},{"$f":"IF(Meetings!M21=\"\",\"\",getAddress(Meetings!M21))","v":""},{"$f":"IF(Meetings!N21=\"\",\"\",getAddress(Meetings!N21))","v":""},{"$f":"IF(Meetings!O21=\"\",\"\",getAddress(Meetings!O21))","v":""},null,null,{"$f":"IF(W20<>\"\",CLEAN(TRIM(Meetings!W20)),\"\")","v":"Wangaratta"},{"$f":"IF(Meetings!W20=\"\",\"\",getAddress(Meetings!W20))","v":"http://www.racingandsports.com.au/form-guide/meeting.asp?meeting=16329"},"16329"]
[{"$f":"IF(Race!N19<>\"\",(CLEAN(TRIM(Race!C19))),\"\")","v":"Name"},{"$f":"IF(A21<>\"\",Race!N19,\"\")","v":"Rtng"},{"$f":"IF(A21<>\"\",Race!I19,\"\")","v":"Bar"},null,null,"CRANBOURNE",{"$f":"IF(Meetings!B22=\"\",\"\",Meetings!B22)","v":"CRANBOURNE (VT)"},{"$f":"IF(Meetings!D22=\"\",\"\",getAddress(Meetings!D22))","v":"http://www.tabonline.com.au/2011/03/27/VT01.html"},{"$f":"IF(Meetings!E22=\"\",\"\",getAddress(Meetings!E22))","v":"http://www.tabonline.com.au/2011/03/27/VT02.html"},{"$f":"IF(Meetings!F22=\"\",\"\",getAddress(Meetings!F22))","v":"http://www.tabonline.com.au/2011/03/27/VT03.html"},{"$f":"IF(Meetings!G22=\"\",\"\",getAddress(Meetings!G22))","v":"http://www.tabonline.com.au/2011/03/27/VT04.html"},{"$f":"IF(Meetings!H22=\"\",\"\",getAddress(Meetings!H22))","v":"http://www.tabonline.com.au/2011/03/27/VT05.html"},{"$f":"IF(Meetings!I22=\"\",\"\",getAddress(Meetings!I22))","v":"http://www.tabonline.com.au/2011/03/27/VT06.html"},{"$f":"IF(Meetings!J22=\"\",\"\",getAddress(Meetings!J22))","v":"http://www.tabonline.com.au/2011/03/27/VT07.html"},{"$f":"IF(Meetings!K22=\"\",\"\",getAddress(Meetings!K22))","v":""},{"$f":"IF(Meetings!L22=\"\",\"\",getAddress(Meetings!L22))","v":""},{"$f":"IF(Meetings!M22=\"\",\"\",getAddress(Meetings!M22))","v":""},{"$f":"IF(Meetings!N22=\"\",\"\",getAddress(Meetings!N22))","v":""},{"$f":"IF(Meetings!O22=\"\",\"\",getAddress(Meetings!O22))","v":""},null,null,{"$f":"IF(W21<>\"\",CLEAN(TRIM(Meetings!W21)),\"\")","v":"Warwick Farm"},{"$f":"IF(Meetings!W21=\"\",\"\",getAddress(Meetings!W21))","v":"http://www.racingandsports.com.au/form-guide/meeting.asp?meeting=16331"},"16331"]
[{"$f":"IF(Race!N20<>\"\",(CLEAN(TRIM(Race!C20))),\"\")","v":"ENEMYATTHEGATE"},{"$f":"IF(A22<>\"\",Race!N20,\"\")","v":92},{"$f":"IF(A22<>\"\",Race!I20,\"\")","v":17},null,null,"METHVEN",{"$f":"IF(Meetings!B23=\"\",\"\",Meetings!B23)","v":"METHVEN (ZT)"},{"$f":"IF(Meetings!D23=\"\",\"\",getAddress(Meetings!D23))","v":"http://www.tabonline.com.au/2011/03/27/ZT01.html"},{"$f":"IF(Meetings!E23=\"\",\"\",getAddress(Meetings!E23))","v":"http://www.tabonline.com.au/2011/03/27/ZT02.html"},{"$f":"IF(Meetings!F23=\"\",\"\",getAddress(Meetings!F23))","v":"http://www.tabonline.com.au/2011/03/27/ZT03.html"},{"$f":"IF(Meetings!G23=\"\",\"\",getAddress(Meetings!G23))","v":"http://www.tabonline.com.au/2011/03/27/ZT04.html"},{"$f":"IF(Meetings!H23=\"\",\"\",getAddress(Meetings!H23))","v":"http://www.tabonline.com.au/2011/03/27/ZT05.html"},{"$f":"IF(Meetings!I23=\"\",\"\",getAddress(Meetings!I23))","v":"http://www.tabonline.com.au/2011/03/27/ZT06.html"},{"$f":"IF(Meetings!J23=\"\",\"\",getAddress(Meetings!J23))","v":"http://www.tabonline.com.au/2011/03/27/ZT07.html"},{"$f":"IF(Meetings!K23=\"\",\"\",getAddress(Meetings!K23))","v":"http://www.tabonline.com.au/2011/03/27/ZT08.html"},{"$f":"IF(Meetings!L23=\"\",\"\",getAddress(Meetings!L23))","v":"http://www.tabonline.com.au/2011/03/27/ZT09.html"},{"$f":"IF(Meetings!M23=\"\",\"\",getAddress(Meetings!M23))","v":"http://www.tabonline.com.au/2011/03/27/ZT10.html"},{"$f":"IF(Meetings!N23=\"\",\"\",getAddress(Meetings!N23))","v":"http://www.tabonline.com.au/2011/03/27/ZT11.html"},{"$f":"IF(Meetings!O23=\"\",\"\",getAddress(Meetings!O23))","v":""},null,null,{"$f":"IF(W22<>\"\",CLEAN(TRIM(Meetings!W22)),\"\")","v":"Wellington"},{"$f":"IF(Meetings!W22=\"\",\"\",getAddress(Meetings!W22))","v":"http://www.racingandsports.com.au/form-guide/meeting.asp?meeting=16330"},"16330"]
[{"$f":"IF(Race!N21<>\"\",(CLEAN(TRIM(Race!C21))),\"\")","v":""},{"$f":"IF(A23<>\"\",Race!N21,\"\")","v":""},{"$f":"IF(A23<>\"\",Race!I21,\"\")","v":""},null,null,"LAUNCESTON",{"$f":"IF(Meetings!B24=\"\",\"\",Meetings!B24)","v":"LAUNCESTON (TT)"},{"$f":"IF(Meetings!D24=\"\",\"\",getAddress(Meetings!D24))","v":"http://www.tabonline.com.au/2011/03/27/TT01.html"},{"$f":"IF(Meetings!E24=\"\",\"\",getAddress(Meetings!E24))","v":"http://www.tabonline.com.au/2011/03/27/TT02.html"},{"$f":"IF(Meetings!F24=\"\",\"\",getAddress(Meetings!F24))","v":"http://www.tabonline.com.au/2011/03/27/TT03.html"},{"$f":"IF(Meetings!G24=\"\",\"\",getAddress(Meetings!G24))","v":"http://www.tabonline.com.au/2011/03/27/TT04.html"},{"$f":"IF(Meetings!H24=\"\",\"\",getAddress(Meetings!H24))","v":"http://www.tabonline.com.au/2011/03/27/TT05.html"},{"$f":"IF(Meetings!I24=\"\",\"\",getAddress(Meetings!I24))","v":"http://www.tabonline.com.au/2011/03/27/TT06.html"},{"$f":"IF(Meetings!J24=\"\",\"\",getAddress(Meetings!J24))","v":"http://www.tabonline.com.au/2011/03/27/TT07.html"},{"$f":"IF(Meetings!K24=\"\",\"\",getAddress(Meetings!K24))","v":"http://www.tabonline.com.au/2011/03/27/TT08.html"},{"$f":"IF(Meetings!L24=\"\",\"\",getAddress(Meetings!L24))","v":"http://www.tabonline.com.au/2011/03/27/TT09.html"},{"$f":"IF(Meetings!M24=\"\",\"\",getAddress(Meetings!M24))","v":"http://www.tabonline.com.au/2011/03/27/TT10.html"},{"$f":"IF(Meetings!N24=\"\",\"\",getAddress(Meetings!N24))","v":""},{"$f":"IF(Meetings!O24=\"\",\"\",getAddress(Meetings!O24))","v":""},null,null,{"$f":"IF(W23<>\"\",CLEAN(TRIM(Meetings!W23)),\"\")","v":""},{"$f":"IF(Meetings!W23=\"\",\"\",getAddress(Meetings!W23))","v":""},""]
[{"$f":"IF(Race!N22<>\"\",(CLEAN(TRIM(Race!C22))),\"\")","v":"NAUTICAT"},{"$f":"IF(A24<>\"\",Race!N22,\"\")","v":89},{"$f":"IF(A24<>\"\",Race!I22,\"\")","v":10},null,null,"UNITED STATES",{"$f":"IF(Meetings!B25=\"\",\"\",Meetings!B25)","v":"UNITED STATES (IT)"},{"$f":"IF(Meetings!D25=\"\",\"\",getAddress(Meetings!D25))","v":"http://www.tabonline.com.au/2011/03/27/IT01.html"},{"$f":"IF(Meetings!E25=\"\",\"\",getAddress(Meetings!E25))","v":"http://www.tabonline.com.au/2011/03/27/IT02.html"},{"$f":"IF(Meetings!F25=\"\",\"\",getAddress(Meetings!F25))","v":"http://www.tabonline.com.au/2011/03/27/IT03.html"},{"$f":"IF(Meetings!G25=\"\",\"\",getAddress(Meetings!G25))","v":"http://www.tabonline.com.au/2011/03/27/IT04.html"},{"$f":"IF(Meetings!H25=\"\",\"\",getAddress(Meetings!H25))","v":"http://www.tabonline.com.au/2011/03/27/IT05.html"},{"$f":"IF(Meetings!I25=\"\",\"\",getAddress(Meetings!I25))","v":"http://www.tabonline.com.au/2011/03/27/IT06.html"},{"$f":"IF(Meetings!J25=\"\",\"\",getAddress(Meetings!J25))","v":"http://www.tabonline.com.au/2011/03/27/IT07.html"},{"$f":"IF(Meetings!K25=\"\",\"\",getAddress(Meetings!K25))","v":"http://www.tabonline.com.au/2011/03/27/IT08.html"},{"$f":"IF(Meetings!L25=\"\",\"\",getAddress(Meetings!L25))","v":"http://www.tabonline.com.au/2011/03/27/IT09.html"},{"$f":"IF(Meetings!M25=\"\",\"\",getAddress(Meetings!M25))","v":"http://www.tabonline.com.au/2011/03/27/IT10.html"},{"$f":"IF(Meetings!N25=\"\",\"\",getAddress(Meetings!N25))","v":"http://www.tabonline.com.au/2011/03/27/IT11.html"},{"$f":"IF(Meetings!O25=\"\",\"\",getAddress(Meetings!O25))","v":""},null,null,{"$f":"IF(W24<>\"\",CLEAN(TRIM(Meetings!W24)),\"\")","v":""},{"$f":"IF(Meetings!W24=\"\",\"\",getAddress(Meetings!W24))","v":""},""]
[{"$f":"IF(Race!N23<>\"\",(CLEAN(TRIM(Race!C23))),\"\")","v":"NEWLAND WARRIOR"},{"$f":"IF(A25<>\"\",Race!N23,\"\")","v":88},{"$f":"IF(A25<>\"\",Race!I23,\"\")","v":6},null,null,"",{"$f":"IF(Meetings!B26=\"\",\"\",Meetings!B26)","v":""},{"$f":"IF(Meetings!D26=\"\",\"\",getAddress(Meetings!D26))","v":{"$error":"#VALUE!"}},{"$f":"IF(Meetings!E26=\"\",\"\",getAddress(Meetings!E26))","v":{"$error":"#VALUE!"}},{"$f":"IF(Meetings!F26=\"\",\"\",getAddress(Meetings!F26))","v":{"$error":"#VALUE!"}},{"$f":"IF(Meetings!G26=\"\",\"\",getAddress(Meetings!G26))","v":{"$error":"#VALUE!"}},{"$f":"IF(Meetings!H26=\"\",\"\",getAddress(Meetings!H26))","v":{"$error":"#VALUE!"}},{"$f":"IF(Meetings!I26=\"\",\"\",getAddress(Meetings!I26))","v":{"$error":"#VALUE!"}},{"$f":"IF(Meetings!J26=\"\",\"\",getAddress(Meetings!J26))","v":{"$error":"#VALUE!"}},{"$f":"IF(Meetings!K26=\"\",\"\",getAddress(Meetings!K26))","v":{"$error":"#VALUE!"}},{"$f":"IF(Meetings!L26=\"\",\"\",getAddress(Meetings!L26))","v":{"$error":"#VALUE!"}},{"$f":"IF(Meetings!M26=\"\",\"\",getAddress(Meetings!M26))","v":{"$error":"#VALUE!"}},{"$f":"IF(Meetings!N26=\"\",\"\",getAddress(Meetings!N26))","v":{"$error":"#VALUE!"}},{"$f":"IF(Meetings!O26=\"\",\"\",getAddress(Meetings!O26))","v":{"$error":"#VALUE!"}},null,null,{"$f":"IF(W25<>\"\",CLEAN(TRIM(Meetings!W25)),\"\")","v":"Sha Tin"},{"$f":"IF(Meetings!W25=\"\",\"\",getAddress(Meetings!W25))","v":"http://www.racingandsports.com.au/form-guide/meeting.asp?meeting=16332"},"16332"]
[{"$f":"IF(Race!N24<>\"\",(CLEAN(TRIM(Race!C24))),\"\")","v":""},{"$f":"IF(A26<>\"\",Race!N24,\"\")","v":""},{"$f":"IF(A26<>\"\",Race!I24,\"\")","v":""},null,null,"CRANBOURNE",{"$f":"IF(Meetings!B27=\"\",\"\",Meetings!B27)","v":"CRANBOURNE (MG)"},{"$f":"IF(Meetings!D27=\"\",\"\",getAddress(Meetings!D27))","v":"http://www.tabonline.com.au/2011/03/27/MG01.html"},{"$f":"IF(Meetings!E27=\"\",\"\",getAddress(Meetings!E27))","v":"http://www.tabonline.com.au/2011/03/27/MG02.html"},{"$f":"IF(Meetings!F27=\"\",\"\",getAddress(Meetings!F27))","v":"http://www.tabonline.com.au/2011/03/27/MG03.html"},{"$f":"IF(Meetings!G27=\"\",\"\",getAddress(Meetings!G27))","v":"http://www.tabonline.com.au/2011/03/27/MG04.html"},{"$f":"IF(Meetings!H27=\"\",\"\",getAddress(Meetings!H27))","v":"http://www.tabonline.com.au/2011/03/27/MG05.html"},{"$f":"IF(Meetings!I27=\"\",\"\",getAddress(Meetings!I27))","v":"http://www.tabonline.com.au/2011/03/27/MG06.html"},{"$f":"IF(Meetings!J27=\"\",\"\",getAddress(Meetings!J27))","v":"http://www.tabonline.com.au/2011/03/27/MG07.html"},{"$f":"IF(Meetings!K27=\"\",\"\",getAddress(Meetings!K27))","v":"http://www.tabonline.com.au/2011/03/27/MG08.html"},{"$f":"IF(Meetings!L27=\"\",\"\",getAddress(Meetings!L27))","v":""},{"$f":"IF(Meetings!M27=\"\",\"\",getAddress(Meetings!M27))","v":""},{"$f":"IF(Meetings!N27=\"\",\"\",getAddress(Meetings!N27))","v":""},{"$f":"IF(Meetings!O27=\"\",\"\",getAddress(Meetings!O27))","v":""},null,null,{"$f":"IF(W26<>\"\",CLEAN(TRIM(Meetings!W26)),\"\")","v":""},{"$f":"IF(Meetings!W26=\"\",\"\",getAddress(Meetings!W26))","v":""},""]
[{"$f":"IF(Race!N25<>\"\",(CLEAN(TRIM(Race!C25))),\"\")","v":""},{"$f":"IF(A27<>\"\",Race!N25,\"\")","v":""},{"$f":"IF(A27<>\"\",Race!I25,\"\")","v":""},null,null,"WAGGA",{"$f":"IF(Meetings!B28=\"\",\"\",Meetings!B28)","v":"WAGGA (NG)"},{"$f":"IF(Meetings!D28=\"\",\"\",getAddress(Meetings!D28))","v":"http://www.tabonline.com.au/2011/03/27/NG01.html"},{"$f":"IF(Meetings!E28=\"\",\"\",getAddress(Meetings!E28))","v":"http://www.tabonline.com.au/2011/03/27/NG02.html"},{"$f":"IF(Meetings!F28=\"\",\"\",getAddress(Meetings!F28))","v":"http://www.tabonline.com.au/2011/03/27/NG03.html"},{"$f":"IF(Meetings!G28=\"\",\"\",getAddress(Meetings!G28))","v":"http://www.tabonline.com.au/2011/03/27/NG04.html"},{"$f":"IF(Meetings!H28=\"\",\"\",getAddress(Meetings!H28))","v":"http://www.tabonline.com.au/2011/03/27/NG05.html"},{"$f":"IF(Meetings!I28=\"\",\"\",getAddress(Meetings!I28))","v":"http://www.tabonline.com.au/2011/03/27/NG06.html"},{"$f":"IF(Meetings!J28=\"\",\"\",getAddress(Meetings!J28))","v":"http://www.tabonline.com.au/2011/03/27/NG07.html"},{"$f":"IF(Meetings!K28=\"\",\"\",getAddress(Meetings!K28))","v":"http://www.tabonline.com.au/2011/03/27/NG08.html"},{"$f":"IF(Meetings!L28=\"\",\"\",getAddress(Meetings!L28))","v":"http://www.tabonline.com.au/2011/03/27/NG09.html"},{"$f":"IF(Meetings!M28=\"\",\"\",getAddress(Meetings!M28))","v":"http://www.tabonline.com.au/2011/03/27/NG10.html"},{"$f":"IF(Meetings!N28=\"\",\"\",getAddress(Meetings!N28))","v":""},{"$f":"IF(Meetings!O28=\"\",\"\",getAddress(Meetings!O28))","v":""},null,null,{"$f":"IF(W27<>\"\",CLEAN(TRIM(Meetings!W27)),\"\")","v":""},{"$f":"IF(Meetings!W27=\"\",\"\",getAddress(Meetings!W27))","v":""},""]
[{"$f":"IF(Race!N26<>\"\",(CLEAN(TRIM(Race!C26))),\"\")","v":"PATH TO FREEDOM"},{"$f":"IF(A28<>\"\",Race!N26,\"\")","v":94},{"$f":"IF(A28<>\"\",Race!I26,\"\")","v":7},null,null,"SALE",{"$f":"IF(Meetings!B29=\"\",\"\",Meetings!B29)","v":"SALE (VG)"},{"$f":"IF(Meetings!D29=\"\",\"\",getAddress(Meetings!D29))","v":"http://www.tabonline.com.au/2011/03/27/VG01.html"},{"$f":"IF(Meetings!E29=\"\",\"\",getAddress(Meetings!E29))","v":"http://www.tabonline.com.au/2011/03/27/VG02.html"},{"$f":"IF(Meetings!F29=\"\",\"\",getAddress(Meetings!F29))","v":"http://www.tabonline.com.au/2011/03/27/VG03.html"},{"$f":"IF(Meetings!G29=\"\",\"\",getAddress(Meetings!G29))","v":"http://www.tabonline.com.au/2011/03/27/VG04.html"},{"$f":"IF(Meetings!H29=\"\",\"\",getAddress(Meetings!H29))","v":"http://www.tabonline.com.au/2011/03/27/VG05.html"},{"$f":"IF(Meetings!I29=\"\",\"\",getAddress(Meetings!I29))","v":"http://www.tabonline.com.au/2011/03/27/VG06.html"},{"$f":"IF(Meetings!J29=\"\",\"\",getAddress(Meetings!J29))","v":"http://www.tabonline.com.au/2011/03/27/VG07.html"},{"$f":"IF(Meetings!K29=\"\",\"\",getAddress(Meetings!K29))","v":"http://www.tabonline.com.au/2011/03/27/VG08.html"},{"$f":"IF(Meetings!L29=\"\",\"\",getAddress(Meetings!L29))","v":"http://www.tabonline.com.au/2011/03/27/VG09.html"},{"$f":"IF(Meetings!M29=\"\",\"\",getAddress(Meetings!M29))","v":"http://www.tabonline.com.au/2011/03/27/VG10.html"},{"$f":"IF(Meetings!N29=\"\",\"\",getAddress(Meetings!N29))","v":""},{"$f":"IF(Meetings!O29=\"\",\"\",getAddress(Meetings!O29))","v":""},null,null,{"$f":"IF(W28<>\"\",CLEAN(TRIM(Meetings!W28)),\"\")","v":"Waipukurau"},{"$f":"IF(Meetings!W28=\"\",\"\",getAddress(Meetings!W28))","v":"http://www.racingandsports.com.au/form-guide/meeting.asp?meeting=16307"},"16307"]
[{"$f":"IF(Race!N27<>\"\",(CLEAN(TRIM(Race!C27))),\"\")","v":""},{"$f":"IF(A29<>\"\",Race!N27,\"\")","v":""},{"$f":"IF(A29<>\"\",Race!I27,\"\")","v":""},null,null,"STRATHALBYN",{"$f":"IF(Meetings!B30=\"\",\"\",Meetings!B30)","v":"STRATHALBYN (AG)"},{"$f":"IF(Meetings!D30=\"\",\"\",getAddress(Meetings!D30))","v":"http://www.tabonline.com.au/2011/03/27/AG01.html"},{"$f":"IF(Meetings!E30=\"\",\"\",getAddress(Meetings!E30))","v":"http://www.tabonline.com.au/2011/03/27/AG02.html"},{"$f":"IF(Meetings!F30=\"\",\"\",getAddress(Meetings!F30))","v":"http://www.tabonline.com.au/2011/03/27/AG03.html"},{"$f":"IF(Meetings!G30=\"\",\"\",getAddress(Meetings!G30))","v":"http://www.tabonline.com.au/2011/03/27/AG04.html"},{"$f":"IF(Meetings!H30=\"\",\"\",getAddress(Meetings!H30))","v":"http://www.tabonline.com.au/2011/03/27/AG05.html"},{"$f":"IF(Meetings!I30=\"\",\"\",getAddress(Meetings!I30))","v":"http://www.tabonline.com.au/2011/03/27/AG06.html"},{"$f":"IF(Meetings!J30=\"\",\"\",getAddress(Meetings!J30))","v":"http://www.tabonline.com.au/2011/03/27/AG07.html"},{"$f":"IF(Meetings!K30=\"\",\"\",getAddress(Meetings!K30))","v":"http://www.tabonline.com.au/2011/03/27/AG08.html"},{"$f":"IF(Meetings!L30=\"\",\"\",getAddress(Meetings!L30))","v":"http://www.tabonline.com.au/2011/03/27/AG09.html"},{"$f":"IF(Meetings!M30=\"\",\"\",getAddress(Meetings!M30))","v":"http://www.tabonline.com.au/2011/03/27/AG10.html"},{"$f":"IF(Meetings!N30=\"\",\"\",getAddress(Meetings!N30))","v":""},{"$f":"IF(Meetings!O30=\"\",\"\",getAddress(Meetings!O30))","v":""},null,null,{"$f":"IF(W29<>\"\",CLEAN(TRIM(Meetings!W29)),\"\")","v":""},{"$f":"IF(Meetings!W29=\"\",\"\",getAddress(Meetings!W29))","v":""},""]
[{"$f":"IF(Race!N28<>\"\",(CLEAN(TRIM(Race!C28))),\"\")","v":"MALLARD"},{"$f":"IF(A30<>\"\",Race!N28,\"\")","v":100},{"$f":"IF(A30<>\"\",Race!I28,\"\")","v":16},null,null,"CANBERRA",{"$f":"IF(Meetings!B31=\"\",\"\",Meetings!B31)","v":"CANBERRA (CG)"},{"$f":"IF(Meetings!D31=\"\",\"\",getAddress(Meetings!D31))","v":"http://www.tabonline.com.au/2011/03/27/CG01.html"},{"$f":"IF(Meetings!E31=\"\",\"\",getAddress(Meetings!E31))","v":"http://www.tabonline.com.au/2011/03/27/CG02.html"},{"$f":"IF(Meetings!F31=\"\",\"\",getAddress(Meetings!F31))","v":"http://www.tabonline.com.au/2011/03/27/CG03.html"},{"$f":"IF(Meetings!G31=\"\",\"\",getAddress(Meetings!G31))","v":"http://www.tabonline.com.au/2011/03/27/CG04.html"},{"$f":"IF(Meetings!H31=\"\",\"\",getAddress(Meetings!H31))","v":"http://www.tabonline.com.au/2011/03/27/CG05.html"},{"$f":"IF(Meetings!I31=\"\",\"\",getAddress(Meetings!I31))","v":"http://www.tabonline.com.au/2011/03/27/CG06.html"},{"$f":"IF(Meetings!J31=\"\",\"\",getAddress(Meetings!J31))","v":"http://www.tabonline.com.au/2011/03/27/CG07.html"},{"$f":"IF(Meetings!K31=\"\",\"\",getAddress(Meetings!K31))","v":"http://www.tabonline.com.au/2011/03/27/CG08.html"},{"$f":"IF(Meetings!L31=\"\",\"\",getAddress(Meetings!L31))","v":"http://www.tabonline.com.au/2011/03/27/CG09.html"},{"$f":"IF(Meetings!M31=\"\",\"\",getAddress(Meetings!M31))","v":"http://www.tabonline.com.au/2011/03/27/CG10.html"},{"$f":"IF(Meetings!N31=\"\",\"\",getAddress(Meetings!N31))","v":""},{"$f":"IF(Meetings!O31=\"\",\"\",getAddress(Meetings!O31))","v":""},null,null,{"$f":"IF(W30<>\"\",CLEAN(TRIM(Meetings!W30)),\"\")","v":""},{"$f":"IF(Meetings!W30=\"\",\"\",getAddress(Meetings!W30))","v":""},""]
[{"$f":"IF(Race!N29<>\"\",(CLEAN(TRIM(Race!C29))),\"\")","v":""},{"$f":"IF(A31<>\"\",Race!N29,\"\")","v":""},{"$f":"IF(A31<>\"\",Race!I29,\"\")","v":""},null,null,"HEALESVILLE",{"$f":"IF(Meetings!B32=\"\",\"\",Meetings!B32)","v":"HEALESVILLE (EG)"},{"$f":"IF(Meetings!D32=\"\",\"\",getAddress(Meetings!D32))","v":"http://www.tabonline.com.au/2011/03/27/EG01.html"},{"$f":"IF(Meetings!E32=\"\",\"\",getAddress(Meetings!E32))","v":"http://www.tabonline.com.au/2011/03/27/EG02.html"},{"$f":"IF(Meetings!F32=\"\",\"\",getAddress(Meetings!F32))","v":"http://www.tabonline.com.au/2011/03/27/EG03.html"},{"$f":"IF(Meetings!G32=\"\",\"\",getAddress(Meetings!G32))","v":"http://www.tabonline.com.au/2011/03/27/EG04.html"},{"$f":"IF(Meetings!H32=\"\",\"\",getAddress(Meetings!H32))","v":"http://www.tabonline.com.au/2011/03/27/EG05.html"},{"$f":"IF(Meetings!I32=\"\",\"\",getAddress(Meetings!I32))","v":"http://www.tabonline.com.au/2011/03/27/EG06.html"},{"$f":"IF(Meetings!J32=\"\",\"\",getAddress(Meetings!J32))","v":"http://www.tabonline.com.au/2011/03/27/EG07.html"},{"$f":"IF(Meetings!K32=\"\",\"\",getAddress(Meetings!K32))","v":"http://www.tabonline.com.au/2011/03/27/EG08.html"},{"$f":"IF(Meetings!L32=\"\",\"\",getAddress(Meetings!L32))","v":"http://www.tabonline.com.au/2011/03/27/EG09.html"},{"$f":"IF(Meetings!M32=\"\",\"\",getAddress(Meetings!M32))","v":"http://www.tabonline.com.au/2011/03/27/EG10.html"},{"$f":"IF(Meetings!N32=\"\",\"\",getAddress(Meetings!N32))","v":"http://www.tabonline.com.au/2011/03/27/EG11.html"},{"$f":"IF(Meetings!O32=\"\",\"\",getAddress(Meetings!O32))","v":"http://www.tabonline.com.au/2011/03/27/EG12.html"},null,null,{"$f":"IF(W31<>\"\",CLEAN(TRIM(Meetings!W31)),\"\")","v":"Kranji Aw"},{"$f":"IF(Meetings!W31=\"\",\"\",getAddress(Meetings!W31))","v":"http://www.racingandsports.com.au/form-guide/meeting.asp?meeting=16309"},"16309"]
[{"$f":"IF(Race!N30<>\"\",(CLEAN(TRIM(Race!C30))),\"\")","v":""},{"$f":"IF(A32<>\"\",Race!N30,\"\")","v":""},{"$f":"IF(A32<>\"\",Race!I30,\"\")","v":""},null,null,"MANUKAU",{"$f":"IF(Meetings!B33=\"\",\"\",Meetings!B33)","v":"MANUKAU (ZG)"},{"$f":"IF(Meetings!D33=\"\",\"\",getAddress(Meetings!D33))","v":"http://www.tabonline.com.au/2011/03/27/ZG01.html"},{"$f":"IF(Meetings!E33=\"\",\"\",getAddress(Meetings!E33))","v":"http://www.tabonline.com.au/2011/03/27/ZG02.html"},{"$f":"IF(Meetings!F33=\"\",\"\",getAddress(Meetings!F33))","v":"http://www.tabonline.com.au/2011/03/27/ZG03.html"},{"$f":"IF(Meetings!G33=\"\",\"\",getAddress(Meetings!G33))","v":"http://www.tabonline.com.au/2011/03/27/ZG04.html"},{"$f":"IF(Meetings!H33=\"\",\"\",getAddress(Meetings!H33))","v":"http://www.tabonline.com.au/2011/03/27/ZG05.html"},{"$f":"IF(Meetings!I33=\"\",\"\",getAddress(Meetings!I33))","v":"http://www.tabonline.com.au/2011/03/27/ZG06.html"},{"$f":"IF(Meetings!J33=\"\",\"\",getAddress(Meetings!J33))","v":"http://www.tabonline.com.au/2011/03/27/ZG07.html"},{"$f":"IF(Meetings!K33=\"\",\"\",getAddress(Meetings!K33))","v":"http://www.tabonline.com.au/2011/03/27/ZG08.html"},{"$f":"IF(Meetings!L33=\"\",\"\",getAddress(Meetings!L33))","v":"http://www.tabonline.com.au/2011/03/27/ZG09.html"},{"$f":"IF(Meetings!M33=\"\",\"\",getAddress(Meetings!M33))","v":"http://www.tabonline.com.au/2011/03/27/ZG10.html"},{"$f":"IF(Meetings!N33=\"\",\"\",getAddress(Meetings!N33))","v":"http://www.tabonline.com.au/2011/03/27/ZG11.html"},{"$f":"IF(Meetings!O33=\"\",\"\",getAddress(Meetings!O33))","v":""},null,null,{"$f":"IF(W32<>\"\",CLEAN(TRIM(Meetings!W32)),\"\")","v":""},{"$f":"IF(Meetings!W32=\"\",\"\",getAddress(Meetings!W32))","v":""},""]
[{"$f":"IF(Race!N31<>\"\",(CLEAN(TRIM(Race!C31))),\"\")","v":""},{"$f":"IF(A33<>\"\",Race!N31,\"\")","v":""},{"$f":"IF(A33<>\"\",Race!I31,\"\")","v":""},null,null,"MT GAMBIER",{"$f":"IF(Meetings!B34=\"\",\"\",Meetings!B34)","v":"MT GAMBIER (DG)"},{"$f":"IF(Meetings!D34=\"\",\"\",getAddress(Meetings!D34))","v":"http://www.tabonline.com.au/2011/03/27/DG01.html"},{"$f":"IF(Meetings!E34=\"\",\"\",getAddress(Meetings!E34))","v":"http://www.tabonline.com.au/2011/03/27/DG02.html"},{"$f":"IF(Meetings!F34=\"\",\"\",getAddress(Meetings!F34))","v":"http://www.tabonline.com.au/2011/03/27/DG03.html"},{"$f":"IF(Meetings!G34=\"\",\"\",getAddress(Meetings!G34))","v":"http://www.tabonline.com.au/2011/03/27/DG04.html"},{"$f":"IF(Meetings!H34=\"\",\"\",getAddress(Meetings!H34))","v":"http://www.tabonline.com.au/2011/03/27/DG05.html"},{"$f":"IF(Meetings!I34=\"\",\"\",getAddress(Meetings!I34))","v":"http://www.tabonline.com.au/2011/03/27/DG06.html"},{"$f":"IF(Meetings!J34=\"\",\"\",getAddress(Meetings!J34))","v":"http://www.tabonline.com.au/2011/03/27/DG07.html"},{"$f":"IF(Meetings!K34=\"\",\"\",getAddress(Meetings!K34))","v":"http://www.tabonline.com.au/2011/03/27/DG08.html"},{"$f":"IF(Meetings!L34=\"\",\"\",getAddress(Meetings!L34))","v":"http://www.tabonline.com.au/2011/03/27/DG09.html"},{"$f":"IF(Meetings!M34=\"\",\"\",getAddress(Meetings!M34))","v":"http://www.tabonline.com.au/2011/03/27/DG10.html"},{"$f":"IF(Meetings!N34=\"\",\"\",getAddress(Meetings!N34))","v":""},{"$f":"IF(Meetings!O34=\"\",\"\",getAddress(Meetings!O34))","v":""},null,null,{"$f":"IF(W33<>\"\",CLEAN(TRIM(Meetings!W33)),\"\")","v":""},{"$f":"IF(Meetings!W33=\"\",\"\",getAddress(Meetings!W33))","v":""},""]
[{"$f":"IF(Race!N32<>\"\",(CLEAN(TRIM(Race!C32))),\"\")","v":"RASCAL"},{"$f":"IF(A34<>\"\",Race!N32,\"\")","v":84},{"$f":"IF(A34<>\"\",Race!I32,\"\")","v":2},{"$nulls":4},{"$f":"IF(Meetings!D36=\"\",\"\",getAddress(Meetings!D36))","v":""},{"$f":"IF(Meetings!E36=\"\",\"\",getAddress(Meetings!E36))","v":""},{"$f":"IF(Meetings!F36=\"\",\"\",getAddress(Meetings!F36))","v":""},{"$f":"IF(Meetings!G36=\"\",\"\",getAddress(Meetings!G36))","v":""},{"$f":"IF(Meetings!H36=\"\",\"\",getAddress(Meetings!H36))","v":""},{"$f":"IF(Meetings!I36=\"\",\"\",getAddress(Meetings!I36))","v":""},{"$f":"IF(Meetings!J36=\"\",\"\",getAddress(Meetings!J36))","v":""},{"$f":"IF(Meetings!K36=\"\",\"\",getAddress(Meetings!K36))","v":""},{"$f":"IF(Meetings!L36=\"\",\"\",getAddress(Meetings!L36))","v":""},{"$f":"IF(Meetings!M36=\"\",\"\",getAddress(Meetings!M36))","v":""},{"$nulls":4},{"$f":"IF(W34<>\"\",CLEAN(TRIM(Meetings!W34)),\"\")","v":"Scottsville"},{"$f":"IF(Meetings!W34=\"\",\"\",getAddress(Meetings!W34))","v":"http://www.racingandsports.com.au/form-guide/meeting.asp?meeting=16282"},"16282"]
[{"$f":"IF(Race!N33<>\"\",(CLEAN(TRIM(Race!C33))),\"\")","v":"RUSSIAN ROYALTY"},{"$f":"IF(A35<>\"\",Race!N33,\"\")","v":91},{"$f":"IF(A35<>\"\",Race!I33,\"\")","v":14},{"$nulls":4},{"$f":"IF(Meetings!D37=\"\",\"\",getAddress(Meetings!D37))","v":""},{"$f":"IF(Meetings!E37=\"\",\"\",getAddress(Meetings!E37))","v":""},{"$f":"IF(Meetings!F37=\"\",\"\",getAddress(Meetings!F37))","v":""},{"$f":"IF(Meetings!G37=\"\",\"\",getAddress(Meetings!G37))","v":""},{"$f":"IF(Meetings!H37=\"\",\"\",getAddress(Meetings!H37))","v":""},{"$f":"IF(Meetings!I37=\"\",\"\",getAddress(Meetings!I37))","v":""},{"$f":"IF(Meetings!J37=\"\",\"\",getAddress(Meetings!J37))","v":""},{"$f":"IF(Meetings!K37=\"\",\"\",getAddress(Meetings!K37))","v":""},{"$f":"IF(Meetings!L37=\"\",\"\",getAddress(Meetings!L37))","v":""},{"$f":"IF(Meetings!M37=\"\",\"\",getAddress(Meetings!M37))","v":""},{"$nulls":4},{"$f":"IF(W35<>\"\",CLEAN(TRIM(Meetings!W35)),\"\")","v":""},{"$f":"IF(Meetings!W35=\"\",\"\",getAddress(Meetings!W35))","v":""},""]
[{"$f":"IF(Race!N34<>\"\",(CLEAN(TRIM(Race!C34))),\"\")","v":"JAMESON AICH"},{"$f":"IF(A36<>\"\",Race!N34,\"\")","v":87},{"$f":"IF(A36<>\"\",Race!I34,\"\")","v":9},{"$nulls":4},{"$f":"IF(Meetings!D38=\"\",\"\",getAddress(Meetings!D38))","v":""},{"$f":"IF(Meetings!E38=\"\",\"\",getAddress(Meetings!E38))","v":""},{"$f":"IF(Meetings!F38=\"\",\"\",getAddress(Meetings!F38))","v":""},{"$f":"IF(Meetings!G38=\"\",\"\",getAddress(Meetings!G38))","v":""},{"$f":"IF(Meetings!H38=\"\",\"\",getAddress(Meetings!H38))","v":""},{"$f":"IF(Meetings!I38=\"\",\"\",getAddress(Meetings!I38))","v":""},{"$f":"IF(Meetings!J38=\"\",\"\",getAddress(Meetings!J38))","v":""},{"$f":"IF(Meetings!K38=\"\",\"\",getAddress(Meetings!K38))","v":""},{"$f":"IF(Meetings!L38=\"\",\"\",getAddress(Meetings!L38))","v":""},{"$f":"IF(Meetings!M38=\"\",\"\",getAddress(Meetings!M38))","v":""},{"$nulls":4},{"$f":"IF(W36<>\"\",CLEAN(TRIM(Meetings!W36)),\"\")","v":""},{"$f":"IF(Meetings!W36=\"\",\"\",getAddress(Meetings!W36))","v":""},""]
[null,null,{"$f":"IF(A37<>\"\",Race!I35,\"\")","v":""},{"$nulls":4},{"$f":"IF(Meetings!D39=\"\",\"\",getAddress(Meetings!D39))","v":""},{"$f":"IF(Meetings!E39=\"\",\"\",getAddress(Meetings!E39))","v":""},{"$f":"IF(Meetings!F39=\"\",\"\",getAddress(Meetings!F39))","v":""},{"$f":"IF(Meetings!G39=\"\",\"\",getAddress(Meetings!G39))","v":""},{"$f":"IF(Meetings!H39=\"\",\"\",getAddress(Meetings!H39))","v":""},{"$f":"IF(Meetings!I39=\"\",\"\",getAddress(Meetings!I39))","v":""},{"$f":"IF(Meetings!J39=\"\",\"\",getAddress(Meetings!J39))","v":""},{"$f":"IF(Meetings!K39=\"\",\"\",getAddress(Meetings!K39))","v":""},{"$f":"IF(Meetings!L39=\"\",\"\",getAddress(Meetings!L39))","v":""},{"$f":"IF(Meetings!M39=\"\",\"\",getAddress(Meetings!M39))","v":""},{"$nulls":4},{"$f":"IF(W37<>\"\",CLEAN(TRIM(Meetings!W37)),\"\")","v":""},{"$f":"IF(Meetings!W37=\"\",\"\",getAddress(Meetings!W37))","v":""},""]
[null,null,{"$f":"IF(A38<>\"\",Race!I36,\"\")","v":""},{"$nulls":4},{"$f":"IF(Meetings!D40=\"\",\"\",getAddress(Meetings!D40))","v":""},{"$f":"IF(Meetings!E40=\"\",\"\",getAddress(Meetings!E40))","v":""},{"$f":"IF(Meetings!F40=\"\",\"\",getAddress(Meetings!F40))","v":""},{"$f":"IF(Meetings!G40=\"\",\"\",getAddress(Meetings!G40))","v":""},{"$f":"IF(Meetings!H40=\"\",\"\",getAddress(Meetings!H40))","v":""},{"$f":"IF(Meetings!I40=\"\",\"\",getAddress(Meetings!I40))","v":""},{"$f":"IF(Meetings!J40=\"\",\"\",getAddress(Meetings!J40))","v":""},{"$f":"IF(Meetings!K40=\"\",\"\",getAddress(Meetings!K40))","v":""},{"$f":"IF(Meetings!L40=\"\",\"\",getAddress(Meetings!L40))","v":""},{"$f":"IF(Meetings!M40=\"\",\"\",getAddress(Meetings!M40))","v":""},{"$nulls":4},{"$f":"IF(W38<>\"\",CLEAN(TRIM(Meetings!W38)),\"\")","v":""},{"$f":"IF(Meetings!W38=\"\",\"\",getAddress(Meetings!W38))","v":""},""]
[null,null,{"$f":"IF(A39<>\"\",Race!I37,\"\")","v":""},{"$nulls":4},{"$f":"IF(Meetings!D41=\"\",\"\",getAddress(Meetings!D41))","v":""},{"$f":"IF(Meetings!E41=\"\",\"\",getAddress(Meetings!E41))","v":""},{"$f":"IF(Meetings!F41=\"\",\"\",getAddress(Meetings!F41))","v":""},{"$f":"IF(Meetings!G41=\"\",\"\",getAddress(Meetings!G41))","v":""},{"$f":"IF(Meetings!H41=\"\",\"\",getAddress(Meetings!H41))","v":""},{"$f":"IF(Meetings!I41=\"\",\"\",getAddress(Meetings!I41))","v":""},{"$f":"IF(Meetings!J41=\"\",\"\",getAddress(Meetings!J41))","v":""},{"$f":"IF(Meetings!K41=\"\",\"\",getAddress(Meetings!K41))","v":""},{"$f":"IF(Meetings!L41=\"\",\"\",getAddress(Meetings!L41))","v":""},{"$f":"IF(Meetings!M41=\"\",\"\",getAddress(Meetings!M41))","v":""},{"$nulls":4},{"$f":"IF(W39<>\"\",CLEAN(TRIM(Meetings!W39)),\"\")","v":""},{"$f":"IF(Meetings!W39=\"\",\"\",getAddress(Meetings!W39))","v":""},""]
[null,null,{"$f":"IF(A40<>\"\",Race!I38,\"\")","v":""},{"$nulls":4},{"$f":"IF(Meetings!D42=\"\",\"\",getAddress(Meetings!D42))","v":""},{"$f":"IF(Meetings!E42=\"\",\"\",getAddress(Meetings!E42))","v":""},{"$f":"IF(Meetings!F42=\"\",\"\",getAddress(Meetings!F42))","v":""},{"$f":"IF(Meetings!G42=\"\",\"\",getAddress(Meetings!G42))","v":""},{"$f":"IF(Meetings!H42=\"\",\"\",getAddress(Meetings!H42))","v":""},{"$f":"IF(Meetings!I42=\"\",\"\",getAddress(Meetings!I42))","v":""},{"$f":"IF(Meetings!J42=\"\",\"\",getAddress(Meetings!J42))","v":""},{"$f":"IF(Meetings!K42=\"\",\"\",getAddress(Meetings!K42))","v":""},{"$f":"IF(Meetings!L42=\"\",\"\",getAddress(Meetings!L42))","v":""},{"$f":"IF(Meetings!M42=\"\",\"\",getAddress(Meetings!M42))","v":""},{"$nulls":4},{"$f":"IF(W40<>\"\",CLEAN(TRIM(Meetings!W40)),\"\")","v":""},{"$f":"IF(Meetings!W40=\"\",\"\",getAddress(Meetings!W40))","v":""},""]
[null,null,{"$f":"IF(A41<>\"\",Race!I39,\"\")","v":""},{"$nulls":4},{"$f":"IF(Meetings!D43=\"\",\"\",getAddress(Meetings!D43))","v":""},{"$f":"IF(Meetings!E43=\"\",\"\",getAddress(Meetings!E43))","v":""},{"$f":"IF(Meetings!F43=\"\",\"\",getAddress(Meetings!F43))","v":""},{"$f":"IF(Meetings!G43=\"\",\"\",getAddress(Meetings!G43))","v":""},{"$f":"IF(Meetings!H43=\"\",\"\",getAddress(Meetings!H43))","v":""},{"$f":"IF(Meetings!I43=\"\",\"\",getAddress(Meetings!I43))","v":""},{"$f":"IF(Meetings!J43=\"\",\"\",getAddress(Meetings!J43))","v":""},{"$f":"IF(Meetings!K43=\"\",\"\",getAddress(Meetings!K43))","v":""},{"$f":"IF(Meetings!L43=\"\",\"\",getAddress(Meetings!L43))","v":""},{"$f":"IF(Meetings!M43=\"\",\"\",getAddress(Meetings!M43))","v":""}]
[null,null,{"$f":"IF(A42<>\"\",Race!I40,\"\")","v":""},{"$nulls":4},{"$f":"IF(Meetings!D44=\"\",\"\",getAddress(Meetings!D44))","v":""},{"$f":"IF(Meetings!E44=\"\",\"\",getAddress(Meetings!E44))","v":""},{"$f":"IF(Meetings!F44=\"\",\"\",getAddress(Meetings!F44))","v":""},{"$f":"IF(Meetings!G44=\"\",\"\",getAddress(Meetings!G44))","v":""},{"$f":"IF(Meetings!H44=\"\",\"\",getAddress(Meetings!H44))","v":""},{"$f":"IF(Meetings!I44=\"\",\"\",getAddress(Meetings!I44))","v":""},{"$f":"IF(Meetings!J44=\"\",\"\",getAddress(Meetings!J44))","v":""},{"$f":"IF(Meetings!K44=\"\",\"\",getAddress(Meetings!K44))","v":""},{"$f":"IF(Meetings!L44=\"\",\"\",getAddress(Meetings!L44))","v":""},{"$f":"IF(Meetings!M44=\"\",\"\",getAddress(Meetings!M44))","v":""}]
[null,null,{"$f":"IF(A43<>\"\",Race!I41,\"\")","v":""},{"$nulls":4},{"$f":"IF(Meetings!D45=\"\",\"\",getAddress(Meetings!D45))","v":""},{"$f":"IF(Meetings!E45=\"\",\"\",getAddress(Meetings!E45))","v":""},{"$f":"IF(Meetings!F45=\"\",\"\",getAddress(Meetings!F45))","v":""},{"$f":"IF(Meetings!G45=\"\",\"\",getAddress(Meetings!G45))","v":""},{"$f":"IF(Meetings!H45=\"\",\"\",getAddress(Meetings!H45))","v":""},{"$f":"IF(Meetings!I45=\"\",\"\",getAddress(Meetings!I45))","v":""},{"$f":"IF(Meetings!J45=\"\",\"\",getAddress(Meetings!J45))","v":""},{"$f":"IF(Meetings!K45=\"\",\"\",getAddress(Meetings!K45))","v":""},{"$f":"IF(Meetings!L45=\"\",\"\",getAddress(Meetings!L45))","v":""},{"$f":"IF(Meetings!M45=\"\",\"\",getAddress(Meetings!M45))","v":""}]
[null,null,{"$f":"IF(A44<>\"\",Race!I42,\"\")","v":""},{"$nulls":4},{"$f":"IF(Meetings!D46=\"\",\"\",getAddress(Meetings!D46))","v":""},{"$f":"IF(Meetings!E46=\"\",\"\",getAddress(Meetings!E46))","v":""},{"$f":"IF(Meetings!F46=\"\",\"\",getAddress(Meetings!F46))","v":""},{"$f":"IF(Meetings!G46=\"\",\"\",getAddress(Meetings!G46))","v":""},{"$f":"IF(Meetings!H46=\"\",\"\",getAddress(Meetings!H46))","v":""},{"$f":"IF(Meetings!I46=\"\",\"\",getAddress(Meetings!I46))","v":""},{"$f":"IF(Meetings!J46=\"\",\"\",getAddress(Meetings!J46))","v":""},{"$f":"IF(Meetings!K46=\"\",\"\",getAddress(Meetings!K46))","v":""},{"$f":"IF(Meetings!L46=\"\",\"\",getAddress(Meetings!L46))","v":""},{"$f":"IF(Meetings!M46=\"\",\"\",getAddress(Meetings!M46))","v":""}]
[null,null,{"$f":"IF(A45<>\"\",Race!I43,\"\")","v":""},{"$nulls":4},{"$f":"IF(Meetings!D47=\"\",\"\",getAddress(Meetings!D47))","v":""},{"$f":"IF(Meetings!E47=\"\",\"\",getAddress(Meetings!E47))","v":""},{"$f":"IF(Meetings!F47=\"\",\"\",getAddress(Meetings!F47))","v":""},{"$f":"IF(Meetings!G47=\"\",\"\",getAddress(Meetings!G47))","v":""},{"$f":"IF(Meetings!H47=\"\",\"\",getAddress(Meetings!H47))","v":""},{"$f":"IF(Meetings!I47=\"\",\"\",getAddress(Meetings!I47))","v":""},{"$f":"IF(Meetings!J47=\"\",\"\",getAddress(Meetings!J47))","v":""},{"$f":"IF(Meetings!K47=\"\",\"\",getAddress(Meetings!K47))","v":""},{"$f":"IF(Meetings!L47=\"\",\"\",getAddress(Meetings!L47))","v":""},{"$f":"IF(Meetings!M47=\"\",\"\",getAddress(Meetings!M47))","v":""}]

{"sheet":"Instructions","index":2,"n_rows":10,"n_cols":11,"rows_kept":10,"cut":false,"hidden":false,"merged":[]}
[]
[]
[]
[]
[null,"Instructions"]
[]
[null,"You need to get the race code from",null,null,null,"http://www.racingandsports.com.au/form-guide/",{"$nulls":4},"click on each venue and get the last set of numbers from the address bar."]
[null,"On the \"Neurals\" sheet press \"Start\" press \"OK\" for todays date or put in a date, there is a box on the right that has the days races, hightlight a race and press \"Select\"  put in race code then 1st and last race numbers for that venue then press the \"Import\" button,"]
[null,"the race will be imported, if the top Neurals selection is also the unitab top rated it will copy to the \"Selections\" sheet."]
[null,"Each race will cycle through for that meeting, when done change the meeting and the race numbers and press import again."]

{"sheet":"Meetings","index":3,"n_rows":115,"n_cols":41,"rows_kept":115,"cut":false,"hidden":false,"merged":[[28,20,28,25],[14,26,14,28],[15,26,15,28],[21,26,21,28],[22,26,22,28],[1,0,1,2],[0,20,0,30],[1,20,1,27],[1,28,1,30],[6,20,6,30],[22,20,22,25],[23,21,23,25],[25,20,25,25],[26,21,26,25],[6,31,6,37],[9,20,9,25],[10,20,10,25],[11,20,11,25],[12,21,12,25],[2,32,4,32],[2,20,2,30],[3,20,3,30],[4,20,4,30],[5,20,5,30],[36,20,36,25],[37,20,37,25],[38,20,38,25],[39,21,39,25],[42,20,42,21],[29,21,29,25],[31,20,31,25],[32,21,32,25],[34,20,34,21],[35,21,35,25],[52,20,52,21],[53,21,53,25],[57,20,57,25],[58,20,58,25],[59,20,59,25],[43,21,43,25],[44,20,44,25],[45,20,45,25],[46,20,46,25],[47,21,47,25],[94,20,94,25],[95,21,95,25],[73,20,73,25],[74,21,74,25],[76,20,76,21],[77,21,77,25],[78,20,78,25],[60,21,60,25],[67,20,67,25],[68,21,68,25],[70,20,70,25],[71,21,71,25],[23,26,23,28],[24,26,24,28],[44,26,44,28],[45,26,45,28],[46,26,46,28],[98,20,98,25],[99,21,99,25],[101,20,101,21],[102,21,102,25],[29,26,30,26],[32,26,33,26],[41,26,42,26],[54,20,54,25],[55,20,55,25],[56,20,56,25],[47,26,47,28],[48,26,48,28],[49,26,49,28],[50,26,50,28],[51,26,51,28],[52,26,52,28],[79,20,79,25],[80,20,80,25],[81,21,81,25],[58,26,58,28],[59,26,59,28],[60,26,60,28],[61,26,61,28],[62,26,62,28],[53,26,53,28],[54,26,54,28],[55,26,55,28],[56,26,56,28],[57,26,57,28],[68,26,68,28],[69,26,69,28],[70,26,70,28],[71,26,71,28],[72,26,72,28],[63,26,63,28],[64,26,64,28],[65,26,65,28],[66,26,66,28],[67,26,67,28],[78,26,78,28],[79,26,79,28],[80,26,80,28],[81,26,81,28],[82,26,82,28],[73,26,73,28],[74,26,74,28],[75,26,75,28],[76,26,76,28],[77,26,77,28],[96,26,96,28],[97,26,97,28],[88,26,88,28],[89,26,89,28],[90,26,90,28],[91,26,91,28],[92,26,92,28],[83,26,83,28],[84,26,84,28],[85,26,85,28],[86,26,86,28],[87,26,87,28],[18,0,18,2],[25,0,25,2],[0,19,112,19],[7,20,7,53],[8,20,8,53],[0,54,112,54],[113,20,113,53],[112,28,112,30],[103,20,107,27],[103,28,103,30],[104,28,104,30],[105,28,105,30],[106,28,106,30],[107,28,107,30],[108,20,112,27],[108,28,108,30],[98,26,98,28],[99,26,99,28],[100,26,100,28],[101,26,101,28],[102,26,102,28],[93,26,93,28],[94,26,94,28],[95,26,95,28]]}
[{"$nulls":20}," ",{"$nulls":10}," "," "," "]
["Races",null,null,1,2,3,4,5,6,7,8,9,10,11,12,{"$nulls":5}," ",{"$nulls":10}," ",null," "]
[null,"WARWICK FARM (SR)","Fields","3,2,5 F4","5,4,3 F4","8,6,2 F4","2,6,4 F4","1,2,6 F4","7,6,3 F4","2,12,4 F4","7,1,8 F4",{"$nulls":20}," ",null," "]
[null,"SUNSHINE COAST (QR)","Fields","4,11,12 F4","15,12,6 F4","8,6,7 F4","3,6,1 F4","2,11,9 F4","2,4,7 F4","6,1,2 F4","15,17,13 F4",{"$nulls":20}," ",null," "]
[null,"WELLINGTON (NR)","Fields","4,1,2 ","1,5,4 ","2,9,1 ","4,2,5 ","5,4,7 F4","3,4,5 F4","11,2,6 F4","3,1,7 F4",{"$nulls":20}," ",null," "]
[null,"CRANBOURNE (VR)","Fields","2,10,4 ","8,10,3 ","9,7,1 ","1,13,10 ","3,1,7 ","4,8,7 F4","1,11,9 F4","2,4,8 F4","1,7,3 F4",{"$nulls":8}," ",{"$nulls":17},"Username",null,"Password"]
[null,"GAWLER (AR)","Fields","9,7,5 F4","6,4,11 F4","6,4,9 F4","4,5,13 F4","4,10,5 F4","7,5,9 F4","4,6,1 F4","2,6,1 F4"]
[null,"GERALDTON (PR)","Fields","9,10,1 ","13,2,10 ","1,4,7 ","9,11,7 ","2,7,4 ","2,4,8 ","9,2,5 ","6,10,5 "]
[null,"WANGARATTA (ER)","Fields","3,2,5 ","3,9,7 ","4,5,3 ","7,2,5 F4","7,3,4 F4","4,12,11 F4","13,10,14 F4"]
[null,"HOBART (TR)","Fields","1,5,2 ","1,7,2 ","2,5,9 ","6,3,4 ","2,4,3 ","3,4,1 ","2,7,8 ","3,6,7 ",{"$nulls":15},"Horse Records"]
[null,"MACKAY (IR)","Fields","Abnd ","Abnd ","Abnd ","Abnd ","Abnd ","Abnd ","Abnd ",{"$nulls":10},"Sunday, 27 March",{"$nulls":5},"Jockey Records"]
[null,"KRANJI (SS)","Fields","9,4,10 ","9,10,1 ","9,7,1 ","2,1,12 ","5,6,3 ","4,1,9 ","1,7,4 ","3,6,7 ","6,3,2 ","5,10,6 ","1,10,3 ",{"$nulls":12},"Trainer Records"]
[null,"SCOTTSVILLE (AS)","Fields","1,13,6 ","4,3,13 ","1,2,4 ","11,6,8 ","Interim ","23m ","58m ","12:15am ","12:50am ",{"$nulls":9},"Australia",{"$nulls":4},"Stallion Records"]
[null,"UK (CS)","Fields","43m ","11:55:00","12:25am ",{"$nulls":16},"Cranbourne",null,"Partly cloudy. (Max: 22) Rail: Out 4m from 1000m-W.P. (Pent: 4.62). Track: DEAD","Speed MapNeuralsWorksheetCustomised Form Guide","Course Records"]
[null,"ENGLAND (ES)","Fields","28m ","58m ","12:10am ","12:40am ",{"$nulls":15},"Gawler",null,"Fine. (Max: 25) Rail: True. Track: DEAD","Speed MapNeuralsWorksheetCustomised Form Guide"]
[null,"SHA TIN (OS)","Fields","10,2,8 ","1,11,4 ","8,3,4 ","2,4,10 ","1,8,2 ","10,13,4 ","8,4,10 ","2,6,4 ","12,8,1 ","2,4,8 ",{"$nulls":9},"Geraldton",null,"Sunny. (Max: 34) Rail: True Track: GOOD","Speed MapNeuralsWorksheetCustomised Form Guide","Legend"]
[null,"WAIPUKURAU (ZS)","Fields","9,4,3 ","7,2,1 ","1,5,3 ","8,12,6 ","12,4,11 ","9,6,4 ","14,1,15 ","6,3,1 ","16,3,9 ",{"$nulls":10},"Hobart",null,"Fine. (Max: 23) Rail: True entire circumference. Track: DEAD","Speed MapNeuralsWorksheetCustomised Form Guide","Form Preview","Form Preview"]
[null,"LEOPARDSTOWN (IS)","Fields","48m ","12:00am ","12:30am ",{"$nulls":16},"Mackay",null,"Rain (Max: 26)","Speed MapNeuralsWorksheetCustomised Form Guide","Neurals","Neurals"]
["Trots",null,null,1,2,3,4,5,6,7,8,9,10,11,12,{"$nulls":7},"Sunshine Coast",null,"A few showers (Max: 27) Rail: 5m Entire Course. (Pent: 7.6). Track: SLOW","Speed MapNeuralsWorksheetCustomised Form Guide","Worksheet","Worksheet"]
[null,"TAMWORTH (ST)","Fields","3,2,9 ","8,5,3 ","10,1,(5,11) ","9,7,8 ","1,2,3 ","4,8,9 ","9,8,2 ","4,8,10 ",{"$nulls":11},"Wangaratta",null,"Clear. (Max: 25) Rail: Out 4m from 1000m-W.P. Out 4m from W.P-1600m. Track: DEAD","Speed MapNeuralsWorksheetCustomised Form Guide","Customised Form Guide","Customised Form Guide"]
[null,"ECHUCA (MT)","Fields","5,1,2 ","5,1,4 ","5,1,11 ","6,11,3 ","5,3,1 ","8,1,5 ","7,2,5 ","8,1,10 ",{"$nulls":11},"Warwick Farm",null,"Shower or two. (Max: 24) Rail: True. Track: DEAD","Speed MapNeuralsWorksheetCustomised Form Guide","Complete Form Service","Complete Form Service"]
[null,"CRANBOURNE (VT)","Fields","1,3,7 ","6,3,5 ","4,5,1 ","8,7,2 ","2,9,5 ","1,5,4 ","6,11,9 ",{"$nulls":12},"Wellington",null,"Shower or two. (Max: 24) Rail: True. Track: GOOD","Speed MapNeuralsWorksheetCustomised Form Guide"]
[null,"METHVEN (ZT)","Fields","10,6,4 ","10,9,2 ","9,14,4 ","7,3,9 ","1,8,2 ","11,1,8 ","19,12,3 ","2,8,3 ","17,19,7 ","14,10,2 ","9,11,15 "]
[null,"LAUNCESTON (TT)","Fields","8,3,11 ","11,12,6 ","5,4,6 ","11,6,1 ","6,4,1 ","1,6,4 ","9,6,7 ","1,2,9 ","2,4,5 ","7,4,13 ",{"$nulls":8},"Hong Kong"]
[null,"UNITED STATES (IT)","Fields","8,9,4 ","6,8,7 ","9,10,3 ","6,2,7 ","2,4,5 ","3,4,5 ","10,1,4 ","1,2,7 ","10,3,2 ","4,6,7 ","6,9,2 ",{"$nulls":8},"Sha Tin",null,"Mainly fine and dry with some haze. (Max: 22) Track: GOOD","Speed MapNeuralsWorksheetCustomised Form Guide","Media Centre"]
["Greyhounds",null,null,1,2,3,4,5,6,7,8,9,10,11,12]
[null,"CRANBOURNE (MG)","Fields","3,1,5 ","10,4,7 ","3,8,1 ","2,8,5 ","8,1,2 ","5,10,4 ","6,8,4 ","7,2,4 ",{"$nulls":10},"New Zealand",{"$nulls":4},"Punting Patto Moonee Valley 25th March 11"]
[null,"WAGGA (NG)","Fields","7,3,1 ","2,3,6 ","1,6,7 ","6,5,1 ","2,1,8 ","5,8,2 ","1,6,3 ","8,7,6 ","8,3,4 ","5,2,3 ",{"$nulls":9},"Waipukurau",null,"Partly Cloudy (Max: 14) Rail: True Track: DEAD","Speed MapNeuralsWorksheetCustomised Form Guide",null,"The Smarts with Tom Waterhouse 26/3/11"]
[null,"SALE (VG)","Fields","8,7,2 ","1,5,3 ","3,8,5 ","1,3,9 ","6,3,5 ","1,7,8 ","3,1,2 ","9,1,4 ","8,1,6 ","3,1,4 ",{"$nulls":14},"Steve Moran Selects for 24/3/11"]
[null,"STRATHALBYN (AG)","Fields","2,6,4 F4","2,7,1 F4","5,3,4 F4","3,7,2 F4","1,2,4 F4","5,3,6 F4","1,8,2 F4","4,2,1 F4","4,6,2 F4","8,5,3 F4",{"$nulls":8},"Singapore"]
[null,"CANBERRA (CG)","Fields","3,5,2 ","7,8,1 ","7,5,4 ","7,5,1 ","2,1,3 ","8,5,4 ","5,8,7 ","6,9,8 ","3,7,1 ","4,2,8 ",{"$nulls":9},"Kranji Aw",null,"Scattered Thunder Storms (Max: 24)","Form Preview Speed MapNeuralsWorksheetCustomised Form Guide",null,"Black Caviar and Peter Moody Moonee Valley Preview"]
[null,"HEALESVILLE (EG)","Fields","1,8,6 ","1,5,2 ","4,6,1 ","2,5,8 ","2,1,8 ","7,1,5 ","1,8,3 ","7,8,5 ","2,8,1 ","3,8,7 ","2,4,3 ","3,4,5 ",{"$nulls":12},"Aquanita Track Talk 24/03/11"]
[null,"MANUKAU (ZG)","Fields","1,3,4 ","3,9,8 ","7,2,6 ","1,6,3 ","1,8,2 ","4,3,2 ","4,8,1 ","8,4,7 ","4,3,7 ","8,6,7 ","3,5,6 ",{"$nulls":7},"South Africa"]
[null,"MT GAMBIER (DG)","Fields","1,3,2 F4","7,2,4 F4","1,6,10 F4","1,3,7 F4","1,7,8 F4","1,8,6 F4","9,2,8 F4","2,1,8 F4","8,3,1 F4","4,6,5 F4",{"$nulls":9},"Scottsville",null,"Partly Cloudy (Max: 28)","Speed MapNeuralsWorksheetCustomised Form Guide",null,"Dubai Trackwork Thursday 24th March 2011"]
[{"$nulls":27},"Carl O'Callaghan talks about Kinsale King in Dubai 2011"]
[{"$nulls":27},"Saimee Jumaat talks to Craig Evans about Better Than Ever"]
[{"$nulls":27},"Craig Evans speaks with Danny Beasley regarding Better Be The One in Dubai 2011"]
[{"$nulls":20},"Monday, 28 March",{"$nulls":6},"Craig Evans talks to Felix Coetzee about Rocket Man in Dubai 2011"]
[{"$nulls":27},"Dubai World Cup Day preview - John Moore : Dim Sum & Sunny King"]
[{"$nulls":21},"Australia",{"$nulls":5},"Dubai World Cup Day preview - Herman Brown : Bankable & Sweet Ducky"]
[{"$nulls":22},"Ararat",null,"Sunny. (Max: 23)","Speed MapNeuralsWorksheetCustomised Form Guide",null,"Fox Sports' Julian De Stoop on AFL's round one"]
[{"$nulls":22},"Taree",null,"Shower or two. (Max: 24) Rail: True. Track: DEAD 5","Speed MapNeuralsWorksheetCustomised Form Guide",null,"Australian Grand Prix preview with Matt Clayton"]
[{"$nulls":27},"Motorsport journalist Matthew Clayton previews the weekend's Australian Grand Prix in Melbourne."]
[{"$nulls":27},"Mark Webber tops opening Formula One practice"]
[]
[{"$nulls":20},"Tuesday, 29 March"]
[]
[{"$nulls":21},"Australia"]
[{"$nulls":22},"Kalgoorlie",null,"Sunny. (Max: 29)","Speed MapNeuralsWorksheetCustomised Form Guide"]
[{"$nulls":22},"Moe",null,"Sunny. (Max: 27)","Speed MapNeuralsWorksheetCustomised Form Guide"]
[{"$nulls":22},"Scone",null,"Possible shower. (Max: 26)","Speed MapNeuralsWorksheetCustomised Form Guide"]
[{"$nulls":22},"Townsville",null,"Showers, rain periods (Max: 29) Rail: True Entire Course. Track: HEAVY 10","Speed MapNeuralsWorksheetCustomised Form Guide"]
[]
[]
[]
[]
[]
[]
[{"$nulls":20},"Friday, 25 March"]
[]
[{"$nulls":21},"Australia"]
[{"$nulls":22},"Albury",null,"Shower or two. (Max: 23) Rail: True. Track: GOOD","Speed MapNeuralsWorksheetCustomised Form Guide"]
[{"$nulls":22},"Geelong Synthetic",null,"Shower or two. (Max: 20) Rail: True Position Entire Circuit. Track: GOOD","Speed MapNeuralsWorksheetCustomised Form Guide"]
[{"$nulls":22},"Ipswich",null,"Fine (Max: 28) 1m metre Entire Course. Track: DEAD","Speed MapNeuralsWorksheetCustomised Form Guide"]
[{"$nulls":22},"Moonee Valley",null,"Shower or two. (Max: 20) Rail: Out 2m Entire Circuit. Track: DEAD (Pent: 4.74)","Speed MapNeuralsWorksheetCustomised Form Guide"]
[{"$nulls":22},"Mt Gambier",null,"Fine. (Max: 21) Rail: True. Track: HVY","Speed MapNeuralsWorksheetCustomised Form Guide"]
[{"$nulls":22},"Tamworth",null,"Partly cloudy. (Max: 26) Rail: True. Track: GOOD","Speed MapNeuralsWorksheetCustomised Form Guide"]
[]
[{"$nulls":21},"New Zealand"]
[{"$nulls":22},"Te Awamutu",null,"Showers (Max: 16) Rail: True Track: GOOD","Speed MapNeuralsWorksheetCustomised Form Guide"]
[]
[{"$nulls":21},"Singapore"]
[{"$nulls":22},"Kranji Aw",null,"Scattered Thunder Storms (Max: 24)","Form Preview Speed MapNeuralsWorksheetCustomised Form Guide"]
[]
[{"$nulls":21},"South Africa"]
[{"$nulls":22},"Fairview",null,"Sunny (Max: 22)","Speed MapNeuralsWorksheetCustomised Form Guide"]
[]
[]
[]
[{"$nulls":20},"Saturday, 26 March"]
[]
[{"$nulls":21},"Australia"]
[{"$nulls":22},"Alice Springs",null,"Clear. (Max: 25) Rail: True. Track: GOOD","Speed MapNeuralsWorksheetCustomised Form Guide"]
[{"$nulls":22},"Ascot",null,"Clear. (Max: 34) Rail: Out 3m Track: GOOD","Speed MapNeuralsWorksheetCustomised Form Guide"]
[{"$nulls":22},"Caulfield",null,"A little drizzle. (Max: 21) Rail: Out 9m Entire Circuit. Track: DEAD","Speed MapNeuralsWorksheetCustomised Form Guide"]
[{"$nulls":22},"Colac",null,"A little drizzle. (Max: 19) Rail: True Position Entire Circuit. Track: DEAD","Speed MapNeuralsWorksheetCustomised Form Guide"]
[{"$nulls":22},"Doomben",null,"Mostly fine, possible shower. (Max: 27) Rail: 5m Entire Course. Track: GOOD","Speed MapNeuralsWorksheetCustomised Form Guide"]
[{"$nulls":22},"Gold Coast",null,"A shower or two (Max: 27) Rail: 3.5m 1400-W/Post; 6m Remainder. Track: GOOD","Speed MapNeuralsWorksheetCustomised Form Guide"]
[{"$nulls":22},"Goulburn",null,"Mostly clear. (Max: 19) Rail: Out 3m Entire. (Pent: 5.2). Track: DEAD","Speed MapNeuralsWorksheetCustomised Form Guide"]
[{"$nulls":22},"Morphettville",null,"Fine. (Max: 23) Rail: Out 4m 1800 to WP, True remainder. Sectional 605m. Track: GOOD","Speed MapNeuralsWorksheetCustomised Form Guide"]
[{"$nulls":22},"Newcastle",null,"Shower or two. (Max: 23) Rail: True. Track: GOOD","Speed MapNeuralsWorksheetCustomised Form Guide"]
[{"$nulls":22},"Rosehill",null,"Possible light shower. (Max: 22) Rail: Out 2m Entire Circuit. Track: DEAD","Speed MapNeuralsWorksheetCustomised Form Guide"]
[{"$nulls":22},"Toowoomba Cushion",null,"Mostly fine, possible shower. (Max: 27) Rail: True Track: GOOD","Speed MapNeuralsWorksheetCustomised Form Guide"]
[{"$nulls":22},"Wellington",null,"Possible light shower. (Max: 22) Rail: True. Track: GOOD","Speed MapNeuralsWorksheetCustomised Form Guide"]
[]
[{"$nulls":21},"New Zealand"]
[{"$nulls":22},"Riccarton Park",null,"Showers Late (Max: 12) Rail: Out 2m Track: GOOD","Speed MapNeuralsWorksheetCustomised Form Guide"]
[{"$nulls":22},"Tauranga",null,"Heavy Thunder Storms (Max: 18) Rail: True Track: HVY","Speed MapNeuralsWorksheetCustomised Form Guide"]
[]
[{"$nulls":21},"South Africa"]
[{"$nulls":22},"Turffontein Standside",null,"Showers (Max: 23)","Speed MapNeuralsWorksheetCustomised Form Guide"]
[]
[]
[{"$nulls":28},"RISA Notice:"]
[]
[{"$nulls":28},"© 2010, Racing Information Services Australia (RISA) and others working with it. These racing materials are reproduced under a copyright licence. Any unauthorised reproduction, adaptation or communication is strictly prohibited."]
[{"$nulls":28},"Full copyright notice."]
[]
[]
[]
[]
[{"$nulls":28},"Racing and Sports",null,"Racing and Sports Pty Ltd | Contact Us | R&S Terms of Use | R&S Privacy"]
[{"$nulls":28},"This site is maintained by Racing and Sports (®) Pty Ltd (ABN 093 360 108) (\"R&S\"). Copyright in all R&S materials is owned by Racing and Sports Pty Ltd (R&S). Racing and Sports is a Registered Trademark. R&S takes all care in the preparation of information appearing on the site, but accepts no responsibility nor warrants the accuracy of the information displayed. This information is provided for entertainment purposes only. All information including race fields and TAB numbers should be checked with an official source. (RAS-WWW01) (ADS1)"]
[]
[{"$nulls":19},"\"; } var allLinks = document.links; for (var i=0; i=0) { } else if (allLinks[i].href.indexOf(\"viewStallion\")>=0) { } else if (allLinks[i].href.indexOf(\"viewJockey\")>=0) { } else if (allLinks[i].href.indexOf(\"viewTrainer\")>=0) { } else if (allLinks[i].href.indexOf(\"viewCourse\")>=0) { } } //-->"]

{"sheet":"Race","index":4,"n_rows":50,"n_cols":14,"rows_kept":50,"cut":false,"hidden":false,"merged":[]}
[]
["SUNSHINE COAST",null,"QR 8","PAYING"]
[]
["2011-03-27","CLASS 1 HANDICAP",null,null,"Fixed Price"]
["RADIO TAB","1-7-4-16",null,null,"Late Mail 9","1200M","SHOWERY","HEAVY(8)"]
[]
[{"$nulls":6},"SCR 2 5 6L 8 10 11 12"]
[15,null,"JAMESON AICH",44.2,10.6]
[17,null,"FINAGLE",null,2.8,null,"Sub Fav 7"]
[13,null,"RASCAL",null,11.4]
[]
["QN","15*17",275,null,null,null,"TF","15*17*13",10326.200000000001]
["EX","15*17",573.70000000000005,null,null,null,"A2","15*17",77.5]
["DD","6*15",377.6,{"$nulls":4},"13*15",205.5]
["TT","2* 6*15",2125.6,{"$nulls":4},"13*17",72.5]
["QD","2* 2* 6*15",24950.1]
[null,"Jackpot",2806.96]
["F4","(Jackpot) 15*17*13* 3",2695.9]
["No.",null,"Name","04:36:00","Win","Plc",null,"Rider  ","Bar","Wght",null,"Form","L3S","Rtng"]
[1,null,"ENEMYATTHEGATE",10.8,7,2.8,null,"P HAMMERSLEY",17,57,null,null,"5X0",92]
[2,null,"ROCKY HABIT",{"$nulls":4},"SCRATCHED",4]
[3,null,"NAUTICAT",7.5,6.2,2.1,null,"S SCRIVEN",10,56.5,null,null,"29X",89]
[4,null,"NEWLAND WARRIOR",13.2,18.2,3.8,null,"M HELLYER(A)",6,56,null,null,"21X",88]
[5,null,"PORTUGUESE",{"$nulls":4},"SCRATCHED",15]
[6,null,"BY CHOICE",{"$nulls":4},"LATE SCRATCHING",5]
[7,null,"PATH TO FREEDOM",4,3.3,1.6,null,"S GALLOWAY",7,55.5,null,"C","22X",94]
[8,null,"MUNBURA FLYER",{"$nulls":4},"SCRATCHED",21]
[9,null,"MALLARD",3.6,4.4000000000000004,1.9,null,"J BYRNE",16,54.5,null,"D","X61",100]
[10,null,"ILLUDE",{"$nulls":4},"SCRATCHED",8]
[11,null,"WAASIES SHADOW",{"$nulls":4},"SCRATCHED",11]
[12,null,"AT SUNDOWN",{"$nulls":4},"SCRATCHED",20]
[13,null,"RASCAL",38.200000000000003,56.8,11.4,null,"J HOOPERT",2,54.5,null,null,679,84]
[14,null,"RUSSIAN ROYALTY",14.5,18.399999999999999,3.3,null,"D GREEN",14,54.5,null,"T",932,91]
[15,null,"JAMESON AICH",32.799999999999997,44.2,10.6,null,"MITCHELL WOOD(A)",9,54.5,null,null,"0X6",87]
[16,null,"ST ORIENTAIR",26.1,22.4,5.3,null,"J KROPP(A)",1,54.5,null,null,"68X",89]
[17,null,"FINAGLE",8.8000000000000007,10.9,2.8,null,"E WILKINSON",12,54.5,null,"C",834,94]
[18,null,"CROWN THE WARRIOR",40.5,57.2,12.4,null,"T HUXHAM(A)",3,54.5,null,null,"01X",90]
[19,null,"BRADASH",90.7,97.1,18.2,null,"P SCHMIDT(A)",18,54.5,null,"D","06X",77]
[20,null,"EL CONDE",63.5,88.6,19.8,null,"I COOMBES",19,54.5,null,"W","09X",90]
[21,null,"CAVALLO D'ORO",38.4,46.7,9.8000000000000007,null,"K WHARTON",13,54.5,null,"C",895,90]
[]
["UNiTAB Pool Totals"]
["WN",57033,"QN",9203,"TF",30333,"DD(7,8) "]
["PL",25363,"EX",4006,"F4",2695,"TT(6,7,8) "]
[null,null,"A2",1759,null,null,"QD(5,6,7,8) "]
[]
["<< QR  1  2  3  4  5  6  7  8  DD/TT/QD  XD Riders  Fixed Price >>"]
[]
["Help","Gambling Advice","TAB Home","Refresh"]
["© Copyright UNiTAB Ltd","Created: Sun, 27 Mar 2011 16:46:41 Aust EST"]

{"sheet":"Selections","index":5,"n_rows":25,"n_cols":10,"rows_kept":25,"cut":false,"hidden":false,"merged":[]}
["Venue",null,"Race",null,"No","Runner",null,null,"Win","Place"]
["SUNSHINE COAST",null,1,"Fav",4,"Expressway",null,null,4.5999999999999996,1.8]
["",null,"","","","",null,null,"",""]
["SUNSHINE COAST",null,1,2.5,11,"Dawn Return",null,null,0,1.9]
["",null,"","","","",null,null,"",""]
["",null,"","","","",null,null,"",""]
["SUNSHINE COAST",null,2,3.7,7,"Zaabman",null,null,"",""]
["",null,"","","","",null,null,"",""]
["",null,"","","","",null,null,"",""]
["SUNSHINE COAST",null,3,3.7,13,"Run Away Ruby",null,null,"",""]
["",null,"","","","",null,null,"",""]
["",null,"","","","",null,null,"",""]
["SUNSHINE COAST",null,4,3.8,3,"Borsha'S Warrior",null,null,5.5,1.8]
["",null,"","","","",null,null,"",""]
["",null,"","","","",null,null,"",""]
["SUNSHINE COAST",null,5,3.2,5,"Shockwaves",null,null,"",""]
["SUNSHINE COAST",null,6,"Fav",4,"Karanja",null,null,0,1.2]
["",null,"","","","",null,null,"",""]
["SUNSHINE COAST",null,6,2.5,2,"Nickiera",null,null,4.9000000000000004,1.8]
["",null,"","","","",null,null,"",""]
["",null,"","","","",null,null,"",""]
["SUNSHINE COAST",null,7,4,8,"Laughing Crusader",null,null,"",""]
["SUNSHINE COAST",null,8,"Fav",9,"Mallard",null,null,"",""]
["SUNSHINE COAST",null,8,"CP/FR",9,"Mallard",null,null,"",""]
["SUNSHINE COAST",null,8,3.2,9,"Mallard",null,null,"",""]