{"text_format":"2","workbook":"xlsx","n_sheets":6,"sheets":["Neurals","Data","Instructions","Meetings","Race","Selections"],"not_rendered":{"charts":0,"images":0,"macros":1,"external_links":0,"defined_names":1154,"comments":0,"pivot_tables":0},"unopened":[],"bounds":{"document_bytes":16777216,"sheet_cells":100000,"run_cost":"one","rows_first":2000,"rows_last":500,"rows_between":2000,"halvings":0,"cell_chars":16384,"cell_head_chars":4096},"cells_cut":0,"cells_raw":0,"read":"whole","date_system":"1900"}

{"sheet":"Neurals","index":0,"n_rows":68,"n_cols":32,"rows_kept":68,"cut":false,"hidden":false,"merged":[[2,5,2,7],[1,8,2,10],[2,14,2,15]]}
[{"$nulls":20},{"$f":"IF(Race!D2=\"Paying\",\"Paying\",\"\")","v":"Paying"},{"$f":"SUM(AA1:AA3)","v":27},{"$f":"IF(AA1<>\"\",B3,\"\")","v":"SUNSHINE COAST"},null,{"$f":"IF(AA1<>\"\",E3,\"\")","v":9},{"$f":"IF(AA1=\"\",\"\",\"Fav\")","v":"Fav"},{"$f":"IF(SUM(Y11:Y36)>0,SUM(Y11:Y36),\"\")","v":9},{"$f":"IF(AA1=\"\",\"\",IF(ISNA(CLEAN(TRIM((VLOOKUP(AA1,$Y$11:$Z$36,2,FALSE))))),\"\",CLEAN(TRIM((VLOOKUP(AA1,$Y$11:$Z$36,2,FALSE))))))","v":"Mallard"},null,null,{"$f":"IF(U1<>\"\",IF(ISNA(VLOOKUP(AB1,Data!$C$3:$E$5,2,FALSE)),\"\",(VLOOKUP(AB1,Data!$C$3:$E$5,2,FALSE))),\"\")","v":""},{"$f":"IF(U1<>\"\",IF(ISNA(VLOOKUP(AB1,Data!$C$3:$E$5,1,FALSE)),\"\",(VLOOKUP(AB1,Data!$C$3:$E$5,3,FALSE))),\"\")","v":""}]
[null,"Race Venue",null,"Race Code","1st Race No","Last Race No",{"$nulls":6},"WT",null,"Min Price",{"$nulls":7},{"$f":"IF(AA2<>\"\",B3,\"\")","v":"SUNSHINE COAST"},null,{"$f":"IF(AA2<>\"\",E3,\"\")","v":9},{"$f":"IF(AA2=\"\",\"\",\"CP/FR\")","v":"CP/FR"},{"$f":"IF(SUM(Y41:Y67)>0,SUM(Y41:Y67),\"\")","v":9},{"$f":"IF(AA2=\"\",\"\",IF(ISNA(CLEAN(TRIM((VLOOKUP(AA2,$Y$41:$Z$65,2,FALSE))))),\"\",(CLEAN(TRIM((VLOOKUP(AA2,$Y$41:$Z$65,2,FALSE)))))))","v":"Mallard"},null,null,{"$f":"IF(U1<>\"\",IF(ISNA(VLOOKUP(AB2,Data!$C$3:$E$5,2,FALSE)),\"\",(VLOOKUP(AB2,Data!$C$3:$E$5,2,FALSE))),\"\")","v":""},{"$f":"IF(U1<>\"\",IF(ISNA(VLOOKUP(AB2,Data!$C$3:$E$5,1,FALSE)),\"\",(VLOOKUP(AB2,Data!$C$3:$E$5,3,FALSE))),\"\")","v":""}]
[null,"SUNSHINE COAST",null,"16324",9,8,{"$nulls":6},2,null,2,{"$nulls":7},{"$f":"IF(AA3<>\"\",B3,\"\")","v":"SUNSHINE COAST"},null,{"$f":"IF(AA3<>\"\",E3,\"\")","v":9},{"$f":"IF(AA3<>\"\",AA39,\"\")","v":3.2},{"$f":"IF(AA39<O3,\"\",IF(AB39<>\"\",AB39,\"\"))","v":9},{"$f":"IF(AA3=\"\",\"\",IF(ISNA(CLEAN(TRIM((VLOOKUP(AA3,$B$36:$C$71,2,FALSE))))),\"\",(CLEAN(TRIM((VLOOKUP(AA3,$B$36:$C$71,2,FALSE)))))))","v":"Mallard"},null,null,{"$f":"IF(U1<>\"\",IF(ISNA(VLOOKUP(AB3,Data!$C$3:$E$5,2,FALSE)),\"\",(VLOOKUP(AB3,Data!$C$3:$E$5,2,FALSE))),\"\")","v":""},{"$f":"IF(U1<>\"\",IF(ISNA(VLOOKUP(AB3,Data!$C$3:$E$5,1,FALSE)),\"\",(VLOOKUP(AB3,Data!$C$3:$E$5,3,FALSE))),\"\")","v":""}]
[]
[]
[]
[]
[null,{"$f":"B3","v":"SUNSHINE COAST"},null,"Race",{"$f":"E3","v":9}]
[null,null,{"$f":"LARGE(C11:C40,1)","v":282.5},null,{"$f":"LARGE(E11:E40,1)","v":47},{"$nulls":24},"Todays Venues"]
["TAB","HORSE","NR","HCP","CP","CF","TIM","SCR","JA","TA","JT","BP","WET","CRS","D","$","DLR",{"$nulls":5},"Unitab Rated",null,null,"Runner"]
{"$rows_left_out":59}
{"sheet":"Data","index":1,"n_rows":45,"n_cols":24,"rows_kept":45,"cut":false,"hidden":false,"merged":[]}
[{"$f":"Neurals!B3","v":"SUNSHINE COAST"},{"$f":"Neurals!E3","v":9},{"$f":"Neurals!U1","v":"Paying"},null,"2011-03-27",null,{"$f":"IF(ISNA(VLOOKUP(A1,F2:Q40,B1+2,FALSE)),\"\",VLOOKUP(A1,F2:Q40,B1+2,FALSE))","v":""},{"$nulls":14},{"$f":"IF(W1<>\"\",CLEAN(TRIM(Meetings!W1)),\"\")","v":""},{"$f":"IF(Meetings!W1=\"\",\"\",getAddress(Meetings!W1))","v":""},{"$f":"IF(W1=\"\",\"\",RIGHT(W1,LEN(W1)-FIND(\"=\",W1,1)))","v":""}]
[{"$nulls":5},{"$f":"IF(G2=\"\",\"\",IF(ISERROR(CLEAN(TRIM((LEFT(G2,FIND(\"(\",G2,1)-1))))),\"\",CLEAN(TRIM(LEFT(G2,FIND(\"(\",G2,1)-1)))))","v":"WARWICK FARM"},{"$f":"IF(Meetings!B3=\"\",\"\",Meetings!B3)","v":"WARWICK FARM (SR)"},{"$f":"IF(Meetings!D3=\"\",\"\",getAddress(Meetings!D3))","v":"http://www.tabonline.com.au/2011/03/27/SR01.html"},{"$f":"IF(Meetings!E3=\"\",\"\",getAddress(Meetings!E3))","v":"http://www.tabonline.com.au/2011/03/27/SR02.html"},{"$f":"IF(Meetings!F3=\"\",\"\",getAddress(Meetings!F3))","v":"http://www.tabonline.com.au/2011/03/27/SR03.html"},{"$f":"IF(Meetings!G3=\"\",\"\",getAddress(Meetings!G3))","v":"http://www.tabonline.com.au/2011/03/27/SR04.html"},{"$f":"IF(Meetings!H3=\"\",\"\",getAddress(Meetings!H3))","v":"http://www.tabonline.com.au/2011/03/27/SR05.html"},{"$f":"IF(Meetings!I3=\"\",\"\",getAddress(Meetings!I3))","v":"http://www.tabonline.com.au/2011/03/27/SR06.html"},{"$f":"IF(Meetings!J3=\"\",\"\",getAddress(Meetings!J3))","v":"http://www.tabonline.com.au/2011/03/27/SR07.html"},{"$f":"IF(Meetings!K3=\"\",\"\",getAddress(Meetings!K3))","v":"http://www.tabonline.com.au/2011/03/27/SR08.html"},{"$f":"IF(Meetings!L3=\"\",\"\",getAddress(Meetings!L3))","v":""},{"$f":"IF(Meetings!M3=\"\",\"\",getAddress(Meetings!M3))","v":""},{"$f":"IF(Meetings!N3=\"\",\"\",getAddress(Meetings!N3))","v":""},{"$f":"IF(Meetings!O3=\"\",\"\",getAddress(Meetings!O3))","v":""},null,null,{"$f":"IF(W2<>\"\",CLEAN(TRIM(Meetings!W2)),\"\")","v":""},{"$f":"IF(Meetings!W2=\"\",\"\",getAddress(Meetings!W2))","v":""},{"$f":"IF(W2=\"\",\"\",RIGHT(W2,LEN(W2)-FIND(\"=\",W2,1)))","v":""}]
[{"$f":"IF(Race!N1<>\"\",(CLEAN(TRIM(Race!C1))),\"\")","v":""},{"$f":"IF(A3<>\"\",Race!I1,\"\")","v":""},{"$f":"IF($C$1<>\"\",CLEAN(TRIM(INDEX(Race!$A$1:$C20,MATCH(\"QN\",Race!$A1:$A$20,0)-4,3))),\"\")","v":"JAMESON AICH"},{"$f":"IF(ISNA(VLOOKUP(C3,Race!$C$2:$E$15,2,FALSE)),\"\",(VLOOKUP(C3,Race!$C$2:$E$15,2,FALSE)))","v":44.2},{"$f":"IF(ISNA(VLOOKUP(C3,Race!$C$2:$E$15,3,FALSE)),\"\",(VLOOKUP(C3,Race!$C$2:$E$15,3,FALSE)))","v":10.6},{"$f":"IF(G3=\"\",\"\",IF(ISERROR(CLEAN(TRIM((LEFT(G3,FIND(\"(\",G3,1)-1))))),\"\",CLEAN(TRIM(LEFT(G3,FIND(\"(\",G3,1)-1)))))","v":"SUNSHINE COAST"},{"$f":"IF(Meetings!B4=\"\",\"\",Meetings!B4)","v":"SUNSHINE COAST (QR)"},{"$f":"IF(Meetings!D4=\"\",\"\",getAddress(Meetings!D4))","v":"http://www.tabonline.com.au/2011/03/27/QR01.html"},{"$f":"IF(Meetings!E4=\"\",\"\",getAddress(Meetings!E4))","v":"http://www.tabonline.com.au/2011/03/27/QR02.html"},{"$f":"IF(Meetings!F4=\"\",\"\",getAddress(Meetings!F4))","v":"http://www.tabonline.com.au/2011/03/27/QR03.html"},{"$f":"IF(Meetings!G4=\"\",\"\",getAddress(Meetings!G4))","v":"http://www.tabonline.com.au/2011/03/27/QR04.html"},{"$f":"IF(Meetings!H4=\"\",\"\",getAddress(Meetings!H4))","v":"http://www.tabonline.com.au/2011/03/27/QR05.html"},{"$f":"IF(Meetings!I4=\"\",\"\",getAddress(Meetings!I4))","v":"http://www.tabonline.com.au/2011/03/27/QR06.html"},{"$f":"IF(Meetings!J4=\"\",\"\",getAddress(Meetings!J4))","v":"http://www.tabonline.com.au/2011/03/27/QR07.html"},{"$f":"IF(Meetings!K4=\"\",\"\",getAddress(Meetings!K4))","v":"http://www.tabonline.com.au/2011/03/27/QR08.html"},{"$f":"IF(Meetings!L4=\"\",\"\",getAddress(Meetings!L4))","v":""},{"$f":"IF(Meetings!M4=\"\",\"\",getAddress(Meetings!M4))","v":""},{"$f":"IF(Meetings!N4=\"\",\"\",getAddress(Meetings!N4))","v":""},{"$f":"IF(Meetings!O4=\"\",\"\",getAddress(Meetings!O4))","v":""},null,null,{"$f":"IF(W3<>\"\",CLEAN(TRIM(Meetings!W3)),\"\")","v":""},{"$f":"IF(Meetings!W3=\"\",\"\",getAddress(Meetings!W3))","v":""},""]
[{"$f":"IF(Race!N2<>\"\",(CLEAN(TRIM(Race!C2))),\"\")","v":""},{"$f":"IF(A4<>\"\",Race!N2,\"\")","v":""},{"$f":"IF($C$1<>\"\",CLEAN(TRIM(INDEX(Race!$A$1:$C21,MATCH(\"QN\",Race!$A2:$A$20,0)-2,3))),\"\")","v":"FINAGLE"},{"$f":"IF(ISNA(VLOOKUP(C4,Race!$C$2:$E$15,2,FALSE)),\"\",(VLOOKUP(C4,Race!$C$2:$E$15,2,FALSE)))","v":0},{"$f":"IF(ISNA(VLOOKUP(C4,Race!$C$2:$E$15,3,FALSE)),\"\",(VLOOKUP(C4,Race!$C$2:$E$15,3,FALSE)))","v":2.8},"WELLINGTON",{"$f":"IF(Meetings!B5=\"\",\"\",Meetings!B5)","v":"WELLINGTON (NR)"},{"$f":"IF(Meetings!D5=\"\",\"\",getAddress(Meetings!D5))","v":"http://www.tabonline.com.au/2011/03/27/NR01.html"},{"$f":"IF(Meetings!E5=\"\",\"\",getAddress(Meetings!E5))","v":"http://www.tabonline.com.au/2011/03/27/NR02.html"},{"$f":"IF(Meetings!F5=\"\",\"\",getAddress(Meetings!F5))","v":"http://www.tabonline.com.au/2011/03/27/NR03.html"},{"$f":"IF(Meetings!G5=\"\",\"\",getAddress(Meetings!G5))","v":"http://www.tabonline.com.au/2011/03/27/NR04.html"},{"$f":"IF(Meetings!H5=\"\",\"\",getAddress(Meetings!H5))","v":"http://www.tabonline.com.au/2011/03/27/NR05.html"},{"$f":"IF(Meetings!I5=\"\",\"\",getAddress(Meetings!I5))","v":"http://www.tabonline.com.au/2011/03/27/NR06.html"},{"$f":"IF(Meetings!J5=\"\",\"\",getAddress(Meetings!J5))","v":"http://www.tabonline.com.au/2011/03/27/NR07.html"},{"$f":"IF(Meetings!K5=\"\",\"\",getAddress(Meetings!K5))","v":"http://www.tabonline.com.au/2011/03/27/NR08.html"},{"$f":"IF(Meetings!L5=\"\",\"\",getAddress(Meetings!L5))","v":""},{"$f":"IF(Meetings!M5=\"\",\"\",getAddress(Meetings!M5))","v":""},{"$f":"IF(Meetings!N5=\"\",\"\",getAddress(Meetings!N5))","v":""},{"$f":"IF(Meetings!O5=\"\",\"\",getAddress(Meetings!O5))","v":""},null,null,{"$f":"IF(W4<>\"\",CLEAN(TRIM(Meetings!W4)),\"\")","v":""},{"$f":"IF(Meetings!W4=\"\",\"\",getAddress(Meetings!W4))","v":""},""]
[{"$f":"IF(Race!N3<>\"\",(CLEAN(TRIM(Race!C3))),\"\")","v":""},{"$f":"IF(A5<>\"\",Race!N3,\"\")","v":""},{"$f":"IF($C$1<>\"\",CLEAN(TRIM(INDEX(Race!$A$1:$C22,MATCH(\"QN\",Race!$A3:$A$20,0)-0,3))),\"\")","v":"RASCAL"},{"$f":"IF(ISNA(VLOOKUP(C5,Race!$C$2:$E$15,2,FALSE)),\"\",(VLOOKUP(C5,Race!$C$2:$E$15,2,FALSE)))","v":0},{"$f":"IF(ISNA(VLOOKUP(C5,Race!$C$2:$E$15,3,FALSE)),\"\",(VLOOKUP(C5,Race!$C$2:$E$15,3,FALSE)))","v":11.4},"CRANBOURNE",{"$f":"IF(Meetings!B6=\"\",\"\",Meetings!B6)","v":"CRANBOURNE (VR)"},{"$f":"IF(Meetings!D6=\"\",\"\",getAddress(Meetings!D6))","v":"http://www.tabonline.com.au/2011/03/27/VR01.html"},{"$f":"IF(Meetings!E6=\"\",\"\",getAddress(Meetings!E6))","v":"http://www.tabonline.com.au/2011/03/27/VR02.html"},{"$f":"IF(Meetings!F6=\"\",\"\",getAddress(Meetings!F6))","v":"http://www.tabonline.com.au/2011/03/27/VR03.html"},{"$f":"IF(Meetings!G6=\"\",\"\",getAddress(Meetings!G6))","v":"http://www.tabonline.com.au/2011/03/27/VR04.html"},{"$f":"IF(Meetings!H6=\"\",\"\",getAddress(Meetings!H6))","v":"http://www.tabonline.com.au/2011/03/27/VR05.html"},{"$f":"IF(Meetings!I6=\"\",\"\",getAddress(Meetings!I6))","v":"http://www.tabonline.com.au/2011/03/27/VR06.html"},{"$f":"IF(Meetings!J6=\"\",\"\",getAddress(Meetings!J6))","v":"http://www.tabonline.com.au/2011/03/27/VR07.html"},{"$f":"IF(Meetings!K6=\"\",\"\",getAddress(Meetings!K6))","v":"http://www.tabonline.com.au/2011/03/27/VR08.html"},{"$f":"IF(Meetings!L6=\"\",\"\",getAddress(Meetings!L6))","v":"http://www.tabonline.com.au/2011/03/27/VR09.html"},{"$f":"IF(Meetings!M6=\"\",\"\",getAddress(Meetings!M6))","v":""},{"$f":"IF(Meetings!N6=\"\",\"\",getAddress(Meetings!N6))","v":""},{"$f":"IF(Meetings!O6=\"\",\"\",getAddress(Meetings!O6))","v":""},null,null,{"$f":"IF(W5<>\"\",CLEAN(TRIM(Meetings!W5)),\"\")","v":""},{"$f":"IF(Meetings!W5=\"\",\"\",getAddress(Meetings!W5))","v":""},""]
[{"$f":"IF(Race!N4<>\"\",(CLEAN(TRIM(Race!C4))),\"\")","v":""},{"$f":"IF(A6<>\"\",Race!N4,\"\")","v":""},null,null,null,"GAWLER",{"$f":"IF(Meetings!B7=\"\",\"\",Meetings!B7)","v":"GAWLER (AR)"},{"$f":"IF(Meetings!D7=\"\",\"\",getAddress(Meetings!D7))","v":"http://www.tabonline.com.au/2011/03/27/AR01.html"},{"$f":"IF(Meetings!E7=\"\",\"\",getAddress(Meetings!E7))","v":"http://www.tabonline.com.au/2011/03/27/AR02.html"},{"$f":"IF(Meetings!F7=\"\",\"\",getAddress(Meetings!F7))","v":"http://www.tabonline.com.au/2011/03/27/AR03.html"},{"$f":"IF(Meetings!G7=\"\",\"\",getAddress(Meetings!G7))","v":"http://www.tabonline.com.au/2011/03/27/AR04.html"},{"$f":"IF(Meetings!H7=\"\",\"\",getAddress(Meetings!H7))","v":"http://www.tabonline.com.au/2011/03/27/AR05.html"},{"$f":"IF(Meetings!I7=\"\",\"\",getAddress(Meetings!I7))","v":"http://www.tabonline.com.au/2011/03/27/AR06.html"},{"$f":"IF(Meetings!J7=\"\",\"\",getAddress(Meetings!J7))","v":"http://www.tabonline.com.au/2011/03/27/AR07.html"},{"$f":"IF(Meetings!K7=\"\",\"\",getAddress(Meetings!K7))","v":"http://www.tabonline.com.au/2011/03/27/AR08.html"},{"$f":"IF(Meetings!L7=\"\",\"\",getAddress(Meetings!L7))","v":""},{"$f":"IF(Meetings!M7=\"\",\"\",getAddress(Meetings!M7))","v":""},{"$f":"IF(Meetings!N7=\"\",\"\",getAddress(Meetings!N7))","v":""},{"$f":"IF(Meetings!O7=\"\",\"\",getAddress(Meetings!O7))","v":""},null,null,{"$f":"IF(W6<>\"\",CLEAN(TRIM(Meetings!W6)),\"\")","v":""},{"$f":"IF(Meetings!W6=\"\",\"\",getAddress(Meetings!W6))","v":""},""]
[{"$f":"IF(Race!N5<>\"\",(CLEAN(TRIM(Race!C5))),\"\")","v":""},{"$f":"IF(A7<>\"\",Race!N5,\"\")","v":""},{"$f":"IF(A7<>\"\",Race!I5,\"\")","v":""},null,null,"GERALDTON",{"$f":"IF(Meetings!B8=\"\",\"\",Meetings!B8)","v":"GERALDTON (PR)"},{"$f":"IF(Meetings!D8=\"\",\"\",getAddress(Meetings!D8))","v":"http://www.tabonline.com.au/2011/03/27/PR01.html"},{"$f":"IF(Meetings!E8=\"\",\"\",getAddress(Meetings!E8))","v":"http://www.tabonline.com.au/2011/03/27/PR02.html"},{"$f":"IF(Meetings!F8=\"\",\"\",getAddress(Meetings!F8))","v":"http://www.tabonline.com.au/2011/03/27/PR03.html"},{"$f":"IF(Meetings!G8=\"\",\"\",getAddress(Meetings!G8))","v":"http://www.tabonline.com.au/2011/03/27/PR04.html"},{"$f":"IF(Meetings!H8=\"\",\"\",getAddress(Meetings!H8))","v":"http://www.tabonline.com.au/2011/03/27/PR05.html"},{"$f":"IF(Meetings!I8=\"\",\"\",getAddress(Meetings!I8))","v":"http://www.tabonline.com.au/2011/03/27/PR06.html"},{"$f":"IF(Meetings!J8=\"\",\"\",getAddress(Meetings!J8))","v":"http://www.tabonline.com.au/2011/03/27/PR07.html"},{"$f":"IF(Meetings!K8=\"\",\"\",getAddress(Meetings!K8))","v":"http://www.tabonline.com.au/2011/03/27/PR08.html"},{"$f":"IF(Meetings!L8=\"\",\"\",getAddress(Meetings!L8))","v":""},{"$f":"IF(Meetings!M8=\"\",\"\",getAddress(Meetings!M8))","v":""},{"$f":"IF(Meetings!N8=\"\",\"\",getAddress(Meetings!N8))","v":""},{"$f":"IF(Meetings!O8=\"\",\"\",getAddress(Meetings!O8))","v":""},null,null,{"$f":"IF(W7<>\"\",CLEAN(TRIM(Meetings!W7)),\"\")","v":""},{"$f":"IF(Meetings!W7=\"\",\"\",getAddress(Meetings!W7))","v":""},""]
[{"$f":"IF(Race!N6<>\"\",(CLEAN(TRIM(Race!C6))),\"\")","v":""},{"$f":"IF(A8<>\"\",Race!N6,\"\")","v":""},{"$f":"IF(A8<>\"\",Race!I6,\"\")","v":""},null,null,"WANGARATTA",{"$f":"IF(Meetings!B9=\"\",\"\",Meetings!B9)","v":"WANGARATTA (ER)"},{"$f":"IF(Meetings!D9=\"\",\"\",getAddress(Meetings!D9))","v":"http://www.tabonline.com.au/2011/03/27/ER01.html"},{"$f":"IF(Meetings!E9=\"\",\"\",getAddress(Meetings!E9))","v":"http://www.tabonline.com.au/2011/03/27/ER02.html"},{"$f":"IF(Meetings!F9=\"\",\"\",getAddress(Meetings!F9))","v":"http://www.tabonline.com.au/2011/03/27/ER03.html"},{"$f":"IF(Meetings!G9=\"\",\"\",getAddress(Meetings!G9))","v":"http://www.tabonline.com.au/2011/03/27/ER04.html"},{"$f":"IF(Meetings!H9=\"\",\"\",getAddress(Meetings!H9))","v":"http://www.tabonline.com.au/2011/03/27/ER05.html"},{"$f":"IF(Meetings!I9=\"\",\"\",getAddress(Meetings!I9))","v":"http://www.tabonline.com.au/2011/03/27/ER06.html"},{"$f":"IF(Meetings!J9=\"\",\"\",getAddress(Meetings!J9))","v":"http://www.tabonline.com.au/2011/03/27/ER07.html"},{"$f":"IF(Meetings!K9=\"\",\"\",getAddress(Meetings!K9))","v":""},{"$f":"IF(Meetings!L9=\"\",\"\",getAddress(Meetings!L9))","v":""},{"$f":"IF(Meetings!M9=\"\",\"\",getAddress(Meetings!M9))","v":""},{"$f":"IF(Meetings!N9=\"\",\"\",getAddress(Meetings!N9))","v":""},{"$f":"IF(Meetings!O9=\"\",\"\",getAddress(Meetings!O9))","v":""},null,null,{"$f":"IF(W8<>\"\",CLEAN(TRIM(Meetings!W8)),\"\")","v":""},{"$f":"IF(Meetings!W8=\"\",\"\",getAddress(Meetings!W8))","v":""},""]
[{"$f":"IF(Race!N7<>\"\",(CLEAN(TRIM(Race!C7))),\"\")","v":""},{"$f":"IF(A9<>\"\",Race!N7,\"\")","v":""},{"$f":"IF(A9<>\"\",Race!I7,\"\")","v":""},null,null,"HOBART",{"$f":"IF(Meetings!B10=\"\",\"\",Meetings!B10)","v":"HOBART (TR)"},{"$f":"IF(Meetings!D10=\"\",\"\",getAddress(Meetings!D10))","v":"http://www.tabonline.com.au/2011/03/27/TR01.html"},{"$f":"IF(Meetings!E10=\"\",\"\",getAddress(Meetings!E10))","v":"http://www.tabonline.com.au/2011/03/27/TR02.html"},{"$f":"IF(Meetings!F10=\"\",\"\",getAddress(Meetings!F10))","v":"http://www.tabonline.com.au/2011/03/27/TR03.html"},{"$f":"IF(Meetings!G10=\"\",\"\",getAddress(Meetings!G10))","v":"http://www.tabonline.com.au/2011/03/27/TR04.html"},{"$f":"IF(Meetings!H10=\"\",\"\",getAddress(Meetings!H10))","v":"http://www.tabonline.com.au/2011/03/27/TR05.html"},{"$f":"IF(Meetings!I10=\"\",\"\",getAddress(Meetings!I10))","v":"http://www.tabonline.com.au/2011/03/27/TR06.html"},{"$f":"IF(Meetings!J10=\"\",\"\",getAddress(Meetings!J10))","v":"http://www.tabonline.com.au/2011/03/27/TR07.html"},{"$f":"IF(Meetings!K10=\"\",\"\",getAddress(Meetings!K10))","v":"http://www.tabonline.com.au/2011/03/27/TR08.html"},{"$f":"IF(Meetings!L10=\"\",\"\",getAddress(Meetings!L10))","v":""},{"$f":"IF(Meetings!M10=\"\",\"\",getAddress(Meetings!M10))","v":""},{"$f":"IF(Meetings!N10=\"\",\"\",getAddress(Meetings!N10))","v":""},{"$f":"IF(Meetings!O10=\"\",\"\",getAddress(Meetings!O10))","v":""},null,null,{"$f":"IF(W9<>\"\",CLEAN(TRIM(Meetings!W9)),\"\")","v":""},{"$f":"IF(Meetings!W9=\"\",\"\",getAddress(Meetings!W9))","v":""},""]
[{"$f":"IF(Race!N8<>\"\",(CLEAN(TRIM(Race!C8))),\"\")","v":""},{"$f":"IF(A10<>\"\",Race!N8,\"\")","v":""},{"$f":"IF(A10<>\"\",Race!I8,\"\")","v":""},null,null,"MACKAY",{"$f":"IF(Meetings!B11=\"\",\"\",Meetings!B11)","v":"MACKAY (IR)"},{"$f":"IF(Meetings!D11=\"\",\"\",getAddress(Meetings!D11))","v":"http://www.tabonline.com.au/2011/03/27/IR01.html"},{"$f":"IF(Meetings!E11=\"\",\"\",getAddress(Meetings!E11))","v":"http://www.tabonline.com.au/2011/03/27/IR02.html"},{"$f":"IF(Meetings!F11=\"\",\"\",getAddress(Meetings!F11))","v":"http://www.tabonline.com.au/2011/03/27/IR03.html"},{"$f":"IF(Meetings!G11=\"\",\"\",getAddress(Meetings!G11))","v":"http://www.tabonline.com.au/2011/03/27/IR04.html"},{"$f":"IF(Meetings!H11=\"\",\"\",getAddress(Meetings!H11))","v":"http://www.tabonline.com.au/2011/03/27/IR05.html"},{"$f":"IF(Meetings!I11=\"\",\"\",getAddress(Meetings!I11))","v":"http://www.tabonline.com.au/2011/03/27/IR06.html"},{"$f":"IF(Meetings!J11=\"\",\"\",getAddress(Meetings!J11))","v":"http://www.tabonline.com.au/2011/03/27/IR07.html"},{"$f":"IF(Meetings!K11=\"\",\"\",getAddress(Meetings!K11))","v":""},{"$f":"IF(Meetings!L11=\"\",\"\",getAddress(Meetings!L11))","v":""},{"$f":"IF(Meetings!M11=\"\",\"\",getAddress(Meetings!M11))","v":""},{"$f":"IF(Meetings!N11=\"\",\"\",getAddress(Meetings!N11))","v":""},{"$f":"IF(Meetings!O11=\"\",\"\",getAddress(Meetings!O11))","v":""},null,null,{"$f":"IF(W10<>\"\",CLEAN(TRIM(Meetings!W10)),\"\")","v":""},{"$f":"IF(Meetings!W10=\"\",\"\",getAddress(Meetings!W10))","v":""},""]
{"$rows_left_out":36}
{"sheet":"Instructions","index":2,"n_rows":10,"n_cols":11,"rows_kept":10,"cut":false,"hidden":false,"merged":[]}
[]
[]
[]
[]
[null,"Instructions"]
[]
[null,"You need to get the race code from",null,null,null,"http://www.racingandsports.com.au/form-guide/",{"$nulls":4},"click on each venue and get the last set of numbers from the address bar."]
[null,"On the \"Neurals\" sheet press \"Start\" press \"OK\" for todays date or put in a date, there is a box on the right that has the days races, hightlight a race and press \"Select\"  put in race code then 1st and last race numbers for that venue then press the \"Import\" button,"]
[null,"the race will be imported, if the top Neurals selection is also the unitab top rated it will copy to the \"Selections\" sheet."]
[null,"Each race will cycle through for that meeting, when done change the meeting and the race numbers and press import again."]
{"$rows_left_out":1}
{"sheet":"Meetings","index":3,"n_rows":115,"n_cols":41,"rows_kept":115,"cut":false,"hidden":false,"merged":[[28,20,28,25],[14,26,14,28],[15,26,15,28],[21,26,21,28],[22,26,22,28],[1,0,1,2],[0,20,0,30],[1,20,1,27],[1,28,1,30],[6,20,6,30],[22,20,22,25],[23,21,23,25],[25,20,25,25],[26,21,26,25],[6,31,6,37],[9,20,9,25],[10,20,10,25],[11,20,11,25],[12,21,12,25],[2,32,4,32],[2,20,2,30],[3,20,3,30],[4,20,4,30],[5,20,5,30],[36,20,36,25],[37,20,37,25],[38,20,38,25],[39,21,39,25],[42,20,42,21],[29,21,29,25],[31,20,31,25],[32,21,32,25],[34,20,34,21],[35,21,35,25],[52,20,52,21],[53,21,53,25],[57,20,57,25],[58,20,58,25],[59,20,59,25],[43,21,43,25],[44,20,44,25],[45,20,45,25],[46,20,46,25],[47,21,47,25],[94,20,94,25],[95,21,95,25],[73,20,73,25],[74,21,74,25],[76,20,76,21],[77,21,77,25],[78,20,78,25],[60,21,60,25],[67,20,67,25],[68,21,68,25],[70,20,70,25],[71,21,71,25],[23,26,23,28],[24,26,24,28],[44,26,44,28],[45,26,45,28],[46,26,46,28],[98,20,98,25],[99,21,99,25],[101,20,101,21],[102,21,102,25],[29,26,30,26],[32,26,33,26],[41,26,42,26],[54,20,54,25],[55,20,55,25],[56,20,56,25],[47,26,47,28],[48,26,48,28],[49,26,49,28],[50,26,50,28],[51,26,51,28],[52,26,52,28],[79,20,79,25],[80,20,80,25],[81,21,81,25],[58,26,58,28],[59,26,59,28],[60,26,60,28],[61,26,61,28],[62,26,62,28],[53,26,53,28],[54,26,54,28],[55,26,55,28],[56,26,56,28],[57,26,57,28],[68,26,68,28],[69,26,69,28],[70,26,70,28],[71,26,71,28],[72,26,72,28],[63,26,63,28],[64,26,64,28],[65,26,65,28],[66,26,66,28],[67,26,67,28],[78,26,78,28],[79,26,79,28],[80,26,80,28],[81,26,81,28],[82,26,82,28],[73,26,73,28],[74,26,74,28],[75,26,75,28],[76,26,76,28],[77,26,77,28],[96,26,96,28],[97,26,97,28],[88,26,88,28],[89,26,89,28],[90,26,90,28],[91,26,91,28],[92,26,92,28],[83,26,83,28],[84,26,84,28],[85,26,85,28],[86,26,86,28],[87,26,87,28],[18,0,18,2],[25,0,25,2],[0,19,112,19],[7,20,7,53],[8,20,8,53],[0,54,112,54],[113,20,113,53],[112,28,112,30],[103,20,107,27],[103,28,103,30],[104,28,104,30],[105,28,105,30],[106,28,106,30],[107,28,107,30],[108,20,112,27],[108,28,108,30],[98,26,98,28],[99,26,99,28],[100,26,100,28],[101,26,101,28],[102,26,102,28],[93,26,93,28],[94,26,94,28],[95,26,95,28]]}
[{"$nulls":20}," ",{"$nulls":10}," "," "," "]
["Races",null,null,1,2,3,4,5,6,7,8,9,10,11,12,{"$nulls":5}," ",{"$nulls":10}," ",null," "]
[null,"WARWICK FARM (SR)","Fields","3,2,5 F4","5,4,3 F4","8,6,2 F4","2,6,4 F4","1,2,6 F4","7,6,3 F4","2,12,4 F4","7,1,8 F4",{"$nulls":20}," ",null," "]
[null,"SUNSHINE COAST (QR)","Fields","4,11,12 F4","15,12,6 F4","8,6,7 F4","3,6,1 F4","2,11,9 F4","2,4,7 F4","6,1,2 F4","15,17,13 F4",{"$nulls":20}," ",null," "]
[null,"WELLINGTON (NR)","Fields","4,1,2 ","1,5,4 ","2,9,1 ","4,2,5 ","5,4,7 F4","3,4,5 F4","11,2,6 F4","3,1,7 F4",{"$nulls":20}," ",null," "]
[null,"CRANBOURNE (VR)","Fields","2,10,4 ","8,10,3 ","9,7,1 ","1,13,10 ","3,1,7 ","4,8,7 F4","1,11,9 F4","2,4,8 F4","1,7,3 F4",{"$nulls":8}," ",{"$nulls":17},"Username",null,"Password"]
[null,"GAWLER (AR)","Fields","9,7,5 F4","6,4,11 F4","6,4,9 F4","4,5,13 F4","4,10,5 F4","7,5,9 F4","4,6,1 F4","2,6,1 F4"]
[null,"GERALDTON (PR)","Fields","9,10,1 ","13,2,10 ","1,4,7 ","9,11,7 ","2,7,4 ","2,4,8 ","9,2,5 ","6,10,5 "]
[null,"WANGARATTA (ER)","Fields","3,2,5 ","3,9,7 ","4,5,3 ","7,2,5 F4","7,3,4 F4","4,12,11 F4","13,10,14 F4"]
[null,"HOBART (TR)","Fields","1,5,2 ","1,7,2 ","2,5,9 ","6,3,4 ","2,4,3 ","3,4,1 ","2,7,8 ","3,6,7 ",{"$nulls":15},"Horse Records"]
{"$rows_left_out":106}
{"sheet":"Race","index":4,"n_rows":50,"n_cols":14,"rows_kept":50,"cut":false,"hidden":false,"merged":[]}
[]
["SUNSHINE COAST",null,"QR 8","PAYING"]
[]
["2011-03-27","CLASS 1 HANDICAP",null,null,"Fixed Price"]
["RADIO TAB","1-7-4-16",null,null,"Late Mail 9","1200M","SHOWERY","HEAVY(8)"]
[]
[{"$nulls":6},"SCR 2 5 6L 8 10 11 12"]
[15,null,"JAMESON AICH",44.2,10.6]
[17,null,"FINAGLE",null,2.8,null,"Sub Fav 7"]
[13,null,"RASCAL",null,11.4]
{"$rows_left_out":41}
{"sheet":"Selections","index":5,"n_rows":25,"n_cols":10,"rows_kept":25,"cut":false,"hidden":false,"merged":[]}
["Venue",null,"Race",null,"No","Runner",null,null,"Win","Place"]
["SUNSHINE COAST",null,1,"Fav",4,"Expressway",null,null,4.5999999999999996,1.8]
["",null,"","","","",null,null,"",""]
["SUNSHINE COAST",null,1,2.5,11,"Dawn Return",null,null,0,1.9]
["",null,"","","","",null,null,"",""]
["",null,"","","","",null,null,"",""]
["SUNSHINE COAST",null,2,3.7,7,"Zaabman",null,null,"",""]
["",null,"","","","",null,null,"",""]
["",null,"","","","",null,null,"",""]
["SUNSHINE COAST",null,3,3.7,13,"Run Away Ruby",null,null,"",""]
{"$rows_left_out":15}