{"text_format":"2","workbook":"xlsx","n_sheets":6,"sheets":["Neurals","Data","Instructions","Meetings","Race","Selections"],"not_rendered":{"charts":0,"images":0,"macros":1,"external_links":0,"defined_names":1182,"comments":0,"pivot_tables":0},"unopened":[],"bounds":{"document_bytes":16777216,"sheet_cells":100000,"run_cost":"one","rows_first":2000,"rows_last":500,"rows_between":2000,"halvings":0,"cell_chars":16384,"cell_head_chars":4096},"cells_cut":0,"cells_raw":0,"read":"whole","date_system":"1900"}

{"sheet":"Neurals","index":0,"n_rows":68,"n_cols":32,"rows_kept":68,"cut":false,"hidden":false,"merged":[[2,5,2,7],[1,8,2,10],[2,14,2,15]]}
[{"$nulls":20},{"$f":"IF(Race!D2=\"Paying\",\"Paying\",\"\")","v":""},{"$f":"SUM(AA1:AA3)","v":14},{"$f":"IF(AA1<>\"\",B3,\"\")","v":""},null,{"$f":"IF(AA1<>\"\",E3,\"\")","v":""},{"$f":"IF(AA1=\"\",\"\",\"Fav\")","v":""},{"$f":"IF(SUM(Y11:Y36)>0,SUM(Y11:Y36),\"\")","v":""},{"$f":"IF(AA1=\"\",\"\",IF(ISNA(CLEAN(TRIM((VLOOKUP(AA1,$Y$11:$Z$36,2,FALSE))))),\"\",CLEAN(TRIM((VLOOKUP(AA1,$Y$11:$Z$36,2,FALSE))))))","v":""},null,null,{"$f":"IF(U1<>\"\",IF(ISNA(VLOOKUP(AB1,Data!$C$3:$E$5,2,FALSE)),\"\",(VLOOKUP(AB1,Data!$C$3:$E$5,2,FALSE))),\"\")","v":""},{"$f":"IF(U1<>\"\",IF(ISNA(VLOOKUP(AB1,Data!$C$3:$E$5,1,FALSE)),\"\",(VLOOKUP(AB1,Data!$C$3:$E$5,3,FALSE))),\"\")","v":""}]
[null,"Race Venue",null,"Race Code","1st Race No","Last Race No",{"$nulls":6},"WT",null,"Min Price",{"$nulls":7},{"$f":"IF(AA2<>\"\",B3,\"\")","v":""},null,{"$f":"IF(AA2<>\"\",E3,\"\")","v":""},{"$f":"IF(AA2=\"\",\"\",\"CP/FR\")","v":""},{"$f":"IF(SUM(Y41:Y67)>0,SUM(Y41:Y67),\"\")","v":""},{"$f":"IF(AA2=\"\",\"\",IF(ISNA(CLEAN(TRIM((VLOOKUP(AA2,$Y$41:$Z$65,2,FALSE))))),\"\",(CLEAN(TRIM((VLOOKUP(AA2,$Y$41:$Z$65,2,FALSE)))))))","v":""},null,null,{"$f":"IF(U1<>\"\",IF(ISNA(VLOOKUP(AB2,Data!$C$3:$E$5,2,FALSE)),\"\",(VLOOKUP(AB2,Data!$C$3:$E$5,2,FALSE))),\"\")","v":""},{"$f":"IF(U1<>\"\",IF(ISNA(VLOOKUP(AB2,Data!$C$3:$E$5,1,FALSE)),\"\",(VLOOKUP(AB2,Data!$C$3:$E$5,3,FALSE))),\"\")","v":""}]
[null,"SCONE",null,{"$f":"IF(ISNA(VLOOKUP(B3,$AD$12:$AF$100,3,FALSE)),\"\",VLOOKUP(B3,$AD$12:$AF$100,3,FALSE))","v":"16351"},9,{"$f":"IF(ISNA(VLOOKUP(B3,Data!$F$2:'Data'!$U$100,16,FALSE)),\"\",VLOOKUP(B3,Data!$F$2:'Data'!$U$100,16,FALSE))","v":8},{"$nulls":6},2,null,2,{"$nulls":7},{"$f":"IF(AA3<>\"\",B3,\"\")","v":"SCONE"},null,{"$f":"IF(AA3<>\"\",E3,\"\")","v":9},{"$f":"IF(AA3<>\"\",AA39,\"\")","v":4},{"$f":"IF(AA39<O3,\"\",IF(AB39<>\"\",AB39,\"\"))","v":14},{"$f":"IF(AA3=\"\",\"\",IF(ISNA(CLEAN(TRIM((VLOOKUP(AA3,$B$36:$C$71,2,FALSE))))),\"\",(CLEAN(TRIM((VLOOKUP(AA3,$B$36:$C$71,2,FALSE)))))))","v":"Wingen Win"},null,null,{"$f":"IF(U1<>\"\",IF(ISNA(VLOOKUP(AB3,Data!$C$3:$E$5,2,FALSE)),\"\",(VLOOKUP(AB3,Data!$C$3:$E$5,2,FALSE))),\"\")","v":""},{"$f":"IF(U1<>\"\",IF(ISNA(VLOOKUP(AB3,Data!$C$3:$E$5,1,FALSE)),\"\",(VLOOKUP(AB3,Data!$C$3:$E$5,3,FALSE))),\"\")","v":""}]
[]
[]
[]
[]
[null,{"$f":"B3","v":"SCONE"},null,"Race",{"$f":"E3","v":9}]
[null,null,{"$f":"LARGE(C11:C40,1)","v":239},null,{"$f":"LARGE(E11:E40,1)","v":43},{"$nulls":24},"Todays Venues"]
["TAB","HORSE","NR","HCP","CP","CF","TIM","SCR","JA","TA","JT","BP","WET","CRS","D","$","DLR",{"$nulls":5},"Unitab Rated",null,null,"Runner"]
{"$rows_left_out":59}
{"sheet":"Data","index":1,"n_rows":45,"n_cols":24,"rows_kept":45,"cut":false,"hidden":false,"merged":[]}
[{"$f":"Neurals!B3","v":"SCONE"},{"$f":"Neurals!E3","v":9},{"$f":"Neurals!U1","v":""},null,"2011-03-29",null,{"$f":"IF(ISNA(VLOOKUP(A1,F2:Q40,B1+2,FALSE)),\"\",VLOOKUP(A1,F2:Q40,B1+2,FALSE))","v":""},{"$nulls":14},{"$f":"IF(W1<>\"\",CLEAN(TRIM(Meetings!W1)),\"\")","v":""},{"$f":"IF(Meetings!W1=\"\",\"\",getAddress(Meetings!W1))","v":""},{"$f":"IF(W1=\"\",\"\",RIGHT(W1,LEN(W1)-FIND(\"=\",W1,1)))","v":""}]
[{"$nulls":5},{"$f":"IF(G2=\"\",\"\",IF(ISERROR(CLEAN(TRIM((LEFT(G2,FIND(\"(\",G2,1)-1))))),\"\",CLEAN(TRIM(LEFT(G2,FIND(\"(\",G2,1)-1)))))","v":"TOWNSVILLE"},{"$f":"IF(Meetings!B3=\"\",\"\",Meetings!B3)","v":"TOWNSVILLE (QR)"},{"$f":"IF(Meetings!D3=\"\",\"\",getAddress(Meetings!D3))","v":"http://www.tabonline.com.au/2011/03/29/QR01.html"},{"$f":"IF(Meetings!E3=\"\",\"\",getAddress(Meetings!E3))","v":"http://www.tabonline.com.au/2011/03/29/QR02.html"},{"$f":"IF(Meetings!F3=\"\",\"\",getAddress(Meetings!F3))","v":"http://www.tabonline.com.au/2011/03/29/QR03.html"},{"$f":"IF(Meetings!G3=\"\",\"\",getAddress(Meetings!G3))","v":"http://www.tabonline.com.au/2011/03/29/QR04.html"},{"$f":"IF(Meetings!H3=\"\",\"\",getAddress(Meetings!H3))","v":"http://www.tabonline.com.au/2011/03/29/QR05.html"},{"$f":"IF(Meetings!I3=\"\",\"\",getAddress(Meetings!I3))","v":"http://www.tabonline.com.au/2011/03/29/QR06.html"},{"$f":"IF(Meetings!J3=\"\",\"\",getAddress(Meetings!J3))","v":"http://www.tabonline.com.au/2011/03/29/QR07.html"},{"$f":"IF(Meetings!K3=\"\",\"\",getAddress(Meetings!K3))","v":""},{"$f":"IF(Meetings!L3=\"\",\"\",getAddress(Meetings!L3))","v":""},{"$f":"IF(Meetings!M3=\"\",\"\",getAddress(Meetings!M3))","v":""},{"$f":"IF(Meetings!N3=\"\",\"\",getAddress(Meetings!N3))","v":""},{"$f":"IF(Meetings!O3=\"\",\"\",getAddress(Meetings!O3))","v":""},null,{"$f":"COUNTA(Meetings!D3:'Meetings'!O3)","v":7},{"$f":"IF(W2<>\"\",CLEAN(TRIM(Meetings!W2)),\"\")","v":""},{"$f":"IF(Meetings!W2=\"\",\"\",getAddress(Meetings!W2))","v":""},{"$f":"IF(W2=\"\",\"\",RIGHT(W2,LEN(W2)-FIND(\"=\",W2,1)))","v":""}]
[{"$f":"IF(Race!N1<>\"\",(CLEAN(TRIM(Race!C1))),\"\")","v":""},{"$f":"IF(A3<>\"\",Race!I1,\"\")","v":""},{"$f":"IF($C$1<>\"\",CLEAN(TRIM(INDEX(Race!$A$1:$C20,MATCH(\"QN\",Race!$A1:$A$20,0)-4,3))),\"\")","v":""},{"$f":"IF(ISNA(VLOOKUP(C3,Race!$C$2:$E$15,2,FALSE)),\"\",(VLOOKUP(C3,Race!$C$2:$E$15,2,FALSE)))","v":""},{"$f":"IF(ISNA(VLOOKUP(C3,Race!$C$2:$E$15,3,FALSE)),\"\",(VLOOKUP(C3,Race!$C$2:$E$15,3,FALSE)))","v":""},{"$f":"IF(G3=\"\",\"\",IF(ISERROR(CLEAN(TRIM((LEFT(G3,FIND(\"(\",G3,1)-1))))),\"\",CLEAN(TRIM(LEFT(G3,FIND(\"(\",G3,1)-1)))))","v":"SCONE"},{"$f":"IF(Meetings!B4=\"\",\"\",Meetings!B4)","v":"SCONE (NR)"},{"$f":"IF(Meetings!D4=\"\",\"\",getAddress(Meetings!D4))","v":"http://www.tabonline.com.au/2011/03/29/NR01.html"},{"$f":"IF(Meetings!E4=\"\",\"\",getAddress(Meetings!E4))","v":"http://www.tabonline.com.au/2011/03/29/NR02.html"},{"$f":"IF(Meetings!F4=\"\",\"\",getAddress(Meetings!F4))","v":"http://www.tabonline.com.au/2011/03/29/NR03.html"},{"$f":"IF(Meetings!G4=\"\",\"\",getAddress(Meetings!G4))","v":"http://www.tabonline.com.au/2011/03/29/NR04.html"},{"$f":"IF(Meetings!H4=\"\",\"\",getAddress(Meetings!H4))","v":"http://www.tabonline.com.au/2011/03/29/NR05.html"},{"$f":"IF(Meetings!I4=\"\",\"\",getAddress(Meetings!I4))","v":"http://www.tabonline.com.au/2011/03/29/NR06.html"},{"$f":"IF(Meetings!J4=\"\",\"\",getAddress(Meetings!J4))","v":"http://www.tabonline.com.au/2011/03/29/NR07.html"},{"$f":"IF(Meetings!K4=\"\",\"\",getAddress(Meetings!K4))","v":"http://www.tabonline.com.au/2011/03/29/NR08.html"},{"$f":"IF(Meetings!L4=\"\",\"\",getAddress(Meetings!L4))","v":""},{"$f":"IF(Meetings!M4=\"\",\"\",getAddress(Meetings!M4))","v":""},{"$f":"IF(Meetings!N4=\"\",\"\",getAddress(Meetings!N4))","v":""},{"$f":"IF(Meetings!O4=\"\",\"\",getAddress(Meetings!O4))","v":""},null,{"$f":"COUNTA(Meetings!D4:'Meetings'!O4)","v":8},{"$f":"IF(W3<>\"\",CLEAN(TRIM(Meetings!W3)),\"\")","v":""},{"$f":"IF(Meetings!W3=\"\",\"\",getAddress(Meetings!W3))","v":""},""]
[{"$f":"IF(Race!N2<>\"\",(CLEAN(TRIM(Race!C2))),\"\")","v":""},{"$f":"IF(A4<>\"\",Race!N2,\"\")","v":""},{"$f":"IF($C$1<>\"\",CLEAN(TRIM(INDEX(Race!$A$1:$C21,MATCH(\"QN\",Race!$A2:$A$20,0)-2,3))),\"\")","v":""},{"$f":"IF(ISNA(VLOOKUP(C4,Race!$C$2:$E$15,2,FALSE)),\"\",(VLOOKUP(C4,Race!$C$2:$E$15,2,FALSE)))","v":""},{"$f":"IF(ISNA(VLOOKUP(C4,Race!$C$2:$E$15,3,FALSE)),\"\",(VLOOKUP(C4,Race!$C$2:$E$15,3,FALSE)))","v":""},"SALE",{"$f":"IF(Meetings!B5=\"\",\"\",Meetings!B5)","v":"SALE (VR)"},{"$f":"IF(Meetings!D5=\"\",\"\",getAddress(Meetings!D5))","v":"http://www.tabonline.com.au/2011/03/29/VR01.html"},{"$f":"IF(Meetings!E5=\"\",\"\",getAddress(Meetings!E5))","v":"http://www.tabonline.com.au/2011/03/29/VR02.html"},{"$f":"IF(Meetings!F5=\"\",\"\",getAddress(Meetings!F5))","v":"http://www.tabonline.com.au/2011/03/29/VR03.html"},{"$f":"IF(Meetings!G5=\"\",\"\",getAddress(Meetings!G5))","v":"http://www.tabonline.com.au/2011/03/29/VR04.html"},{"$f":"IF(Meetings!H5=\"\",\"\",getAddress(Meetings!H5))","v":"http://www.tabonline.com.au/2011/03/29/VR05.html"},{"$f":"IF(Meetings!I5=\"\",\"\",getAddress(Meetings!I5))","v":"http://www.tabonline.com.au/2011/03/29/VR06.html"},{"$f":"IF(Meetings!J5=\"\",\"\",getAddress(Meetings!J5))","v":"http://www.tabonline.com.au/2011/03/29/VR07.html"},{"$f":"IF(Meetings!K5=\"\",\"\",getAddress(Meetings!K5))","v":"http://www.tabonline.com.au/2011/03/29/VR08.html"},{"$f":"IF(Meetings!L5=\"\",\"\",getAddress(Meetings!L5))","v":""},{"$f":"IF(Meetings!M5=\"\",\"\",getAddress(Meetings!M5))","v":""},{"$f":"IF(Meetings!N5=\"\",\"\",getAddress(Meetings!N5))","v":""},{"$f":"IF(Meetings!O5=\"\",\"\",getAddress(Meetings!O5))","v":""},null,{"$f":"COUNTA(Meetings!D5:'Meetings'!O5)","v":8},{"$f":"IF(W4<>\"\",CLEAN(TRIM(Meetings!W4)),\"\")","v":""},{"$f":"IF(Meetings!W4=\"\",\"\",getAddress(Meetings!W4))","v":""},""]
[{"$f":"IF(Race!N3<>\"\",(CLEAN(TRIM(Race!C3))),\"\")","v":""},{"$f":"IF(A5<>\"\",Race!N3,\"\")","v":""},{"$f":"IF($C$1<>\"\",CLEAN(TRIM(INDEX(Race!$A$1:$C22,MATCH(\"QN\",Race!$A3:$A$20,0)-0,3))),\"\")","v":""},{"$f":"IF(ISNA(VLOOKUP(C5,Race!$C$2:$E$15,2,FALSE)),\"\",(VLOOKUP(C5,Race!$C$2:$E$15,2,FALSE)))","v":""},{"$f":"IF(ISNA(VLOOKUP(C5,Race!$C$2:$E$15,3,FALSE)),\"\",(VLOOKUP(C5,Race!$C$2:$E$15,3,FALSE)))","v":""},"KALGOORLIE",{"$f":"IF(Meetings!B6=\"\",\"\",Meetings!B6)","v":"KALGOORLIE (PR)"},{"$f":"IF(Meetings!D6=\"\",\"\",getAddress(Meetings!D6))","v":"http://www.tabonline.com.au/2011/03/29/PR01.html"},{"$f":"IF(Meetings!E6=\"\",\"\",getAddress(Meetings!E6))","v":"http://www.tabonline.com.au/2011/03/29/PR02.html"},{"$f":"IF(Meetings!F6=\"\",\"\",getAddress(Meetings!F6))","v":"http://www.tabonline.com.au/2011/03/29/PR03.html"},{"$f":"IF(Meetings!G6=\"\",\"\",getAddress(Meetings!G6))","v":"http://www.tabonline.com.au/2011/03/29/PR04.html"},{"$f":"IF(Meetings!H6=\"\",\"\",getAddress(Meetings!H6))","v":"http://www.tabonline.com.au/2011/03/29/PR05.html"},{"$f":"IF(Meetings!I6=\"\",\"\",getAddress(Meetings!I6))","v":"http://www.tabonline.com.au/2011/03/29/PR06.html"},{"$f":"IF(Meetings!J6=\"\",\"\",getAddress(Meetings!J6))","v":"http://www.tabonline.com.au/2011/03/29/PR07.html"},{"$f":"IF(Meetings!K6=\"\",\"\",getAddress(Meetings!K6))","v":""},{"$f":"IF(Meetings!L6=\"\",\"\",getAddress(Meetings!L6))","v":""},{"$f":"IF(Meetings!M6=\"\",\"\",getAddress(Meetings!M6))","v":""},{"$f":"IF(Meetings!N6=\"\",\"\",getAddress(Meetings!N6))","v":""},{"$f":"IF(Meetings!O6=\"\",\"\",getAddress(Meetings!O6))","v":""},null,{"$f":"COUNTA(Meetings!D6:'Meetings'!O6)","v":7},{"$f":"IF(W5<>\"\",CLEAN(TRIM(Meetings!W5)),\"\")","v":""},{"$f":"IF(Meetings!W5=\"\",\"\",getAddress(Meetings!W5))","v":""},""]
[{"$f":"IF(Race!N4<>\"\",(CLEAN(TRIM(Race!C4))),\"\")","v":""},{"$f":"IF(A6<>\"\",Race!N4,\"\")","v":""},null,null,null,"",{"$f":"IF(Meetings!B7=\"\",\"\",Meetings!B7)","v":""},{"$f":"IF(Meetings!D7=\"\",\"\",getAddress(Meetings!D7))","v":""},{"$f":"IF(Meetings!E7=\"\",\"\",getAddress(Meetings!E7))","v":""},{"$f":"IF(Meetings!F7=\"\",\"\",getAddress(Meetings!F7))","v":""},{"$f":"IF(Meetings!G7=\"\",\"\",getAddress(Meetings!G7))","v":""},{"$f":"IF(Meetings!H7=\"\",\"\",getAddress(Meetings!H7))","v":""},{"$f":"IF(Meetings!I7=\"\",\"\",getAddress(Meetings!I7))","v":""},{"$f":"IF(Meetings!J7=\"\",\"\",getAddress(Meetings!J7))","v":""},{"$f":"IF(Meetings!K7=\"\",\"\",getAddress(Meetings!K7))","v":""},{"$f":"IF(Meetings!L7=\"\",\"\",getAddress(Meetings!L7))","v":""},{"$f":"IF(Meetings!M7=\"\",\"\",getAddress(Meetings!M7))","v":""},{"$f":"IF(Meetings!N7=\"\",\"\",getAddress(Meetings!N7))","v":""},{"$f":"IF(Meetings!O7=\"\",\"\",getAddress(Meetings!O7))","v":""},null,{"$f":"COUNTA(Meetings!D7:'Meetings'!O7)","v":0},{"$f":"IF(W6<>\"\",CLEAN(TRIM(Meetings!W6)),\"\")","v":""},{"$f":"IF(Meetings!W6=\"\",\"\",getAddress(Meetings!W6))","v":""},""]
[{"$f":"IF(Race!N5<>\"\",(CLEAN(TRIM(Race!C5))),\"\")","v":""},{"$f":"IF(A7<>\"\",Race!N5,\"\")","v":""},{"$f":"IF(A7<>\"\",Race!I5,\"\")","v":""},null,null,"",{"$f":"IF(Meetings!B8=\"\",\"\",Meetings!B8)","v":""},{"$f":"IF(Meetings!D8=\"\",\"\",getAddress(Meetings!D8))","v":""},{"$f":"IF(Meetings!E8=\"\",\"\",getAddress(Meetings!E8))","v":""},{"$f":"IF(Meetings!F8=\"\",\"\",getAddress(Meetings!F8))","v":""},{"$f":"IF(Meetings!G8=\"\",\"\",getAddress(Meetings!G8))","v":""},{"$f":"IF(Meetings!H8=\"\",\"\",getAddress(Meetings!H8))","v":""},{"$f":"IF(Meetings!I8=\"\",\"\",getAddress(Meetings!I8))","v":""},{"$f":"IF(Meetings!J8=\"\",\"\",getAddress(Meetings!J8))","v":""},{"$f":"IF(Meetings!K8=\"\",\"\",getAddress(Meetings!K8))","v":""},{"$f":"IF(Meetings!L8=\"\",\"\",getAddress(Meetings!L8))","v":""},{"$f":"IF(Meetings!M8=\"\",\"\",getAddress(Meetings!M8))","v":""},{"$f":"IF(Meetings!N8=\"\",\"\",getAddress(Meetings!N8))","v":""},{"$f":"IF(Meetings!O8=\"\",\"\",getAddress(Meetings!O8))","v":""},null,{"$f":"COUNTA(Meetings!D8:'Meetings'!O8)","v":0},{"$f":"IF(W7<>\"\",CLEAN(TRIM(Meetings!W7)),\"\")","v":""},{"$f":"IF(Meetings!W7=\"\",\"\",getAddress(Meetings!W7))","v":""},""]
[{"$f":"IF(Race!N6<>\"\",(CLEAN(TRIM(Race!C6))),\"\")","v":"Name"},{"$f":"IF(A8<>\"\",Race!N6,\"\")","v":"Rtng"},{"$f":"IF(A8<>\"\",Race!I6,\"\")","v":"Bar"},null,null,"",{"$f":"IF(Meetings!B9=\"\",\"\",Meetings!B9)","v":""},{"$f":"IF(Meetings!D9=\"\",\"\",getAddress(Meetings!D9))","v":""},{"$f":"IF(Meetings!E9=\"\",\"\",getAddress(Meetings!E9))","v":""},{"$f":"IF(Meetings!F9=\"\",\"\",getAddress(Meetings!F9))","v":""},{"$f":"IF(Meetings!G9=\"\",\"\",getAddress(Meetings!G9))","v":""},{"$f":"IF(Meetings!H9=\"\",\"\",getAddress(Meetings!H9))","v":""},{"$f":"IF(Meetings!I9=\"\",\"\",getAddress(Meetings!I9))","v":""},{"$f":"IF(Meetings!J9=\"\",\"\",getAddress(Meetings!J9))","v":""},{"$f":"IF(Meetings!K9=\"\",\"\",getAddress(Meetings!K9))","v":""},{"$f":"IF(Meetings!L9=\"\",\"\",getAddress(Meetings!L9))","v":""},{"$f":"IF(Meetings!M9=\"\",\"\",getAddress(Meetings!M9))","v":""},{"$f":"IF(Meetings!N9=\"\",\"\",getAddress(Meetings!N9))","v":""},{"$f":"IF(Meetings!O9=\"\",\"\",getAddress(Meetings!O9))","v":""},null,{"$f":"COUNTA(Meetings!D9:'Meetings'!O9)","v":0},{"$f":"IF(W8<>\"\",CLEAN(TRIM(Meetings!W8)),\"\")","v":""},{"$f":"IF(Meetings!W8=\"\",\"\",getAddress(Meetings!W8))","v":""},""]
[{"$f":"IF(Race!N7<>\"\",(CLEAN(TRIM(Race!C7))),\"\")","v":"BOULEVARD BARON"},{"$f":"IF(A9<>\"\",Race!N7,\"\")","v":98},{"$f":"IF(A9<>\"\",Race!I7,\"\")","v":9},null,null,"",{"$f":"IF(Meetings!B10=\"\",\"\",Meetings!B10)","v":""},{"$f":"IF(Meetings!D10=\"\",\"\",getAddress(Meetings!D10))","v":""},{"$f":"IF(Meetings!E10=\"\",\"\",getAddress(Meetings!E10))","v":""},{"$f":"IF(Meetings!F10=\"\",\"\",getAddress(Meetings!F10))","v":""},{"$f":"IF(Meetings!G10=\"\",\"\",getAddress(Meetings!G10))","v":""},{"$f":"IF(Meetings!H10=\"\",\"\",getAddress(Meetings!H10))","v":""},{"$f":"IF(Meetings!I10=\"\",\"\",getAddress(Meetings!I10))","v":""},{"$f":"IF(Meetings!J10=\"\",\"\",getAddress(Meetings!J10))","v":""},{"$f":"IF(Meetings!K10=\"\",\"\",getAddress(Meetings!K10))","v":""},{"$f":"IF(Meetings!L10=\"\",\"\",getAddress(Meetings!L10))","v":""},{"$f":"IF(Meetings!M10=\"\",\"\",getAddress(Meetings!M10))","v":""},{"$f":"IF(Meetings!N10=\"\",\"\",getAddress(Meetings!N10))","v":""},{"$f":"IF(Meetings!O10=\"\",\"\",getAddress(Meetings!O10))","v":""},null,{"$f":"COUNTA(Meetings!D10:'Meetings'!O10)","v":0},{"$f":"IF(W9<>\"\",CLEAN(TRIM(Meetings!W9)),\"\")","v":""},{"$f":"IF(Meetings!W9=\"\",\"\",getAddress(Meetings!W9))","v":""},""]
[{"$f":"IF(Race!N8<>\"\",(CLEAN(TRIM(Race!C8))),\"\")","v":"INHERITED"},{"$f":"IF(A10<>\"\",Race!N8,\"\")","v":91},{"$f":"IF(A10<>\"\",Race!I8,\"\")","v":10},null,null,"",{"$f":"IF(Meetings!B11=\"\",\"\",Meetings!B11)","v":""},{"$f":"IF(Meetings!D11=\"\",\"\",getAddress(Meetings!D11))","v":""},{"$f":"IF(Meetings!E11=\"\",\"\",getAddress(Meetings!E11))","v":""},{"$f":"IF(Meetings!F11=\"\",\"\",getAddress(Meetings!F11))","v":""},{"$f":"IF(Meetings!G11=\"\",\"\",getAddress(Meetings!G11))","v":""},{"$f":"IF(Meetings!H11=\"\",\"\",getAddress(Meetings!H11))","v":""},{"$f":"IF(Meetings!I11=\"\",\"\",getAddress(Meetings!I11))","v":""},{"$f":"IF(Meetings!J11=\"\",\"\",getAddress(Meetings!J11))","v":""},{"$f":"IF(Meetings!K11=\"\",\"\",getAddress(Meetings!K11))","v":""},{"$f":"IF(Meetings!L11=\"\",\"\",getAddress(Meetings!L11))","v":""},{"$f":"IF(Meetings!M11=\"\",\"\",getAddress(Meetings!M11))","v":""},{"$f":"IF(Meetings!N11=\"\",\"\",getAddress(Meetings!N11))","v":""},{"$f":"IF(Meetings!O11=\"\",\"\",getAddress(Meetings!O11))","v":""},null,{"$f":"COUNTA(Meetings!D11:'Meetings'!O11)","v":0},{"$f":"IF(W10<>\"\",CLEAN(TRIM(Meetings!W10)),\"\")","v":""},{"$f":"IF(Meetings!W10=\"\",\"\",getAddress(Meetings!W10))","v":""},""]
{"$rows_left_out":36}
{"sheet":"Instructions","index":2,"n_rows":10,"n_cols":11,"rows_kept":10,"cut":false,"hidden":false,"merged":[]}
[]
[]
[]
[]
[null,"Instructions"]
[]
[null,"You need to get the race code from",null,null,null,"http://www.racingandsports.com.au/form-guide/",{"$nulls":4},"click on each venue and get the last set of numbers from the address bar."]
[null,"On the \"Neurals\" sheet press \"Start\" press \"OK\" for todays date or put in a date, there is a box on the right that has the days races, hightlight a race and press \"Select\"  put in race code then 1st and last race numbers for that venue then press the \"Import\" button,"]
[null,"the race will be imported, if the top Neurals selection is also the unitab top rated it will copy to the \"Selections\" sheet."]
[null,"Each race will cycle through for that meeting, when done change the meeting and the race numbers and press import again."]
{"$rows_left_out":1}
{"sheet":"Meetings","index":3,"n_rows":115,"n_cols":41,"rows_kept":115,"cut":false,"hidden":false,"merged":[[0,19,97,19],[0,54,97,54],[98,20,98,53],[84,21,84,25],[86,20,86,21],[87,21,87,25],[43,20,43,25],[97,28,97,30],[88,20,92,27],[88,28,88,30],[89,28,89,30],[90,28,90,30],[91,28,91,30],[92,28,92,30],[93,20,97,27],[93,28,93,30],[113,20,113,53],[112,28,112,30],[103,20,107,27],[103,28,103,30],[104,28,104,30],[105,28,105,30],[106,28,106,30],[107,28,107,30],[108,20,112,27],[108,28,108,30],[100,26,100,28],[101,26,101,28],[102,26,102,28],[17,20,17,25],[18,21,18,25],[21,20,21,21],[22,21,22,25],[23,20,23,25],[83,26,83,28],[84,26,84,28],[85,26,85,28],[86,26,86,28],[87,26,87,28],[78,26,78,28],[79,26,79,28],[80,26,80,28],[81,26,81,28],[82,26,82,28],[73,26,73,28],[74,26,74,28],[75,26,75,28],[76,26,76,28],[77,26,77,28],[69,26,69,28],[70,26,70,28],[71,26,71,28],[72,26,72,28],[63,26,63,28],[64,26,64,28],[65,26,65,28],[66,26,66,28],[67,26,67,28],[60,26,60,28],[61,26,61,28],[62,26,62,28],[53,26,53,28],[54,26,54,28],[55,26,55,28],[56,26,56,28],[57,26,57,28],[68,26,68,28],[44,26,44,28],[45,26,45,28],[46,26,46,28],[101,20,101,21],[102,21,102,25],[29,26,30,26],[32,26,33,26],[41,26,42,26],[47,26,47,28],[48,26,48,28],[49,26,49,28],[50,26,50,28],[51,26,51,28],[52,26,52,28],[80,20,80,25],[81,21,81,25],[58,26,58,28],[59,26,59,28],[77,21,77,25],[60,20,60,25],[61,21,61,25],[63,20,63,25],[64,21,64,25],[66,20,66,25],[67,21,67,25],[69,20,69,25],[70,21,70,25],[72,20,72,21],[73,21,73,25],[74,20,74,25],[75,20,75,25],[44,20,44,25],[45,20,45,25],[46,20,46,25],[47,20,47,25],[48,20,48,25],[49,20,49,25],[50,21,50,25],[38,20,38,25],[39,21,39,25],[32,20,32,25],[33,21,33,25],[35,20,35,25],[36,21,36,25],[41,20,41,21],[42,21,42,25],[6,31,6,37],[9,20,9,25],[10,20,10,25],[11,20,11,25],[12,21,12,25],[2,32,4,32],[2,20,2,30],[3,20,3,30],[4,20,4,30],[5,20,5,30],[7,20,7,53],[8,20,8,53],[14,26,14,28],[15,26,15,28],[21,26,21,28],[22,26,22,28],[1,0,1,2],[0,20,0,30],[1,20,1,27],[1,28,1,30],[6,20,6,30],[25,20,25,25],[26,21,26,25],[23,26,23,28],[24,26,24,28],[25,0,25,2],[8,0,8,2],[15,0,15,2],[24,20,24,25],[76,20,76,25],[83,20,83,25]]}
[{"$nulls":20}," ",{"$nulls":10}," "," "," "]
["Races",null,null,1,2,3,4,5,6,7,8,9,10,11,12,{"$nulls":5}," ",{"$nulls":10}," ",null," "]
[null,"TOWNSVILLE (QR)","Fields","12:45 F4","1:20 F4","1:55 F4","2:35 F4","3:12 F4","3:50 F4","4:25 F4",{"$nulls":21}," ",null," "]
[null,"SCONE (NR)","Fields","12:25:00","01:05:00","01:40:00","02:15:00","2:50 F4","3:25 F4","4:05 F4","4:40 F4",{"$nulls":20}," ",null," "]
[null,"SALE (VR)","Fields","12:00:00","12:30:00","01:00:00","01:30:00","2:00 F4","2:30 F4","3:00 F4","3:30 F4",{"$nulls":20}," ",null," "]
[null,"KALGOORLIE (PR)","Fields","03:05:00","03:42:00","04:17:00","04:52:00","05:32:00","06:10:00","06:45:00",{"$nulls":10}," ",{"$nulls":17},"Username",null,"Password"]
[]
[]
[]
[{"$nulls":26},"Horse Records"]
{"$rows_left_out":93}
{"sheet":"Race","index":4,"n_rows":34,"n_cols":14,"rows_kept":34,"cut":false,"hidden":false,"merged":[]}
[]
["SCONE",null,"NR 8","Jump","04:40:00"]
[null,null,null,"Odds","10:25:00"]
["2011-03-29","BM 65 HANDICAP"]
[{"$nulls":5},"1100M"]
["No.",null,"Name","07:25:00","Win","Plc",null,"Rider  ","Bar","Wght",null,"Form","L3S","Rtng"]
[1,null,"BOULEVARD BARON","00:00:00",47.8,0,null,"J HULL(A)",9,60,null,"W","90X",98]
[2,null,"INHERITED","00:00:00",47.8,0,null,"M LISTER",10,59.5,null,"T","01X",91]
[3,null,"FORCED TO TANGO",14.1,23.9,0,null,"T NIKORA",3,58.5,null,"WT",66,93]
[4,null,"PENTELI",0,0,0,null,"H SINGH(A)",15,58.5,null,"WT","13X",90]
{"$rows_left_out":25}
{"sheet":"Selections","index":5,"n_rows":25,"n_cols":10,"rows_kept":25,"cut":false,"hidden":false,"merged":[]}
["Venue",null,"Race",null,"No","Runner",null,null,"Win","Place"]
["",null,"","","","",null,null,"",""]
["",null,"","","","",null,null,"",""]
["SCONE",null,1,3.5,4,"Buckle Me Up",null,null,"",""]
["",null,"","","","",null,null,"",""]
["",null,"","","","",null,null,"",""]
["SCONE",null,2,3.5,3,"Secret Encounter",null,null,"",""]
["",null,"","","","",null,null,"",""]
["",null,"","","","",null,null,"",""]
["SCONE",null,3,2,10,"Domesta",null,null,"",""]
{"$rows_left_out":15}