{"text_format":"2","workbook":"xlsx","n_sheets":6,"sheets":["Neurals","Data","Instructions","Meetings","Race","Selections"],"not_rendered":{"charts":0,"images":0,"macros":1,"external_links":0,"defined_names":1182,"comments":0,"pivot_tables":0},"unopened":[],"bounds":{"document_bytes":16777216,"sheet_cells":100000,"run_cost":"one","rows_first":2000,"rows_last":500,"rows_between":2000,"halvings":0,"cell_chars":16384,"cell_head_chars":4096},"cells_cut":0,"cells_raw":0,"read":"whole","date_system":"1900"}

{"sheet":"Neurals","index":0,"n_rows":68,"n_cols":32,"rows_kept":68,"cut":false,"hidden":false,"merged":[[2,5,2,7],[1,8,2,10],[2,14,2,15]]}
[{"$nulls":20},{"$f":"IF(Race!D2=\"Paying\",\"Paying\",\"\")","v":""},{"$f":"SUM(AA1:AA3)","v":14},{"$f":"IF(AA1<>\"\",B3,\"\")","v":""},null,{"$f":"IF(AA1<>\"\",E3,\"\")","v":""},{"$f":"IF(AA1=\"\",\"\",\"Fav\")","v":""},{"$f":"IF(SUM(Y11:Y36)>0,SUM(Y11:Y36),\"\")","v":""},{"$f":"IF(AA1=\"\",\"\",IF(ISNA(CLEAN(TRIM((VLOOKUP(AA1,$Y$11:$Z$36,2,FALSE))))),\"\",CLEAN(TRIM((VLOOKUP(AA1,$Y$11:$Z$36,2,FALSE))))))","v":""},null,null,{"$f":"IF(U1<>\"\",IF(ISNA(VLOOKUP(AB1,Data!$C$3:$E$5,2,FALSE)),\"\",(VLOOKUP(AB1,Data!$C$3:$E$5,2,FALSE))),\"\")","v":""},{"$f":"IF(U1<>\"\",IF(ISNA(VLOOKUP(AB1,Data!$C$3:$E$5,1,FALSE)),\"\",(VLOOKUP(AB1,Data!$C$3:$E$5,3,FALSE))),\"\")","v":""}]
[null,"Race Venue",null,"Race Code","1st Race No","Last Race No",{"$nulls":6},"WT",null,"Min Price",{"$nulls":7},{"$f":"IF(AA2<>\"\",B3,\"\")","v":""},null,{"$f":"IF(AA2<>\"\",E3,\"\")","v":""},{"$f":"IF(AA2=\"\",\"\",\"CP/FR\")","v":""},{"$f":"IF(SUM(Y41:Y67)>0,SUM(Y41:Y67),\"\")","v":""},{"$f":"IF(AA2=\"\",\"\",IF(ISNA(CLEAN(TRIM((VLOOKUP(AA2,$Y$41:$Z$65,2,FALSE))))),\"\",(CLEAN(TRIM((VLOOKUP(AA2,$Y$41:$Z$65,2,FALSE)))))))","v":""},null,null,{"$f":"IF(U1<>\"\",IF(ISNA(VLOOKUP(AB2,Data!$C$3:$E$5,2,FALSE)),\"\",(VLOOKUP(AB2,Data!$C$3:$E$5,2,FALSE))),\"\")","v":""},{"$f":"IF(U1<>\"\",IF(ISNA(VLOOKUP(AB2,Data!$C$3:$E$5,1,FALSE)),\"\",(VLOOKUP(AB2,Data!$C$3:$E$5,3,FALSE))),\"\")","v":""}]
[null,"SCONE",null,{"$f":"IF(ISNA(VLOOKUP(B3,$AD$12:$AF$100,3,FALSE)),\"\",VLOOKUP(B3,$AD$12:$AF$100,3,FALSE))","v":"16351"},9,{"$f":"IF(ISNA(VLOOKUP(B3,Data!$F$2:'Data'!$U$100,16,FALSE)),\"\",VLOOKUP(B3,Data!$F$2:'Data'!$U$100,16,FALSE))","v":8},{"$nulls":6},2,null,2,{"$nulls":7},{"$f":"IF(AA3<>\"\",B3,\"\")","v":"SCONE"},null,{"$f":"IF(AA3<>\"\",E3,\"\")","v":9},{"$f":"IF(AA3<>\"\",AA39,\"\")","v":4},{"$f":"IF(AA39<O3,\"\",IF(AB39<>\"\",AB39,\"\"))","v":14},{"$f":"IF(AA3=\"\",\"\",IF(ISNA(CLEAN(TRIM((VLOOKUP(AA3,$B$36:$C$71,2,FALSE))))),\"\",(CLEAN(TRIM((VLOOKUP(AA3,$B$36:$C$71,2,FALSE)))))))","v":"Wingen Win"},null,null,{"$f":"IF(U1<>\"\",IF(ISNA(VLOOKUP(AB3,Data!$C$3:$E$5,2,FALSE)),\"\",(VLOOKUP(AB3,Data!$C$3:$E$5,2,FALSE))),\"\")","v":""},{"$f":"IF(U1<>\"\",IF(ISNA(VLOOKUP(AB3,Data!$C$3:$E$5,1,FALSE)),\"\",(VLOOKUP(AB3,Data!$C$3:$E$5,3,FALSE))),\"\")","v":""}]
[]
[]
[]
[]
[null,{"$f":"B3","v":"SCONE"},null,"Race",{"$f":"E3","v":9}]
[null,null,{"$f":"LARGE(C11:C40,1)","v":239},null,{"$f":"LARGE(E11:E40,1)","v":43},{"$nulls":24},"Todays Venues"]
["TAB","HORSE","NR","HCP","CP","CF","TIM","SCR","JA","TA","JT","BP","WET","CRS","D","$","DLR",{"$nulls":5},"Unitab Rated",null,null,"Runner"]
[1," Boulevard Baron",92.5,null,6,0,1,0,8,30,20,11,0,6,4,6,1,{"$nulls":4},{"$f":"CLEAN(TRIM(B11))","v":"Boulevard Baron"},{"$f":"IF(ISNA(VLOOKUP(V11,Data!$A$1:'Data'!$B$200,2,FALSE)),\"\",(VLOOKUP(V11,Data!$A$1:'Data'!$B$200,2,FALSE)))","v":98},null,{"$f":"IF(W11=100,IF(C11=$C$9,A11,\"\"),\"\")","v":""},{"$f":"IF(Y11=\"\",\"\",CLEAN(TRIM(B11)))","v":""}]
[2," Inherited",81,null,7,1,1,0,3,25,18,11,0,6,6,3,1,{"$nulls":4},{"$f":"CLEAN(TRIM(B12))","v":"Inherited"},{"$f":"IF(ISNA(VLOOKUP(V12,Data!$A$1:'Data'!$B$200,2,FALSE)),\"\",(VLOOKUP(V12,Data!$A$1:'Data'!$B$200,2,FALSE)))","v":91},null,"",{"$f":"IF(Y12=\"\",\"\",CLEAN(TRIM(B12)))","v":""},null,null,null,{"$f":"IF(Data!F2=\"\",\"\",CLEAN(TRIM(Data!F2)))","v":"TOWNSVILLE"},null,{"$f":"IF(ISNA(VLOOKUP(AD12,Data!$V$1:'Data'!$X$100,3,FALSE)),\"\",VLOOKUP(AD12,Data!$V$1:'Data'!$X$100,3,FALSE))","v":"16352"}]
[3," Forced To Tango",98,null,43,0,1,0,3,3,10,12,0,11,6,5,5,{"$nulls":4},"Forced To Tango",{"$f":"IF(ISNA(VLOOKUP(V13,Data!$A$1:'Data'!$B$200,2,FALSE)),\"\",(VLOOKUP(V13,Data!$A$1:'Data'!$B$200,2,FALSE)))","v":93},null,"","",null,null,null,{"$f":"IF(Data!F3=\"\",\"\",CLEAN(TRIM(Data!F3)))","v":"SCONE"},null,{"$f":"IF(ISNA(VLOOKUP(AD13,Data!$V$1:'Data'!$X$100,3,FALSE)),\"\",VLOOKUP(AD13,Data!$V$1:'Data'!$X$100,3,FALSE))","v":"16351"}]
[4," Penteli",61,null,6,1,1,0,3,10,3,20,0,10,3,4,1,{"$nulls":4},"Penteli",{"$f":"IF(ISNA(VLOOKUP(V14,Data!$A$1:'Data'!$B$200,2,FALSE)),\"\",(VLOOKUP(V14,Data!$A$1:'Data'!$B$200,2,FALSE)))","v":90},null,"","",null,null,null,{"$f":"IF(Data!F4=\"\",\"\",CLEAN(TRIM(Data!F4)))","v":"SALE"},null,{"$f":"IF(ISNA(VLOOKUP(AD14,Data!$V$1:'Data'!$X$100,3,FALSE)),\"\",VLOOKUP(AD14,Data!$V$1:'Data'!$X$100,3,FALSE))","v":"16362"}]
[5," Okane",103.5,null,29,1,1,0,10,10,13,9,0,10,5,15,1,{"$nulls":4},"Okane",{"$f":"IF(ISNA(VLOOKUP(V15,Data!$A$1:'Data'!$B$200,2,FALSE)),\"\",(VLOOKUP(V15,Data!$A$1:'Data'!$B$200,2,FALSE)))","v":97},null,"","",null,null,null,{"$f":"IF(Data!F5=\"\",\"\",CLEAN(TRIM(Data!F5)))","v":"KALGOORLIE"},null,{"$f":"IF(ISNA(VLOOKUP(AD15,Data!$V$1:'Data'!$X$100,3,FALSE)),\"\",VLOOKUP(AD15,Data!$V$1:'Data'!$X$100,3,FALSE))","v":"16353"}]
[6," Tennessee Madam",98.5,null,11,30,1,0,8,3,8,12,0,6,4,5,12,{"$nulls":4},"Tennessee Madam",{"$f":"IF(ISNA(VLOOKUP(V16,Data!$A$1:'Data'!$B$200,2,FALSE)),\"\",(VLOOKUP(V16,Data!$A$1:'Data'!$B$200,2,FALSE)))","v":100},null,"","",null,null,null,{"$f":"IF(Data!F6=\"\",\"\",CLEAN(TRIM(Data!F6)))","v":""},null,{"$f":"IF(ISNA(VLOOKUP(AD16,Data!$V$1:'Data'!$X$100,3,FALSE)),\"\",VLOOKUP(AD16,Data!$V$1:'Data'!$X$100,3,FALSE))","v":""}]
[7," Last Rain",79.5,null,6,0,1,0,10,25,8,12,0,6,6,5,1,{"$nulls":4},"Last Rain",{"$f":"IF(ISNA(VLOOKUP(V17,Data!$A$1:'Data'!$B$200,2,FALSE)),\"\",(VLOOKUP(V17,Data!$A$1:'Data'!$B$200,2,FALSE)))","v":94},null,"","",null,null,null,{"$f":"IF(Data!F7=\"\",\"\",CLEAN(TRIM(Data!F7)))","v":""},null,{"$f":"IF(ISNA(VLOOKUP(AD17,Data!$V$1:'Data'!$X$100,3,FALSE)),\"\",VLOOKUP(AD17,Data!$V$1:'Data'!$X$100,3,FALSE))","v":""}]
[8," I'M Ready",239,null,16,59,82,0,15,13,13,5,0,6,11,4,16,{"$nulls":4},"I'M Ready",{"$f":"IF(ISNA(VLOOKUP(V18,Data!$A$1:'Data'!$B$200,2,FALSE)),\"\",(VLOOKUP(V18,Data!$A$1:'Data'!$B$200,2,FALSE)))","v":96},null,"","",null,null,null,{"$f":"IF(Data!F8=\"\",\"\",CLEAN(TRIM(Data!F8)))","v":""},null,{"$f":"IF(ISNA(VLOOKUP(AD18,Data!$V$1:'Data'!$X$100,3,FALSE)),\"\",VLOOKUP(AD18,Data!$V$1:'Data'!$X$100,3,FALSE))","v":""}]
[9," Dunolly",77.5,null,7,4,1,0,13,3,8,8,0,8,5,5,17,{"$nulls":4},"Dunolly",{"$f":"IF(ISNA(VLOOKUP(V19,Data!$A$1:'Data'!$B$200,2,FALSE)),\"\",(VLOOKUP(V19,Data!$A$1:'Data'!$B$200,2,FALSE)))","v":95},null,"","",null,null,null,{"$f":"IF(Data!F9=\"\",\"\",CLEAN(TRIM(Data!F9)))","v":""},null,{"$f":"IF(ISNA(VLOOKUP(AD19,Data!$V$1:'Data'!$X$100,3,FALSE)),\"\",VLOOKUP(AD19,Data!$V$1:'Data'!$X$100,3,FALSE))","v":""}]
[10," Thwarted",55,null,3,0,1,0,5,8,8,13,0,5,10,2,1,{"$nulls":4},"Thwarted",{"$f":"IF(ISNA(VLOOKUP(V20,Data!$A$1:'Data'!$B$200,2,FALSE)),\"\",(VLOOKUP(V20,Data!$A$1:'Data'!$B$200,2,FALSE)))","v":88},null,"","",null,null,null,{"$f":"IF(Data!F10=\"\",\"\",CLEAN(TRIM(Data!F10)))","v":""},null,{"$f":"IF(ISNA(VLOOKUP(AD20,Data!$V$1:'Data'!$X$100,3,FALSE)),\"\",VLOOKUP(AD20,Data!$V$1:'Data'!$X$100,3,FALSE))","v":""}]
[11," Izzyinhell",179,null,11,35,78,0,5,3,3,15,0,5,9,3,13,{"$nulls":4},"Izzyinhell",{"$f":"IF(ISNA(VLOOKUP(V21,Data!$A$1:'Data'!$B$200,2,FALSE)),\"\",(VLOOKUP(V21,Data!$A$1:'Data'!$B$200,2,FALSE)))","v":94},null,"","",null,null,null,{"$f":"IF(Data!F11=\"\",\"\",CLEAN(TRIM(Data!F11)))","v":""},null,{"$f":"IF(ISNA(VLOOKUP(AD21,Data!$V$1:'Data'!$X$100,3,FALSE)),\"\",VLOOKUP(AD21,Data!$V$1:'Data'!$X$100,3,FALSE))","v":""}]
[12," Sutton Princess",87,null,7,1,1,0,13,25,18,0,0,7,7,8,1,{"$nulls":4},"Sutton Princess",{"$f":"IF(ISNA(VLOOKUP(V22,Data!$A$1:'Data'!$B$200,2,FALSE)),\"\",(VLOOKUP(V22,Data!$A$1:'Data'!$B$200,2,FALSE)))","v":99},null,"","",null,null,null,{"$f":"IF(Data!F12=\"\",\"\",CLEAN(TRIM(Data!F12)))","v":""},null,{"$f":"IF(ISNA(VLOOKUP(AD22,Data!$V$1:'Data'!$X$100,3,FALSE)),\"\",VLOOKUP(AD22,Data!$V$1:'Data'!$X$100,3,FALSE))","v":""}]
[13," Barefootdancer",46.5,null,5,0,1,0,3,3,3,10,0,6,6,10,1,{"$nulls":4},"Barefootdancer",{"$f":"IF(ISNA(VLOOKUP(V23,Data!$A$1:'Data'!$B$200,2,FALSE)),\"\",(VLOOKUP(V23,Data!$A$1:'Data'!$B$200,2,FALSE)))","v":96},null,"","",null,null,null,{"$f":"IF(Data!F13=\"\",\"\",CLEAN(TRIM(Data!F13)))","v":""},null,{"$f":"IF(ISNA(VLOOKUP(AD23,Data!$V$1:'Data'!$X$100,3,FALSE)),\"\",VLOOKUP(AD23,Data!$V$1:'Data'!$X$100,3,FALSE))","v":""}]
[14," Wingen Win",117.5,null,7,44,12,0,3,3,8,8,0,4,7,3,20,{"$nulls":4},"Wingen Win",{"$f":"IF(ISNA(VLOOKUP(V24,Data!$A$1:'Data'!$B$200,2,FALSE)),\"\",(VLOOKUP(V24,Data!$A$1:'Data'!$B$200,2,FALSE)))","v":95},null,"","",null,null,null,{"$f":"IF(Data!F14=\"\",\"\",CLEAN(TRIM(Data!F14)))","v":""},null,{"$f":"IF(ISNA(VLOOKUP(AD24,Data!$V$1:'Data'!$X$100,3,FALSE)),\"\",VLOOKUP(AD24,Data!$V$1:'Data'!$X$100,3,FALSE))","v":""}]
[15," Ripthis",107.5,null,5,4,1,0,10,30,8,13,0,6,9,7,15,{"$nulls":7},"","",null,null,null,{"$f":"IF(Data!F15=\"\",\"\",CLEAN(TRIM(Data!F15)))","v":""},null,{"$f":"IF(ISNA(VLOOKUP(AD25,Data!$V$1:'Data'!$X$100,3,FALSE)),\"\",VLOOKUP(AD25,Data!$V$1:'Data'!$X$100,3,FALSE))","v":""}]
[16," Typhoon Indy",51.5,null,5,1,1,0,8,8,8,11,0,2,6,2,1,{"$nulls":7},"","",null,null,null,{"$f":"IF(Data!F16=\"\",\"\",CLEAN(TRIM(Data!F16)))","v":""},null,{"$f":"IF(ISNA(VLOOKUP(AD26,Data!$V$1:'Data'!$X$100,3,FALSE)),\"\",VLOOKUP(AD26,Data!$V$1:'Data'!$X$100,3,FALSE))","v":""}]
[17," Glenarvy",65.5,null,4,3,11,0,5,8,10,0,0,6,6,2,11,{"$nulls":7},"","",null,null,null,{"$f":"IF(Data!F17=\"\",\"\",CLEAN(TRIM(Data!F17)))","v":""},null,{"$f":"IF(ISNA(VLOOKUP(AD27,Data!$V$1:'Data'!$X$100,3,FALSE)),\"\",VLOOKUP(AD27,Data!$V$1:'Data'!$X$100,3,FALSE))","v":""}]
[18," Cloudcraft",71,null,5,1,1,0,8,5,8,20,0,2,4,2,16,{"$nulls":7},"","",null,null,null,{"$f":"IF(Data!F18=\"\",\"\",CLEAN(TRIM(Data!F18)))","v":""},null,{"$f":"IF(ISNA(VLOOKUP(AD28,Data!$V$1:'Data'!$X$100,3,FALSE)),\"\",VLOOKUP(AD28,Data!$V$1:'Data'!$X$100,3,FALSE))","v":""}]
[{"$nulls":24},"","",null,null,null,{"$f":"IF(Data!F19=\"\",\"\",CLEAN(TRIM(Data!F19)))","v":""},null,{"$f":"IF(ISNA(VLOOKUP(AD29,Data!$V$1:'Data'!$X$100,3,FALSE)),\"\",VLOOKUP(AD29,Data!$V$1:'Data'!$X$100,3,FALSE))","v":""}]
[{"$nulls":24},"","",null,null,null,{"$f":"IF(Data!F20=\"\",\"\",CLEAN(TRIM(Data!F20)))","v":""},null,{"$f":"IF(ISNA(VLOOKUP(AD30,Data!$V$1:'Data'!$X$100,3,FALSE)),\"\",VLOOKUP(AD30,Data!$V$1:'Data'!$X$100,3,FALSE))","v":""}]
[{"$nulls":24},"","",null,null,null,{"$f":"IF(Data!F21=\"\",\"\",CLEAN(TRIM(Data!F21)))","v":""},null,{"$f":"IF(ISNA(VLOOKUP(AD31,Data!$V$1:'Data'!$X$100,3,FALSE)),\"\",VLOOKUP(AD31,Data!$V$1:'Data'!$X$100,3,FALSE))","v":""}]
[{"$nulls":24},"","",null,null,null,{"$f":"IF(Data!F22=\"\",\"\",CLEAN(TRIM(Data!F22)))","v":""},null,{"$f":"IF(ISNA(VLOOKUP(AD32,Data!$V$1:'Data'!$X$100,3,FALSE)),\"\",VLOOKUP(AD32,Data!$V$1:'Data'!$X$100,3,FALSE))","v":""}]
[{"$nulls":24},"","",null,null,null,{"$f":"IF(Data!F23=\"\",\"\",CLEAN(TRIM(Data!F23)))","v":""},null,{"$f":"IF(ISNA(VLOOKUP(AD33,Data!$V$1:'Data'!$X$100,3,FALSE)),\"\",VLOOKUP(AD33,Data!$V$1:'Data'!$X$100,3,FALSE))","v":""}]
[{"$nulls":24},"","",null,null,null,{"$f":"IF(Data!F24=\"\",\"\",CLEAN(TRIM(Data!F24)))","v":""},null,{"$f":"IF(ISNA(VLOOKUP(AD34,Data!$V$1:'Data'!$X$100,3,FALSE)),\"\",VLOOKUP(AD34,Data!$V$1:'Data'!$X$100,3,FALSE))","v":""}]
[{"$nulls":24},"","",null,null,null,{"$f":"IF(Data!F25=\"\",\"\",CLEAN(TRIM(Data!F25)))","v":""},null,{"$f":"IF(ISNA(VLOOKUP(AD35,Data!$V$1:'Data'!$X$100,3,FALSE)),\"\",VLOOKUP(AD35,Data!$V$1:'Data'!$X$100,3,FALSE))","v":""}]
[{"$nulls":24},"","",null,null,null,{"$f":"IF(Data!F26=\"\",\"\",CLEAN(TRIM(Data!F26)))","v":""},null,{"$f":"IF(ISNA(VLOOKUP(AD36,Data!$V$1:'Data'!$X$100,3,FALSE)),\"\",VLOOKUP(AD36,Data!$V$1:'Data'!$X$100,3,FALSE))","v":""}]
[]
[]
[{"$nulls":14},{"$f":"LARGE(O41:O70,1)","v":37},{"$nulls":11},{"$f":"SMALL(R41:R70,1)","v":4},{"$f":"LARGE(AB41:AB71,1)","v":14}]
["INC","TAB","HORSE","RFS","DLS","12m","BRR","SCR","FORM","COND","CONS","BP","JOCK","JC","FR","EM","PER","DIV","DInc",null,null,null,"Barrier",null,null,"Runner"]
[null,1," Boulevard Baron ","FU ",184,35,null,0,{"$nulls":5},1.5,31,6,1.98,51,null,null,null,{"$f":"CLEAN(TRIM(C41))","v":"Boulevard Baron"},{"$f":"IF(V41=\"\",\"\",IF(ISNA(VLOOKUP(V41,Data!$A$1:'Data'!$C$200,3,FALSE)),\"\",(VLOOKUP(V41,Data!$A$1:'Data'!$C$200,3,FALSE))))","v":9},null,{"$f":"IF(W41=\"\",\"\",IF(W41>4,IF(AND(E11=$E$9,O41=$O$39),B41,\"\"),\"\"))","v":""},{"$f":"IF(Y41=\"\",\"\",CLEAN(TRIM(C41)))","v":""},{"$f":"IF(R41=$AA$39,R41,\"\")","v":""},{"$f":"IF(AA41<>\"\",B41,\"\")","v":""}]
[null,2," Inherited ","FU ",80,34,null,0,{"$nulls":5},0,27.5,9.5,0.25,401,null,null,null,{"$f":"CLEAN(TRIM(C42))","v":"Inherited"},{"$f":"IF(V42=\"\",\"\",IF(ISNA(VLOOKUP(V42,Data!$A$1:'Data'!$C$200,3,FALSE)),\"\",(VLOOKUP(V42,Data!$A$1:'Data'!$C$200,3,FALSE))))","v":10},null,{"$f":"IF(W42=\"\",\"\",IF(W42>4,IF(AND(E12=$E$9,O42=$O$39),B42,\"\"),\"\"))","v":""},{"$f":"IF(Y42=\"\",\"\",CLEAN(TRIM(C42)))","v":""},{"$f":"IF(R42=$AA$39,R42,\"\")","v":""},{"$f":"IF(AA42<>\"\",B42,\"\")","v":""}]
[null,3," Forced To Tango ",4,59,37.5,null,0,{"$nulls":5},0,18,19,0.25,401,null,null,null,"Forced To Tango",{"$f":"IF(V43=\"\",\"\",IF(ISNA(VLOOKUP(V43,Data!$A$1:'Data'!$C$200,3,FALSE)),\"\",(VLOOKUP(V43,Data!$A$1:'Data'!$C$200,3,FALSE))))","v":3},null,"","","",""]
[null,4," Penteli ","FU ",92,34.5,null,0,{"$nulls":5},2,31.5,5.5,2.73,41,null,null,null,"Penteli",{"$f":"IF(V44=\"\",\"\",IF(ISNA(VLOOKUP(V44,Data!$A$1:'Data'!$C$200,3,FALSE)),\"\",(VLOOKUP(V44,Data!$A$1:'Data'!$C$200,3,FALSE))))","v":15},null,"","","",""]
[null,5," Okane ","FU ",126,34.5,null,0,{"$nulls":5},0,29.5,7.5,0.99,101,null,null,null,"Okane",{"$f":"IF(V45=\"\",\"\",IF(ISNA(VLOOKUP(V45,Data!$A$1:'Data'!$C$200,3,FALSE)),\"\",(VLOOKUP(V45,Data!$A$1:'Data'!$C$200,3,FALSE))))","v":13},null,"","","",""]
[null,6," Tennessee Madam ",3,31,34,null,0,{"$nulls":5},0,34,3,9.92,10,null,null,null,"Tennessee Madam",{"$f":"IF(V46=\"\",\"\",IF(ISNA(VLOOKUP(V46,Data!$A$1:'Data'!$C$200,3,FALSE)),\"\",(VLOOKUP(V46,Data!$A$1:'Data'!$C$200,3,FALSE))))","v":8},null,"","","",""]
[null,7," Last Rain ","FU ",153,36,null,0,{"$nulls":5},0,31,6,1.98,51,null,null,null,"Last Rain",{"$f":"IF(V47=\"\",\"\",IF(ISNA(VLOOKUP(V47,Data!$A$1:'Data'!$C$200,3,FALSE)),\"\",(VLOOKUP(V47,Data!$A$1:'Data'!$C$200,3,FALSE))))","v":6},null,"","","",""]
[null,8," I'M Ready ",9,18,35.5,null,0,{"$nulls":5},0,32,5,3.47,31,null,null,null,"I'M Ready",{"$f":"IF(V48=\"\",\"\",IF(ISNA(VLOOKUP(V48,Data!$A$1:'Data'!$C$200,3,FALSE)),\"\",(VLOOKUP(V48,Data!$A$1:'Data'!$C$200,3,FALSE))))","v":14},null,"","","",""]
[null,9," Dunolly ",3,11,36,null,0,{"$nulls":5},0,35.5,1.5,16.61,6,null,null,null,"Dunolly",{"$f":"IF(V49=\"\",\"\",IF(ISNA(VLOOKUP(V49,Data!$A$1:'Data'!$C$200,3,FALSE)),\"\",(VLOOKUP(V49,Data!$A$1:'Data'!$C$200,3,FALSE))))","v":12},null,"","","",""]
[null,10," Thwarted ","FU ",178,30,null,0,{"$nulls":5},0,24,13,0.25,401,null,null,null,"Thwarted",{"$f":"IF(V50=\"\",\"\",IF(ISNA(VLOOKUP(V50,Data!$A$1:'Data'!$C$200,3,FALSE)),\"\",(VLOOKUP(V50,Data!$A$1:'Data'!$C$200,3,FALSE))))","v":4},null,"",{"$f":"IF(Y50=\"\",\"\",CLEAN(TRIM(C50)))","v":""},"",""]
[null,11," Izzyinhell ",6,29,35,null,0,{"$nulls":5},0,36,1,19.829999999999998,5,null,null,null,"Izzyinhell",{"$f":"IF(V51=\"\",\"\",IF(ISNA(VLOOKUP(V51,Data!$A$1:'Data'!$C$200,3,FALSE)),\"\",(VLOOKUP(V51,Data!$A$1:'Data'!$C$200,3,FALSE))))","v":1},null,"","","",""]
[null,12," Sutton Princess ","FU ",119,37,null,0,{"$nulls":5},0,30.5,6.5,1.49,71,null,null,null,"Sutton Princess",{"$f":"IF(V52=\"\",\"\",IF(ISNA(VLOOKUP(V52,Data!$A$1:'Data'!$C$200,3,FALSE)),\"\",(VLOOKUP(V52,Data!$A$1:'Data'!$C$200,3,FALSE))))","v":16},null,"","","",""]
[null,13," Barefootdancer ","FU ",216,31,null,0,{"$nulls":5},0,24.5,12.5,0.25,401,null,null,null,"Barefootdancer",{"$f":"IF(V53=\"\",\"\",IF(ISNA(VLOOKUP(V53,Data!$A$1:'Data'!$C$200,3,FALSE)),\"\",(VLOOKUP(V53,Data!$A$1:'Data'!$C$200,3,FALSE))))","v":2},null,"","","",""]
[null,14," Wingen Win ",8,8,35,null,0,{"$nulls":5},0,37,0,24.79,4,null,null,null,"Wingen Win",{"$f":"IF(V54=\"\",\"\",IF(ISNA(VLOOKUP(V54,Data!$A$1:'Data'!$C$200,3,FALSE)),\"\",(VLOOKUP(V54,Data!$A$1:'Data'!$C$200,3,FALSE))))","v":11},null,"","",4,14]
[null,15," Ripthis ","SU ",19,30,null,0,{"$nulls":5},0,32,5,3.47,31,null,null,null,"Ripthis",{"$f":"IF(V55=\"\",\"\",IF(ISNA(VLOOKUP(V55,Data!$A$1:'Data'!$C$200,3,FALSE)),\"\",(VLOOKUP(V55,Data!$A$1:'Data'!$C$200,3,FALSE))))","v":5},null,"",{"$f":"IF(Y55=\"\",\"\",CLEAN(TRIM(C55)))","v":""},"",""]
[null,16," Typhoon Indy ","FU ",143,35.5,null,0,{"$nulls":5},0,29.5,7.5,0.99,101,null,null,null,"Typhoon Indy",{"$f":"IF(V56=\"\",\"\",IF(ISNA(VLOOKUP(V56,Data!$A$1:'Data'!$C$200,3,FALSE)),\"\",(VLOOKUP(V56,Data!$A$1:'Data'!$C$200,3,FALSE))))","v":7},null,"","","",""]
[null,17," Glenarvy ",3,35,34.5,null,0,{"$nulls":5},0,24,13,0.25,401,null,null,null,"Glenarvy",{"$f":"IF(V57=\"\",\"\",IF(ISNA(VLOOKUP(V57,Data!$A$1:'Data'!$C$200,3,FALSE)),\"\",(VLOOKUP(V57,Data!$A$1:'Data'!$C$200,3,FALSE))))","v":18},null,"","","",""]
[null,18," Cloudcraft ","SU ",17,42,null,0,{"$nulls":5},0,26.5,10.5,0.25,401,null,null,null,"Cloudcraft",{"$f":"IF(V58=\"\",\"\",IF(ISNA(VLOOKUP(V58,Data!$A$1:'Data'!$C$200,3,FALSE)),\"\",(VLOOKUP(V58,Data!$A$1:'Data'!$C$200,3,FALSE))))","v":17},null,"","","",""]
[{"$nulls":6},"Clear","Clear","Clear","Clear","Clear","Clear",{"$nulls":9},"",{"$f":"IF(V59=\"\",\"\",IF(ISNA(VLOOKUP(V59,Data!$A$1:'Data'!$C$200,3,FALSE)),\"\",(VLOOKUP(V59,Data!$A$1:'Data'!$C$200,3,FALSE))))","v":""},null,"","","",""]
[{"$nulls":21},"",{"$f":"IF(V60=\"\",\"\",IF(ISNA(VLOOKUP(V60,Data!$A$1:'Data'!$C$200,3,FALSE)),\"\",(VLOOKUP(V60,Data!$A$1:'Data'!$C$200,3,FALSE))))","v":""},null,"","","",""]
[{"$nulls":21},"",{"$f":"IF(V61=\"\",\"\",IF(ISNA(VLOOKUP(V61,Data!$A$1:'Data'!$C$200,3,FALSE)),\"\",(VLOOKUP(V61,Data!$A$1:'Data'!$C$200,3,FALSE))))","v":""},null,"","","",""]
[{"$nulls":21},"",{"$f":"IF(V62=\"\",\"\",IF(ISNA(VLOOKUP(V62,Data!$A$1:'Data'!$C$200,3,FALSE)),\"\",(VLOOKUP(V62,Data!$A$1:'Data'!$C$200,3,FALSE))))","v":""},null,"","","",""]
[{"$nulls":21},"",{"$f":"IF(V63=\"\",\"\",IF(ISNA(VLOOKUP(V63,Data!$A$1:'Data'!$C$200,3,FALSE)),\"\",(VLOOKUP(V63,Data!$A$1:'Data'!$C$200,3,FALSE))))","v":""},null,"","","",""]
[{"$nulls":21},"",{"$f":"IF(V64=\"\",\"\",IF(ISNA(VLOOKUP(V64,Data!$A$1:'Data'!$C$200,3,FALSE)),\"\",(VLOOKUP(V64,Data!$A$1:'Data'!$C$200,3,FALSE))))","v":""},null,"",{"$f":"IF(Y64=\"\",\"\",CLEAN(TRIM(C64)))","v":""},"",""]
[{"$nulls":21},"",{"$f":"IF(V65=\"\",\"\",IF(ISNA(VLOOKUP(V65,Data!$A$1:'Data'!$C$200,3,FALSE)),\"\",(VLOOKUP(V65,Data!$A$1:'Data'!$C$200,3,FALSE))))","v":""},null,"","","",""]
[{"$nulls":21},"",{"$f":"IF(V66=\"\",\"\",IF(ISNA(VLOOKUP(V66,Data!$A$1:'Data'!$C$200,3,FALSE)),\"\",(VLOOKUP(V66,Data!$A$1:'Data'!$C$200,3,FALSE))))","v":""},null,"","","",""]
[{"$nulls":24},"","","",""]
[{"$nulls":24},"","","",""]

{"sheet":"Data","index":1,"n_rows":45,"n_cols":24,"rows_kept":45,"cut":false,"hidden":false,"merged":[]}
[{"$f":"Neurals!B3","v":"SCONE"},{"$f":"Neurals!E3","v":9},{"$f":"Neurals!U1","v":""},null,"2011-03-29",null,{"$f":"IF(ISNA(VLOOKUP(A1,F2:Q40,B1+2,FALSE)),\"\",VLOOKUP(A1,F2:Q40,B1+2,FALSE))","v":""},{"$nulls":14},{"$f":"IF(W1<>\"\",CLEAN(TRIM(Meetings!W1)),\"\")","v":""},{"$f":"IF(Meetings!W1=\"\",\"\",getAddress(Meetings!W1))","v":""},{"$f":"IF(W1=\"\",\"\",RIGHT(W1,LEN(W1)-FIND(\"=\",W1,1)))","v":""}]
[{"$nulls":5},{"$f":"IF(G2=\"\",\"\",IF(ISERROR(CLEAN(TRIM((LEFT(G2,FIND(\"(\",G2,1)-1))))),\"\",CLEAN(TRIM(LEFT(G2,FIND(\"(\",G2,1)-1)))))","v":"TOWNSVILLE"},{"$f":"IF(Meetings!B3=\"\",\"\",Meetings!B3)","v":"TOWNSVILLE (QR)"},{"$f":"IF(Meetings!D3=\"\",\"\",getAddress(Meetings!D3))","v":"http://www.tabonline.com.au/2011/03/29/QR01.html"},{"$f":"IF(Meetings!E3=\"\",\"\",getAddress(Meetings!E3))","v":"http://www.tabonline.com.au/2011/03/29/QR02.html"},{"$f":"IF(Meetings!F3=\"\",\"\",getAddress(Meetings!F3))","v":"http://www.tabonline.com.au/2011/03/29/QR03.html"},{"$f":"IF(Meetings!G3=\"\",\"\",getAddress(Meetings!G3))","v":"http://www.tabonline.com.au/2011/03/29/QR04.html"},{"$f":"IF(Meetings!H3=\"\",\"\",getAddress(Meetings!H3))","v":"http://www.tabonline.com.au/2011/03/29/QR05.html"},{"$f":"IF(Meetings!I3=\"\",\"\",getAddress(Meetings!I3))","v":"http://www.tabonline.com.au/2011/03/29/QR06.html"},{"$f":"IF(Meetings!J3=\"\",\"\",getAddress(Meetings!J3))","v":"http://www.tabonline.com.au/2011/03/29/QR07.html"},{"$f":"IF(Meetings!K3=\"\",\"\",getAddress(Meetings!K3))","v":""},{"$f":"IF(Meetings!L3=\"\",\"\",getAddress(Meetings!L3))","v":""},{"$f":"IF(Meetings!M3=\"\",\"\",getAddress(Meetings!M3))","v":""},{"$f":"IF(Meetings!N3=\"\",\"\",getAddress(Meetings!N3))","v":""},{"$f":"IF(Meetings!O3=\"\",\"\",getAddress(Meetings!O3))","v":""},null,{"$f":"COUNTA(Meetings!D3:'Meetings'!O3)","v":7},{"$f":"IF(W2<>\"\",CLEAN(TRIM(Meetings!W2)),\"\")","v":""},{"$f":"IF(Meetings!W2=\"\",\"\",getAddress(Meetings!W2))","v":""},{"$f":"IF(W2=\"\",\"\",RIGHT(W2,LEN(W2)-FIND(\"=\",W2,1)))","v":""}]
[{"$f":"IF(Race!N1<>\"\",(CLEAN(TRIM(Race!C1))),\"\")","v":""},{"$f":"IF(A3<>\"\",Race!I1,\"\")","v":""},{"$f":"IF($C$1<>\"\",CLEAN(TRIM(INDEX(Race!$A$1:$C20,MATCH(\"QN\",Race!$A1:$A$20,0)-4,3))),\"\")","v":""},{"$f":"IF(ISNA(VLOOKUP(C3,Race!$C$2:$E$15,2,FALSE)),\"\",(VLOOKUP(C3,Race!$C$2:$E$15,2,FALSE)))","v":""},{"$f":"IF(ISNA(VLOOKUP(C3,Race!$C$2:$E$15,3,FALSE)),\"\",(VLOOKUP(C3,Race!$C$2:$E$15,3,FALSE)))","v":""},{"$f":"IF(G3=\"\",\"\",IF(ISERROR(CLEAN(TRIM((LEFT(G3,FIND(\"(\",G3,1)-1))))),\"\",CLEAN(TRIM(LEFT(G3,FIND(\"(\",G3,1)-1)))))","v":"SCONE"},{"$f":"IF(Meetings!B4=\"\",\"\",Meetings!B4)","v":"SCONE (NR)"},{"$f":"IF(Meetings!D4=\"\",\"\",getAddress(Meetings!D4))","v":"http://www.tabonline.com.au/2011/03/29/NR01.html"},{"$f":"IF(Meetings!E4=\"\",\"\",getAddress(Meetings!E4))","v":"http://www.tabonline.com.au/2011/03/29/NR02.html"},{"$f":"IF(Meetings!F4=\"\",\"\",getAddress(Meetings!F4))","v":"http://www.tabonline.com.au/2011/03/29/NR03.html"},{"$f":"IF(Meetings!G4=\"\",\"\",getAddress(Meetings!G4))","v":"http://www.tabonline.com.au/2011/03/29/NR04.html"},{"$f":"IF(Meetings!H4=\"\",\"\",getAddress(Meetings!H4))","v":"http://www.tabonline.com.au/2011/03/29/NR05.html"},{"$f":"IF(Meetings!I4=\"\",\"\",getAddress(Meetings!I4))","v":"http://www.tabonline.com.au/2011/03/29/NR06.html"},{"$f":"IF(Meetings!J4=\"\",\"\",getAddress(Meetings!J4))","v":"http://www.tabonline.com.au/2011/03/29/NR07.html"},{"$f":"IF(Meetings!K4=\"\",\"\",getAddress(Meetings!K4))","v":"http://www.tabonline.com.au/2011/03/29/NR08.html"},{"$f":"IF(Meetings!L4=\"\",\"\",getAddress(Meetings!L4))","v":""},{"$f":"IF(Meetings!M4=\"\",\"\",getAddress(Meetings!M4))","v":""},{"$f":"IF(Meetings!N4=\"\",\"\",getAddress(Meetings!N4))","v":""},{"$f":"IF(Meetings!O4=\"\",\"\",getAddress(Meetings!O4))","v":""},null,{"$f":"COUNTA(Meetings!D4:'Meetings'!O4)","v":8},{"$f":"IF(W3<>\"\",CLEAN(TRIM(Meetings!W3)),\"\")","v":""},{"$f":"IF(Meetings!W3=\"\",\"\",getAddress(Meetings!W3))","v":""},""]
[{"$f":"IF(Race!N2<>\"\",(CLEAN(TRIM(Race!C2))),\"\")","v":""},{"$f":"IF(A4<>\"\",Race!N2,\"\")","v":""},{"$f":"IF($C$1<>\"\",CLEAN(TRIM(INDEX(Race!$A$1:$C21,MATCH(\"QN\",Race!$A2:$A$20,0)-2,3))),\"\")","v":""},{"$f":"IF(ISNA(VLOOKUP(C4,Race!$C$2:$E$15,2,FALSE)),\"\",(VLOOKUP(C4,Race!$C$2:$E$15,2,FALSE)))","v":""},{"$f":"IF(ISNA(VLOOKUP(C4,Race!$C$2:$E$15,3,FALSE)),\"\",(VLOOKUP(C4,Race!$C$2:$E$15,3,FALSE)))","v":""},"SALE",{"$f":"IF(Meetings!B5=\"\",\"\",Meetings!B5)","v":"SALE (VR)"},{"$f":"IF(Meetings!D5=\"\",\"\",getAddress(Meetings!D5))","v":"http://www.tabonline.com.au/2011/03/29/VR01.html"},{"$f":"IF(Meetings!E5=\"\",\"\",getAddress(Meetings!E5))","v":"http://www.tabonline.com.au/2011/03/29/VR02.html"},{"$f":"IF(Meetings!F5=\"\",\"\",getAddress(Meetings!F5))","v":"http://www.tabonline.com.au/2011/03/29/VR03.html"},{"$f":"IF(Meetings!G5=\"\",\"\",getAddress(Meetings!G5))","v":"http://www.tabonline.com.au/2011/03/29/VR04.html"},{"$f":"IF(Meetings!H5=\"\",\"\",getAddress(Meetings!H5))","v":"http://www.tabonline.com.au/2011/03/29/VR05.html"},{"$f":"IF(Meetings!I5=\"\",\"\",getAddress(Meetings!I5))","v":"http://www.tabonline.com.au/2011/03/29/VR06.html"},{"$f":"IF(Meetings!J5=\"\",\"\",getAddress(Meetings!J5))","v":"http://www.tabonline.com.au/2011/03/29/VR07.html"},{"$f":"IF(Meetings!K5=\"\",\"\",getAddress(Meetings!K5))","v":"http://www.tabonline.com.au/2011/03/29/VR08.html"},{"$f":"IF(Meetings!L5=\"\",\"\",getAddress(Meetings!L5))","v":""},{"$f":"IF(Meetings!M5=\"\",\"\",getAddress(Meetings!M5))","v":""},{"$f":"IF(Meetings!N5=\"\",\"\",getAddress(Meetings!N5))","v":""},{"$f":"IF(Meetings!O5=\"\",\"\",getAddress(Meetings!O5))","v":""},null,{"$f":"COUNTA(Meetings!D5:'Meetings'!O5)","v":8},{"$f":"IF(W4<>\"\",CLEAN(TRIM(Meetings!W4)),\"\")","v":""},{"$f":"IF(Meetings!W4=\"\",\"\",getAddress(Meetings!W4))","v":""},""]
[{"$f":"IF(Race!N3<>\"\",(CLEAN(TRIM(Race!C3))),\"\")","v":""},{"$f":"IF(A5<>\"\",Race!N3,\"\")","v":""},{"$f":"IF($C$1<>\"\",CLEAN(TRIM(INDEX(Race!$A$1:$C22,MATCH(\"QN\",Race!$A3:$A$20,0)-0,3))),\"\")","v":""},{"$f":"IF(ISNA(VLOOKUP(C5,Race!$C$2:$E$15,2,FALSE)),\"\",(VLOOKUP(C5,Race!$C$2:$E$15,2,FALSE)))","v":""},{"$f":"IF(ISNA(VLOOKUP(C5,Race!$C$2:$E$15,3,FALSE)),\"\",(VLOOKUP(C5,Race!$C$2:$E$15,3,FALSE)))","v":""},"KALGOORLIE",{"$f":"IF(Meetings!B6=\"\",\"\",Meetings!B6)","v":"KALGOORLIE (PR)"},{"$f":"IF(Meetings!D6=\"\",\"\",getAddress(Meetings!D6))","v":"http://www.tabonline.com.au/2011/03/29/PR01.html"},{"$f":"IF(Meetings!E6=\"\",\"\",getAddress(Meetings!E6))","v":"http://www.tabonline.com.au/2011/03/29/PR02.html"},{"$f":"IF(Meetings!F6=\"\",\"\",getAddress(Meetings!F6))","v":"http://www.tabonline.com.au/2011/03/29/PR03.html"},{"$f":"IF(Meetings!G6=\"\",\"\",getAddress(Meetings!G6))","v":"http://www.tabonline.com.au/2011/03/29/PR04.html"},{"$f":"IF(Meetings!H6=\"\",\"\",getAddress(Meetings!H6))","v":"http://www.tabonline.com.au/2011/03/29/PR05.html"},{"$f":"IF(Meetings!I6=\"\",\"\",getAddress(Meetings!I6))","v":"http://www.tabonline.com.au/2011/03/29/PR06.html"},{"$f":"IF(Meetings!J6=\"\",\"\",getAddress(Meetings!J6))","v":"http://www.tabonline.com.au/2011/03/29/PR07.html"},{"$f":"IF(Meetings!K6=\"\",\"\",getAddress(Meetings!K6))","v":""},{"$f":"IF(Meetings!L6=\"\",\"\",getAddress(Meetings!L6))","v":""},{"$f":"IF(Meetings!M6=\"\",\"\",getAddress(Meetings!M6))","v":""},{"$f":"IF(Meetings!N6=\"\",\"\",getAddress(Meetings!N6))","v":""},{"$f":"IF(Meetings!O6=\"\",\"\",getAddress(Meetings!O6))","v":""},null,{"$f":"COUNTA(Meetings!D6:'Meetings'!O6)","v":7},{"$f":"IF(W5<>\"\",CLEAN(TRIM(Meetings!W5)),\"\")","v":""},{"$f":"IF(Meetings!W5=\"\",\"\",getAddress(Meetings!W5))","v":""},""]
[{"$f":"IF(Race!N4<>\"\",(CLEAN(TRIM(Race!C4))),\"\")","v":""},{"$f":"IF(A6<>\"\",Race!N4,\"\")","v":""},null,null,null,"",{"$f":"IF(Meetings!B7=\"\",\"\",Meetings!B7)","v":""},{"$f":"IF(Meetings!D7=\"\",\"\",getAddress(Meetings!D7))","v":""},{"$f":"IF(Meetings!E7=\"\",\"\",getAddress(Meetings!E7))","v":""},{"$f":"IF(Meetings!F7=\"\",\"\",getAddress(Meetings!F7))","v":""},{"$f":"IF(Meetings!G7=\"\",\"\",getAddress(Meetings!G7))","v":""},{"$f":"IF(Meetings!H7=\"\",\"\",getAddress(Meetings!H7))","v":""},{"$f":"IF(Meetings!I7=\"\",\"\",getAddress(Meetings!I7))","v":""},{"$f":"IF(Meetings!J7=\"\",\"\",getAddress(Meetings!J7))","v":""},{"$f":"IF(Meetings!K7=\"\",\"\",getAddress(Meetings!K7))","v":""},{"$f":"IF(Meetings!L7=\"\",\"\",getAddress(Meetings!L7))","v":""},{"$f":"IF(Meetings!M7=\"\",\"\",getAddress(Meetings!M7))","v":""},{"$f":"IF(Meetings!N7=\"\",\"\",getAddress(Meetings!N7))","v":""},{"$f":"IF(Meetings!O7=\"\",\"\",getAddress(Meetings!O7))","v":""},null,{"$f":"COUNTA(Meetings!D7:'Meetings'!O7)","v":0},{"$f":"IF(W6<>\"\",CLEAN(TRIM(Meetings!W6)),\"\")","v":""},{"$f":"IF(Meetings!W6=\"\",\"\",getAddress(Meetings!W6))","v":""},""]
[{"$f":"IF(Race!N5<>\"\",(CLEAN(TRIM(Race!C5))),\"\")","v":""},{"$f":"IF(A7<>\"\",Race!N5,\"\")","v":""},{"$f":"IF(A7<>\"\",Race!I5,\"\")","v":""},null,null,"",{"$f":"IF(Meetings!B8=\"\",\"\",Meetings!B8)","v":""},{"$f":"IF(Meetings!D8=\"\",\"\",getAddress(Meetings!D8))","v":""},{"$f":"IF(Meetings!E8=\"\",\"\",getAddress(Meetings!E8))","v":""},{"$f":"IF(Meetings!F8=\"\",\"\",getAddress(Meetings!F8))","v":""},{"$f":"IF(Meetings!G8=\"\",\"\",getAddress(Meetings!G8))","v":""},{"$f":"IF(Meetings!H8=\"\",\"\",getAddress(Meetings!H8))","v":""},{"$f":"IF(Meetings!I8=\"\",\"\",getAddress(Meetings!I8))","v":""},{"$f":"IF(Meetings!J8=\"\",\"\",getAddress(Meetings!J8))","v":""},{"$f":"IF(Meetings!K8=\"\",\"\",getAddress(Meetings!K8))","v":""},{"$f":"IF(Meetings!L8=\"\",\"\",getAddress(Meetings!L8))","v":""},{"$f":"IF(Meetings!M8=\"\",\"\",getAddress(Meetings!M8))","v":""},{"$f":"IF(Meetings!N8=\"\",\"\",getAddress(Meetings!N8))","v":""},{"$f":"IF(Meetings!O8=\"\",\"\",getAddress(Meetings!O8))","v":""},null,{"$f":"COUNTA(Meetings!D8:'Meetings'!O8)","v":0},{"$f":"IF(W7<>\"\",CLEAN(TRIM(Meetings!W7)),\"\")","v":""},{"$f":"IF(Meetings!W7=\"\",\"\",getAddress(Meetings!W7))","v":""},""]
[{"$f":"IF(Race!N6<>\"\",(CLEAN(TRIM(Race!C6))),\"\")","v":"Name"},{"$f":"IF(A8<>\"\",Race!N6,\"\")","v":"Rtng"},{"$f":"IF(A8<>\"\",Race!I6,\"\")","v":"Bar"},null,null,"",{"$f":"IF(Meetings!B9=\"\",\"\",Meetings!B9)","v":""},{"$f":"IF(Meetings!D9=\"\",\"\",getAddress(Meetings!D9))","v":""},{"$f":"IF(Meetings!E9=\"\",\"\",getAddress(Meetings!E9))","v":""},{"$f":"IF(Meetings!F9=\"\",\"\",getAddress(Meetings!F9))","v":""},{"$f":"IF(Meetings!G9=\"\",\"\",getAddress(Meetings!G9))","v":""},{"$f":"IF(Meetings!H9=\"\",\"\",getAddress(Meetings!H9))","v":""},{"$f":"IF(Meetings!I9=\"\",\"\",getAddress(Meetings!I9))","v":""},{"$f":"IF(Meetings!J9=\"\",\"\",getAddress(Meetings!J9))","v":""},{"$f":"IF(Meetings!K9=\"\",\"\",getAddress(Meetings!K9))","v":""},{"$f":"IF(Meetings!L9=\"\",\"\",getAddress(Meetings!L9))","v":""},{"$f":"IF(Meetings!M9=\"\",\"\",getAddress(Meetings!M9))","v":""},{"$f":"IF(Meetings!N9=\"\",\"\",getAddress(Meetings!N9))","v":""},{"$f":"IF(Meetings!O9=\"\",\"\",getAddress(Meetings!O9))","v":""},null,{"$f":"COUNTA(Meetings!D9:'Meetings'!O9)","v":0},{"$f":"IF(W8<>\"\",CLEAN(TRIM(Meetings!W8)),\"\")","v":""},{"$f":"IF(Meetings!W8=\"\",\"\",getAddress(Meetings!W8))","v":""},""]
[{"$f":"IF(Race!N7<>\"\",(CLEAN(TRIM(Race!C7))),\"\")","v":"BOULEVARD BARON"},{"$f":"IF(A9<>\"\",Race!N7,\"\")","v":98},{"$f":"IF(A9<>\"\",Race!I7,\"\")","v":9},null,null,"",{"$f":"IF(Meetings!B10=\"\",\"\",Meetings!B10)","v":""},{"$f":"IF(Meetings!D10=\"\",\"\",getAddress(Meetings!D10))","v":""},{"$f":"IF(Meetings!E10=\"\",\"\",getAddress(Meetings!E10))","v":""},{"$f":"IF(Meetings!F10=\"\",\"\",getAddress(Meetings!F10))","v":""},{"$f":"IF(Meetings!G10=\"\",\"\",getAddress(Meetings!G10))","v":""},{"$f":"IF(Meetings!H10=\"\",\"\",getAddress(Meetings!H10))","v":""},{"$f":"IF(Meetings!I10=\"\",\"\",getAddress(Meetings!I10))","v":""},{"$f":"IF(Meetings!J10=\"\",\"\",getAddress(Meetings!J10))","v":""},{"$f":"IF(Meetings!K10=\"\",\"\",getAddress(Meetings!K10))","v":""},{"$f":"IF(Meetings!L10=\"\",\"\",getAddress(Meetings!L10))","v":""},{"$f":"IF(Meetings!M10=\"\",\"\",getAddress(Meetings!M10))","v":""},{"$f":"IF(Meetings!N10=\"\",\"\",getAddress(Meetings!N10))","v":""},{"$f":"IF(Meetings!O10=\"\",\"\",getAddress(Meetings!O10))","v":""},null,{"$f":"COUNTA(Meetings!D10:'Meetings'!O10)","v":0},{"$f":"IF(W9<>\"\",CLEAN(TRIM(Meetings!W9)),\"\")","v":""},{"$f":"IF(Meetings!W9=\"\",\"\",getAddress(Meetings!W9))","v":""},""]
[{"$f":"IF(Race!N8<>\"\",(CLEAN(TRIM(Race!C8))),\"\")","v":"INHERITED"},{"$f":"IF(A10<>\"\",Race!N8,\"\")","v":91},{"$f":"IF(A10<>\"\",Race!I8,\"\")","v":10},null,null,"",{"$f":"IF(Meetings!B11=\"\",\"\",Meetings!B11)","v":""},{"$f":"IF(Meetings!D11=\"\",\"\",getAddress(Meetings!D11))","v":""},{"$f":"IF(Meetings!E11=\"\",\"\",getAddress(Meetings!E11))","v":""},{"$f":"IF(Meetings!F11=\"\",\"\",getAddress(Meetings!F11))","v":""},{"$f":"IF(Meetings!G11=\"\",\"\",getAddress(Meetings!G11))","v":""},{"$f":"IF(Meetings!H11=\"\",\"\",getAddress(Meetings!H11))","v":""},{"$f":"IF(Meetings!I11=\"\",\"\",getAddress(Meetings!I11))","v":""},{"$f":"IF(Meetings!J11=\"\",\"\",getAddress(Meetings!J11))","v":""},{"$f":"IF(Meetings!K11=\"\",\"\",getAddress(Meetings!K11))","v":""},{"$f":"IF(Meetings!L11=\"\",\"\",getAddress(Meetings!L11))","v":""},{"$f":"IF(Meetings!M11=\"\",\"\",getAddress(Meetings!M11))","v":""},{"$f":"IF(Meetings!N11=\"\",\"\",getAddress(Meetings!N11))","v":""},{"$f":"IF(Meetings!O11=\"\",\"\",getAddress(Meetings!O11))","v":""},null,{"$f":"COUNTA(Meetings!D11:'Meetings'!O11)","v":0},{"$f":"IF(W10<>\"\",CLEAN(TRIM(Meetings!W10)),\"\")","v":""},{"$f":"IF(Meetings!W10=\"\",\"\",getAddress(Meetings!W10))","v":""},""]
[{"$f":"IF(Race!N9<>\"\",(CLEAN(TRIM(Race!C9))),\"\")","v":"FORCED TO TANGO"},{"$f":"IF(A11<>\"\",Race!N9,\"\")","v":93},{"$f":"IF(A11<>\"\",Race!I9,\"\")","v":3},null,null,"",{"$f":"IF(Meetings!B12=\"\",\"\",Meetings!B12)","v":""},{"$f":"IF(Meetings!D12=\"\",\"\",getAddress(Meetings!D12))","v":""},{"$f":"IF(Meetings!E12=\"\",\"\",getAddress(Meetings!E12))","v":""},{"$f":"IF(Meetings!F12=\"\",\"\",getAddress(Meetings!F12))","v":""},{"$f":"IF(Meetings!G12=\"\",\"\",getAddress(Meetings!G12))","v":""},{"$f":"IF(Meetings!H12=\"\",\"\",getAddress(Meetings!H12))","v":""},{"$f":"IF(Meetings!I12=\"\",\"\",getAddress(Meetings!I12))","v":""},{"$f":"IF(Meetings!J12=\"\",\"\",getAddress(Meetings!J12))","v":""},{"$f":"IF(Meetings!K12=\"\",\"\",getAddress(Meetings!K12))","v":""},{"$f":"IF(Meetings!L12=\"\",\"\",getAddress(Meetings!L12))","v":""},{"$f":"IF(Meetings!M12=\"\",\"\",getAddress(Meetings!M12))","v":""},{"$f":"IF(Meetings!N12=\"\",\"\",getAddress(Meetings!N12))","v":""},{"$f":"IF(Meetings!O12=\"\",\"\",getAddress(Meetings!O12))","v":""},null,{"$f":"COUNTA(Meetings!D12:'Meetings'!O12)","v":0},{"$f":"IF(W11<>\"\",CLEAN(TRIM(Meetings!W11)),\"\")","v":""},{"$f":"IF(Meetings!W11=\"\",\"\",getAddress(Meetings!W11))","v":""},""]
[{"$f":"IF(Race!N10<>\"\",(CLEAN(TRIM(Race!C10))),\"\")","v":"PENTELI"},{"$f":"IF(A12<>\"\",Race!N10,\"\")","v":90},{"$f":"IF(A12<>\"\",Race!I10,\"\")","v":15},null,null,"",{"$f":"IF(Meetings!B13=\"\",\"\",Meetings!B13)","v":""},{"$f":"IF(Meetings!D13=\"\",\"\",getAddress(Meetings!D13))","v":""},{"$f":"IF(Meetings!E13=\"\",\"\",getAddress(Meetings!E13))","v":""},{"$f":"IF(Meetings!F13=\"\",\"\",getAddress(Meetings!F13))","v":""},{"$f":"IF(Meetings!G13=\"\",\"\",getAddress(Meetings!G13))","v":""},{"$f":"IF(Meetings!H13=\"\",\"\",getAddress(Meetings!H13))","v":""},{"$f":"IF(Meetings!I13=\"\",\"\",getAddress(Meetings!I13))","v":""},{"$f":"IF(Meetings!J13=\"\",\"\",getAddress(Meetings!J13))","v":""},{"$f":"IF(Meetings!K13=\"\",\"\",getAddress(Meetings!K13))","v":""},{"$f":"IF(Meetings!L13=\"\",\"\",getAddress(Meetings!L13))","v":""},{"$f":"IF(Meetings!M13=\"\",\"\",getAddress(Meetings!M13))","v":""},{"$f":"IF(Meetings!N13=\"\",\"\",getAddress(Meetings!N13))","v":""},{"$f":"IF(Meetings!O13=\"\",\"\",getAddress(Meetings!O13))","v":""},null,{"$f":"COUNTA(Meetings!D13:'Meetings'!O13)","v":0},{"$f":"IF(W12<>\"\",CLEAN(TRIM(Meetings!W12)),\"\")","v":""},{"$f":"IF(Meetings!W12=\"\",\"\",getAddress(Meetings!W12))","v":""},""]
[{"$f":"IF(Race!N11<>\"\",(CLEAN(TRIM(Race!C11))),\"\")","v":"OKANE"},{"$f":"IF(A13<>\"\",Race!N11,\"\")","v":97},{"$f":"IF(A13<>\"\",Race!I11,\"\")","v":13},null,null,"",{"$f":"IF(Meetings!B14=\"\",\"\",Meetings!B14)","v":""},{"$f":"IF(Meetings!D14=\"\",\"\",getAddress(Meetings!D14))","v":""},{"$f":"IF(Meetings!E14=\"\",\"\",getAddress(Meetings!E14))","v":""},{"$f":"IF(Meetings!F14=\"\",\"\",getAddress(Meetings!F14))","v":""},{"$f":"IF(Meetings!G14=\"\",\"\",getAddress(Meetings!G14))","v":""},{"$f":"IF(Meetings!H14=\"\",\"\",getAddress(Meetings!H14))","v":""},{"$f":"IF(Meetings!I14=\"\",\"\",getAddress(Meetings!I14))","v":""},{"$f":"IF(Meetings!J14=\"\",\"\",getAddress(Meetings!J14))","v":""},{"$f":"IF(Meetings!K14=\"\",\"\",getAddress(Meetings!K14))","v":""},{"$f":"IF(Meetings!L14=\"\",\"\",getAddress(Meetings!L14))","v":""},{"$f":"IF(Meetings!M14=\"\",\"\",getAddress(Meetings!M14))","v":""},{"$f":"IF(Meetings!N14=\"\",\"\",getAddress(Meetings!N14))","v":""},{"$f":"IF(Meetings!O14=\"\",\"\",getAddress(Meetings!O14))","v":""},null,{"$f":"COUNTA(Meetings!D14:'Meetings'!O14)","v":0},{"$f":"IF(W13<>\"\",CLEAN(TRIM(Meetings!W13)),\"\")","v":""},{"$f":"IF(Meetings!W13=\"\",\"\",getAddress(Meetings!W13))","v":""},""]
[{"$f":"IF(Race!N12<>\"\",(CLEAN(TRIM(Race!C12))),\"\")","v":"TENNESSEE MADAM"},{"$f":"IF(A14<>\"\",Race!N12,\"\")","v":100},{"$f":"IF(A14<>\"\",Race!I12,\"\")","v":8},null,null,"",{"$f":"IF(Meetings!B15=\"\",\"\",Meetings!B15)","v":""},{"$f":"IF(Meetings!D15=\"\",\"\",getAddress(Meetings!D15))","v":""},{"$f":"IF(Meetings!E15=\"\",\"\",getAddress(Meetings!E15))","v":""},{"$f":"IF(Meetings!F15=\"\",\"\",getAddress(Meetings!F15))","v":""},{"$f":"IF(Meetings!G15=\"\",\"\",getAddress(Meetings!G15))","v":""},{"$f":"IF(Meetings!H15=\"\",\"\",getAddress(Meetings!H15))","v":""},{"$f":"IF(Meetings!I15=\"\",\"\",getAddress(Meetings!I15))","v":""},{"$f":"IF(Meetings!J15=\"\",\"\",getAddress(Meetings!J15))","v":""},{"$f":"IF(Meetings!K15=\"\",\"\",getAddress(Meetings!K15))","v":""},{"$f":"IF(Meetings!L15=\"\",\"\",getAddress(Meetings!L15))","v":""},{"$f":"IF(Meetings!M15=\"\",\"\",getAddress(Meetings!M15))","v":""},{"$f":"IF(Meetings!N15=\"\",\"\",getAddress(Meetings!N15))","v":""},{"$f":"IF(Meetings!O15=\"\",\"\",getAddress(Meetings!O15))","v":""},null,{"$f":"COUNTA(Meetings!D15:'Meetings'!O15)","v":0},{"$f":"IF(W14<>\"\",CLEAN(TRIM(Meetings!W14)),\"\")","v":"Kalgoorlie"},{"$f":"IF(Meetings!W14=\"\",\"\",getAddress(Meetings!W14))","v":"http://www.racingandsports.com.au/form-guide/meeting.asp?meeting=16353"},"16353"]
[{"$f":"IF(Race!N13<>\"\",(CLEAN(TRIM(Race!C13))),\"\")","v":"LAST RAIN"},{"$f":"IF(A15<>\"\",Race!N13,\"\")","v":94},{"$f":"IF(A15<>\"\",Race!I13,\"\")","v":6},null,null,"",{"$f":"IF(Meetings!B16=\"\",\"\",Meetings!B16)","v":""},{"$f":"IF(Meetings!D16=\"\",\"\",getAddress(Meetings!D16))","v":""},{"$f":"IF(Meetings!E16=\"\",\"\",getAddress(Meetings!E16))","v":""},{"$f":"IF(Meetings!F16=\"\",\"\",getAddress(Meetings!F16))","v":""},{"$f":"IF(Meetings!G16=\"\",\"\",getAddress(Meetings!G16))","v":""},{"$f":"IF(Meetings!H16=\"\",\"\",getAddress(Meetings!H16))","v":""},{"$f":"IF(Meetings!I16=\"\",\"\",getAddress(Meetings!I16))","v":""},{"$f":"IF(Meetings!J16=\"\",\"\",getAddress(Meetings!J16))","v":""},{"$f":"IF(Meetings!K16=\"\",\"\",getAddress(Meetings!K16))","v":""},{"$f":"IF(Meetings!L16=\"\",\"\",getAddress(Meetings!L16))","v":""},{"$f":"IF(Meetings!M16=\"\",\"\",getAddress(Meetings!M16))","v":""},{"$f":"IF(Meetings!N16=\"\",\"\",getAddress(Meetings!N16))","v":""},{"$f":"IF(Meetings!O16=\"\",\"\",getAddress(Meetings!O16))","v":""},null,{"$f":"COUNTA(Meetings!D16:'Meetings'!O16)","v":0},{"$f":"IF(W15<>\"\",CLEAN(TRIM(Meetings!W15)),\"\")","v":"Sale"},{"$f":"IF(Meetings!W15=\"\",\"\",getAddress(Meetings!W15))","v":"http://www.racingandsports.com.au/form-guide/meeting.asp?meeting=16362"},"16362"]
[{"$f":"IF(Race!N14<>\"\",(CLEAN(TRIM(Race!C14))),\"\")","v":"I'M READY"},{"$f":"IF(A16<>\"\",Race!N14,\"\")","v":96},{"$f":"IF(A16<>\"\",Race!I14,\"\")","v":14},null,null,"",{"$f":"IF(Meetings!B17=\"\",\"\",Meetings!B17)","v":""},{"$f":"IF(Meetings!D17=\"\",\"\",getAddress(Meetings!D17))","v":""},{"$f":"IF(Meetings!E17=\"\",\"\",getAddress(Meetings!E17))","v":""},{"$f":"IF(Meetings!F17=\"\",\"\",getAddress(Meetings!F17))","v":""},{"$f":"IF(Meetings!G17=\"\",\"\",getAddress(Meetings!G17))","v":""},{"$f":"IF(Meetings!H17=\"\",\"\",getAddress(Meetings!H17))","v":""},{"$f":"IF(Meetings!I17=\"\",\"\",getAddress(Meetings!I17))","v":""},{"$f":"IF(Meetings!J17=\"\",\"\",getAddress(Meetings!J17))","v":""},{"$f":"IF(Meetings!K17=\"\",\"\",getAddress(Meetings!K17))","v":""},{"$f":"IF(Meetings!L17=\"\",\"\",getAddress(Meetings!L17))","v":""},{"$f":"IF(Meetings!M17=\"\",\"\",getAddress(Meetings!M17))","v":""},{"$f":"IF(Meetings!N17=\"\",\"\",getAddress(Meetings!N17))","v":""},{"$f":"IF(Meetings!O17=\"\",\"\",getAddress(Meetings!O17))","v":""},null,{"$f":"COUNTA(Meetings!D17:'Meetings'!O17)","v":0},{"$f":"IF(W16<>\"\",CLEAN(TRIM(Meetings!W16)),\"\")","v":"Scone"},{"$f":"IF(Meetings!W16=\"\",\"\",getAddress(Meetings!W16))","v":"http://www.racingandsports.com.au/form-guide/meeting.asp?meeting=16351"},"16351"]
[{"$f":"IF(Race!N15<>\"\",(CLEAN(TRIM(Race!C15))),\"\")","v":"DUNOLLY"},{"$f":"IF(A17<>\"\",Race!N15,\"\")","v":95},{"$f":"IF(A17<>\"\",Race!I15,\"\")","v":12},null,null,"",{"$f":"IF(Meetings!B18=\"\",\"\",Meetings!B18)","v":""},{"$f":"IF(Meetings!D18=\"\",\"\",getAddress(Meetings!D18))","v":""},{"$f":"IF(Meetings!E18=\"\",\"\",getAddress(Meetings!E18))","v":""},{"$f":"IF(Meetings!F18=\"\",\"\",getAddress(Meetings!F18))","v":""},{"$f":"IF(Meetings!G18=\"\",\"\",getAddress(Meetings!G18))","v":""},{"$f":"IF(Meetings!H18=\"\",\"\",getAddress(Meetings!H18))","v":""},{"$f":"IF(Meetings!I18=\"\",\"\",getAddress(Meetings!I18))","v":""},{"$f":"IF(Meetings!J18=\"\",\"\",getAddress(Meetings!J18))","v":""},{"$f":"IF(Meetings!K18=\"\",\"\",getAddress(Meetings!K18))","v":""},{"$f":"IF(Meetings!L18=\"\",\"\",getAddress(Meetings!L18))","v":""},{"$f":"IF(Meetings!M18=\"\",\"\",getAddress(Meetings!M18))","v":""},{"$f":"IF(Meetings!N18=\"\",\"\",getAddress(Meetings!N18))","v":""},{"$f":"IF(Meetings!O18=\"\",\"\",getAddress(Meetings!O18))","v":""},null,{"$f":"COUNTA(Meetings!D18:'Meetings'!O18)","v":0},{"$f":"IF(W17<>\"\",CLEAN(TRIM(Meetings!W17)),\"\")","v":"Townsville"},{"$f":"IF(Meetings!W17=\"\",\"\",getAddress(Meetings!W17))","v":"http://www.racingandsports.com.au/form-guide/meeting.asp?meeting=16352"},"16352"]
[{"$f":"IF(Race!N16<>\"\",(CLEAN(TRIM(Race!C16))),\"\")","v":"THWARTED"},{"$f":"IF(A18<>\"\",Race!N16,\"\")","v":88},{"$f":"IF(A18<>\"\",Race!I16,\"\")","v":4},null,null,"",{"$f":"IF(Meetings!B19=\"\",\"\",Meetings!B19)","v":""},{"$f":"IF(Meetings!D19=\"\",\"\",getAddress(Meetings!D19))","v":""},{"$f":"IF(Meetings!E19=\"\",\"\",getAddress(Meetings!E19))","v":""},{"$f":"IF(Meetings!F19=\"\",\"\",getAddress(Meetings!F19))","v":""},{"$f":"IF(Meetings!G19=\"\",\"\",getAddress(Meetings!G19))","v":""},{"$f":"IF(Meetings!H19=\"\",\"\",getAddress(Meetings!H19))","v":""},{"$f":"IF(Meetings!I19=\"\",\"\",getAddress(Meetings!I19))","v":""},{"$f":"IF(Meetings!J19=\"\",\"\",getAddress(Meetings!J19))","v":""},{"$f":"IF(Meetings!K19=\"\",\"\",getAddress(Meetings!K19))","v":""},{"$f":"IF(Meetings!L19=\"\",\"\",getAddress(Meetings!L19))","v":""},{"$f":"IF(Meetings!M19=\"\",\"\",getAddress(Meetings!M19))","v":""},{"$f":"IF(Meetings!N19=\"\",\"\",getAddress(Meetings!N19))","v":""},{"$f":"IF(Meetings!O19=\"\",\"\",getAddress(Meetings!O19))","v":""},null,{"$f":"COUNTA(Meetings!D19:'Meetings'!O19)","v":0},{"$f":"IF(W18<>\"\",CLEAN(TRIM(Meetings!W18)),\"\")","v":""},{"$f":"IF(Meetings!W18=\"\",\"\",getAddress(Meetings!W18))","v":""},""]
[{"$f":"IF(Race!N17<>\"\",(CLEAN(TRIM(Race!C17))),\"\")","v":"IZZYINHELL"},{"$f":"IF(A19<>\"\",Race!N17,\"\")","v":94},{"$f":"IF(A19<>\"\",Race!I17,\"\")","v":1},null,null,"",{"$f":"IF(Meetings!B20=\"\",\"\",Meetings!B20)","v":""},{"$f":"IF(Meetings!D20=\"\",\"\",getAddress(Meetings!D20))","v":""},{"$f":"IF(Meetings!E20=\"\",\"\",getAddress(Meetings!E20))","v":""},{"$f":"IF(Meetings!F20=\"\",\"\",getAddress(Meetings!F20))","v":""},{"$f":"IF(Meetings!G20=\"\",\"\",getAddress(Meetings!G20))","v":""},{"$f":"IF(Meetings!H20=\"\",\"\",getAddress(Meetings!H20))","v":""},{"$f":"IF(Meetings!I20=\"\",\"\",getAddress(Meetings!I20))","v":""},{"$f":"IF(Meetings!J20=\"\",\"\",getAddress(Meetings!J20))","v":""},{"$f":"IF(Meetings!K20=\"\",\"\",getAddress(Meetings!K20))","v":""},{"$f":"IF(Meetings!L20=\"\",\"\",getAddress(Meetings!L20))","v":""},{"$f":"IF(Meetings!M20=\"\",\"\",getAddress(Meetings!M20))","v":""},{"$f":"IF(Meetings!N20=\"\",\"\",getAddress(Meetings!N20))","v":""},{"$f":"IF(Meetings!O20=\"\",\"\",getAddress(Meetings!O20))","v":""},null,{"$f":"COUNTA(Meetings!D20:'Meetings'!O20)","v":0},{"$f":"IF(W19<>\"\",CLEAN(TRIM(Meetings!W19)),\"\")","v":""},{"$f":"IF(Meetings!W19=\"\",\"\",getAddress(Meetings!W19))","v":""},""]
[{"$f":"IF(Race!N18<>\"\",(CLEAN(TRIM(Race!C18))),\"\")","v":"SUTTON PRINCESS"},{"$f":"IF(A20<>\"\",Race!N18,\"\")","v":99},{"$f":"IF(A20<>\"\",Race!I18,\"\")","v":16},null,null,"",{"$f":"IF(Meetings!B21=\"\",\"\",Meetings!B21)","v":""},{"$f":"IF(Meetings!D21=\"\",\"\",getAddress(Meetings!D21))","v":""},{"$f":"IF(Meetings!E21=\"\",\"\",getAddress(Meetings!E21))","v":""},{"$f":"IF(Meetings!F21=\"\",\"\",getAddress(Meetings!F21))","v":""},{"$f":"IF(Meetings!G21=\"\",\"\",getAddress(Meetings!G21))","v":""},{"$f":"IF(Meetings!H21=\"\",\"\",getAddress(Meetings!H21))","v":""},{"$f":"IF(Meetings!I21=\"\",\"\",getAddress(Meetings!I21))","v":""},{"$f":"IF(Meetings!J21=\"\",\"\",getAddress(Meetings!J21))","v":""},{"$f":"IF(Meetings!K21=\"\",\"\",getAddress(Meetings!K21))","v":""},{"$f":"IF(Meetings!L21=\"\",\"\",getAddress(Meetings!L21))","v":""},{"$f":"IF(Meetings!M21=\"\",\"\",getAddress(Meetings!M21))","v":""},{"$f":"IF(Meetings!N21=\"\",\"\",getAddress(Meetings!N21))","v":""},{"$f":"IF(Meetings!O21=\"\",\"\",getAddress(Meetings!O21))","v":""},null,{"$f":"COUNTA(Meetings!D21:'Meetings'!O21)","v":0},{"$f":"IF(W20<>\"\",CLEAN(TRIM(Meetings!W20)),\"\")","v":"Vaal Sand"},{"$f":"IF(Meetings!W20=\"\",\"\",getAddress(Meetings!W20))","v":"http://www.racingandsports.com.au/form-guide/meeting.asp?meeting=16375"},"16375"]
[{"$f":"IF(Race!N19<>\"\",(CLEAN(TRIM(Race!C19))),\"\")","v":"BAREFOOTDANCER"},{"$f":"IF(A21<>\"\",Race!N19,\"\")","v":96},{"$f":"IF(A21<>\"\",Race!I19,\"\")","v":2},null,null,"",{"$f":"IF(Meetings!B22=\"\",\"\",Meetings!B22)","v":""},{"$f":"IF(Meetings!D22=\"\",\"\",getAddress(Meetings!D22))","v":""},{"$f":"IF(Meetings!E22=\"\",\"\",getAddress(Meetings!E22))","v":""},{"$f":"IF(Meetings!F22=\"\",\"\",getAddress(Meetings!F22))","v":""},{"$f":"IF(Meetings!G22=\"\",\"\",getAddress(Meetings!G22))","v":""},{"$f":"IF(Meetings!H22=\"\",\"\",getAddress(Meetings!H22))","v":""},{"$f":"IF(Meetings!I22=\"\",\"\",getAddress(Meetings!I22))","v":""},{"$f":"IF(Meetings!J22=\"\",\"\",getAddress(Meetings!J22))","v":""},{"$f":"IF(Meetings!K22=\"\",\"\",getAddress(Meetings!K22))","v":""},{"$f":"IF(Meetings!L22=\"\",\"\",getAddress(Meetings!L22))","v":""},{"$f":"IF(Meetings!M22=\"\",\"\",getAddress(Meetings!M22))","v":""},{"$f":"IF(Meetings!N22=\"\",\"\",getAddress(Meetings!N22))","v":""},{"$f":"IF(Meetings!O22=\"\",\"\",getAddress(Meetings!O22))","v":""},null,{"$f":"COUNTA(Meetings!D22:'Meetings'!O22)","v":0},{"$f":"IF(W21<>\"\",CLEAN(TRIM(Meetings!W21)),\"\")","v":"Greyville"},{"$f":"IF(Meetings!W21=\"\",\"\",getAddress(Meetings!W21))","v":"http://www.racingandsports.com.au/form-guide/meeting.asp?meeting=16374"},"16374"]
[{"$f":"IF(Race!N20<>\"\",(CLEAN(TRIM(Race!C20))),\"\")","v":"WINGEN WIN"},{"$f":"IF(A22<>\"\",Race!N20,\"\")","v":95},{"$f":"IF(A22<>\"\",Race!I20,\"\")","v":11},null,null,"",{"$f":"IF(Meetings!B23=\"\",\"\",Meetings!B23)","v":""},{"$f":"IF(Meetings!D23=\"\",\"\",getAddress(Meetings!D23))","v":""},{"$f":"IF(Meetings!E23=\"\",\"\",getAddress(Meetings!E23))","v":""},{"$f":"IF(Meetings!F23=\"\",\"\",getAddress(Meetings!F23))","v":""},{"$f":"IF(Meetings!G23=\"\",\"\",getAddress(Meetings!G23))","v":""},{"$f":"IF(Meetings!H23=\"\",\"\",getAddress(Meetings!H23))","v":""},{"$f":"IF(Meetings!I23=\"\",\"\",getAddress(Meetings!I23))","v":""},{"$f":"IF(Meetings!J23=\"\",\"\",getAddress(Meetings!J23))","v":""},{"$f":"IF(Meetings!K23=\"\",\"\",getAddress(Meetings!K23))","v":""},{"$f":"IF(Meetings!L23=\"\",\"\",getAddress(Meetings!L23))","v":""},{"$f":"IF(Meetings!M23=\"\",\"\",getAddress(Meetings!M23))","v":""},{"$f":"IF(Meetings!N23=\"\",\"\",getAddress(Meetings!N23))","v":""},{"$f":"IF(Meetings!O23=\"\",\"\",getAddress(Meetings!O23))","v":""},null,{"$f":"COUNTA(Meetings!D23:'Meetings'!O23)","v":0},{"$f":"IF(W22<>\"\",CLEAN(TRIM(Meetings!W22)),\"\")","v":""},{"$f":"IF(Meetings!W22=\"\",\"\",getAddress(Meetings!W22))","v":""},""]
[{"$f":"IF(Race!N21<>\"\",(CLEAN(TRIM(Race!C21))),\"\")","v":"RIPTHIS"},{"$f":"IF(A23<>\"\",Race!N21,\"\")","v":94},{"$f":"IF(A23<>\"\",Race!I21,\"\")","v":5},null,null,"",{"$f":"IF(Meetings!B24=\"\",\"\",Meetings!B24)","v":""},{"$f":"IF(Meetings!D24=\"\",\"\",getAddress(Meetings!D24))","v":""},{"$f":"IF(Meetings!E24=\"\",\"\",getAddress(Meetings!E24))","v":""},{"$f":"IF(Meetings!F24=\"\",\"\",getAddress(Meetings!F24))","v":""},{"$f":"IF(Meetings!G24=\"\",\"\",getAddress(Meetings!G24))","v":""},{"$f":"IF(Meetings!H24=\"\",\"\",getAddress(Meetings!H24))","v":""},{"$f":"IF(Meetings!I24=\"\",\"\",getAddress(Meetings!I24))","v":""},{"$f":"IF(Meetings!J24=\"\",\"\",getAddress(Meetings!J24))","v":""},{"$f":"IF(Meetings!K24=\"\",\"\",getAddress(Meetings!K24))","v":""},{"$f":"IF(Meetings!L24=\"\",\"\",getAddress(Meetings!L24))","v":""},{"$f":"IF(Meetings!M24=\"\",\"\",getAddress(Meetings!M24))","v":""},{"$f":"IF(Meetings!N24=\"\",\"\",getAddress(Meetings!N24))","v":""},{"$f":"IF(Meetings!O24=\"\",\"\",getAddress(Meetings!O24))","v":""},null,{"$f":"COUNTA(Meetings!D24:'Meetings'!O24)","v":0},{"$f":"IF(W23<>\"\",CLEAN(TRIM(Meetings!W23)),\"\")","v":""},{"$f":"IF(Meetings!W23=\"\",\"\",getAddress(Meetings!W23))","v":""},""]
[{"$f":"IF(Race!N22<>\"\",(CLEAN(TRIM(Race!C22))),\"\")","v":"TYPHOON INDY"},{"$f":"IF(A24<>\"\",Race!N22,\"\")","v":91},{"$f":"IF(A24<>\"\",Race!I22,\"\")","v":7},null,null,"",{"$f":"IF(Meetings!B25=\"\",\"\",Meetings!B25)","v":""},{"$f":"IF(Meetings!D25=\"\",\"\",getAddress(Meetings!D25))","v":""},{"$f":"IF(Meetings!E25=\"\",\"\",getAddress(Meetings!E25))","v":""},{"$f":"IF(Meetings!F25=\"\",\"\",getAddress(Meetings!F25))","v":""},{"$f":"IF(Meetings!G25=\"\",\"\",getAddress(Meetings!G25))","v":""},{"$f":"IF(Meetings!H25=\"\",\"\",getAddress(Meetings!H25))","v":""},{"$f":"IF(Meetings!I25=\"\",\"\",getAddress(Meetings!I25))","v":""},{"$f":"IF(Meetings!J25=\"\",\"\",getAddress(Meetings!J25))","v":""},{"$f":"IF(Meetings!K25=\"\",\"\",getAddress(Meetings!K25))","v":""},{"$f":"IF(Meetings!L25=\"\",\"\",getAddress(Meetings!L25))","v":""},{"$f":"IF(Meetings!M25=\"\",\"\",getAddress(Meetings!M25))","v":""},{"$f":"IF(Meetings!N25=\"\",\"\",getAddress(Meetings!N25))","v":""},{"$f":"IF(Meetings!O25=\"\",\"\",getAddress(Meetings!O25))","v":""},null,{"$f":"COUNTA(Meetings!D25:'Meetings'!O25)","v":0},{"$f":"IF(W24<>\"\",CLEAN(TRIM(Meetings!W24)),\"\")","v":""},{"$f":"IF(Meetings!W24=\"\",\"\",getAddress(Meetings!W24))","v":""},""]
[{"$f":"IF(Race!N23<>\"\",(CLEAN(TRIM(Race!C23))),\"\")","v":"GLENARVY"},{"$f":"IF(A25<>\"\",Race!N23,\"\")","v":93},{"$f":"IF(A25<>\"\",Race!I23,\"\")","v":18},null,null,"",{"$f":"IF(Meetings!B26=\"\",\"\",Meetings!B26)","v":""},{"$f":"IF(Meetings!D26=\"\",\"\",getAddress(Meetings!D26))","v":""},{"$f":"IF(Meetings!E26=\"\",\"\",getAddress(Meetings!E26))","v":""},{"$f":"IF(Meetings!F26=\"\",\"\",getAddress(Meetings!F26))","v":""},{"$f":"IF(Meetings!G26=\"\",\"\",getAddress(Meetings!G26))","v":""},{"$f":"IF(Meetings!H26=\"\",\"\",getAddress(Meetings!H26))","v":""},{"$f":"IF(Meetings!I26=\"\",\"\",getAddress(Meetings!I26))","v":""},{"$f":"IF(Meetings!J26=\"\",\"\",getAddress(Meetings!J26))","v":""},{"$f":"IF(Meetings!K26=\"\",\"\",getAddress(Meetings!K26))","v":""},{"$f":"IF(Meetings!L26=\"\",\"\",getAddress(Meetings!L26))","v":""},{"$f":"IF(Meetings!M26=\"\",\"\",getAddress(Meetings!M26))","v":""},{"$f":"IF(Meetings!N26=\"\",\"\",getAddress(Meetings!N26))","v":""},{"$f":"IF(Meetings!O26=\"\",\"\",getAddress(Meetings!O26))","v":""},null,{"$f":"COUNTA(Meetings!D26:'Meetings'!O26)","v":0},{"$f":"IF(W25<>\"\",CLEAN(TRIM(Meetings!W25)),\"\")","v":""},{"$f":"IF(Meetings!W25=\"\",\"\",getAddress(Meetings!W25))","v":""},""]
[{"$f":"IF(Race!N24<>\"\",(CLEAN(TRIM(Race!C24))),\"\")","v":"CLOUDCRAFT"},{"$f":"IF(A26<>\"\",Race!N24,\"\")","v":89},{"$f":"IF(A26<>\"\",Race!I24,\"\")","v":17},null,null,"",{"$f":"IF(Meetings!B27=\"\",\"\",Meetings!B27)","v":""},{"$f":"IF(Meetings!D27=\"\",\"\",getAddress(Meetings!D27))","v":""},{"$f":"IF(Meetings!E27=\"\",\"\",getAddress(Meetings!E27))","v":""},{"$f":"IF(Meetings!F27=\"\",\"\",getAddress(Meetings!F27))","v":""},{"$f":"IF(Meetings!G27=\"\",\"\",getAddress(Meetings!G27))","v":""},{"$f":"IF(Meetings!H27=\"\",\"\",getAddress(Meetings!H27))","v":""},{"$f":"IF(Meetings!I27=\"\",\"\",getAddress(Meetings!I27))","v":""},{"$f":"IF(Meetings!J27=\"\",\"\",getAddress(Meetings!J27))","v":""},{"$f":"IF(Meetings!K27=\"\",\"\",getAddress(Meetings!K27))","v":""},{"$f":"IF(Meetings!L27=\"\",\"\",getAddress(Meetings!L27))","v":""},{"$f":"IF(Meetings!M27=\"\",\"\",getAddress(Meetings!M27))","v":""},{"$f":"IF(Meetings!N27=\"\",\"\",getAddress(Meetings!N27))","v":""},{"$f":"IF(Meetings!O27=\"\",\"\",getAddress(Meetings!O27))","v":""},null,{"$f":"COUNTA(Meetings!D27:'Meetings'!O27)","v":0},{"$f":"IF(W26<>\"\",CLEAN(TRIM(Meetings!W26)),\"\")","v":""},{"$f":"IF(Meetings!W26=\"\",\"\",getAddress(Meetings!W26))","v":""},""]
[{"$f":"IF(Race!N25<>\"\",(CLEAN(TRIM(Race!C25))),\"\")","v":""},{"$f":"IF(A27<>\"\",Race!N25,\"\")","v":""},{"$f":"IF(A27<>\"\",Race!I25,\"\")","v":""},null,null,"",{"$f":"IF(Meetings!B28=\"\",\"\",Meetings!B28)","v":""},{"$f":"IF(Meetings!D28=\"\",\"\",getAddress(Meetings!D28))","v":""},{"$f":"IF(Meetings!E28=\"\",\"\",getAddress(Meetings!E28))","v":""},{"$f":"IF(Meetings!F28=\"\",\"\",getAddress(Meetings!F28))","v":""},{"$f":"IF(Meetings!G28=\"\",\"\",getAddress(Meetings!G28))","v":""},{"$f":"IF(Meetings!H28=\"\",\"\",getAddress(Meetings!H28))","v":""},{"$f":"IF(Meetings!I28=\"\",\"\",getAddress(Meetings!I28))","v":""},{"$f":"IF(Meetings!J28=\"\",\"\",getAddress(Meetings!J28))","v":""},{"$f":"IF(Meetings!K28=\"\",\"\",getAddress(Meetings!K28))","v":""},{"$f":"IF(Meetings!L28=\"\",\"\",getAddress(Meetings!L28))","v":""},{"$f":"IF(Meetings!M28=\"\",\"\",getAddress(Meetings!M28))","v":""},{"$f":"IF(Meetings!N28=\"\",\"\",getAddress(Meetings!N28))","v":""},{"$f":"IF(Meetings!O28=\"\",\"\",getAddress(Meetings!O28))","v":""},null,{"$f":"COUNTA(Meetings!D28:'Meetings'!O28)","v":0},{"$f":"IF(W27<>\"\",CLEAN(TRIM(Meetings!W27)),\"\")","v":""},{"$f":"IF(Meetings!W27=\"\",\"\",getAddress(Meetings!W27))","v":""},""]
[{"$f":"IF(Race!N26<>\"\",(CLEAN(TRIM(Race!C26))),\"\")","v":""},{"$f":"IF(A28<>\"\",Race!N26,\"\")","v":""},{"$f":"IF(A28<>\"\",Race!I26,\"\")","v":""},null,null,"",{"$f":"IF(Meetings!B29=\"\",\"\",Meetings!B29)","v":""},{"$f":"IF(Meetings!D29=\"\",\"\",getAddress(Meetings!D29))","v":""},{"$f":"IF(Meetings!E29=\"\",\"\",getAddress(Meetings!E29))","v":""},{"$f":"IF(Meetings!F29=\"\",\"\",getAddress(Meetings!F29))","v":""},{"$f":"IF(Meetings!G29=\"\",\"\",getAddress(Meetings!G29))","v":""},{"$f":"IF(Meetings!H29=\"\",\"\",getAddress(Meetings!H29))","v":""},{"$f":"IF(Meetings!I29=\"\",\"\",getAddress(Meetings!I29))","v":""},{"$f":"IF(Meetings!J29=\"\",\"\",getAddress(Meetings!J29))","v":""},{"$f":"IF(Meetings!K29=\"\",\"\",getAddress(Meetings!K29))","v":""},{"$f":"IF(Meetings!L29=\"\",\"\",getAddress(Meetings!L29))","v":""},{"$f":"IF(Meetings!M29=\"\",\"\",getAddress(Meetings!M29))","v":""},{"$f":"IF(Meetings!N29=\"\",\"\",getAddress(Meetings!N29))","v":""},{"$f":"IF(Meetings!O29=\"\",\"\",getAddress(Meetings!O29))","v":""},null,{"$f":"COUNTA(Meetings!D29:'Meetings'!O29)","v":0},{"$f":"IF(W28<>\"\",CLEAN(TRIM(Meetings!W28)),\"\")","v":"Balaklava"},{"$f":"IF(Meetings!W28=\"\",\"\",getAddress(Meetings!W28))","v":"http://www.racingandsports.com.au/form-guide/meeting.asp?meeting=16367"},"16367"]
[{"$f":"IF(Race!N27<>\"\",(CLEAN(TRIM(Race!C27))),\"\")","v":""},{"$f":"IF(A29<>\"\",Race!N27,\"\")","v":""},{"$f":"IF(A29<>\"\",Race!I27,\"\")","v":""},null,null,"",{"$f":"IF(Meetings!B30=\"\",\"\",Meetings!B30)","v":""},{"$f":"IF(Meetings!D30=\"\",\"\",getAddress(Meetings!D30))","v":""},{"$f":"IF(Meetings!E30=\"\",\"\",getAddress(Meetings!E30))","v":""},{"$f":"IF(Meetings!F30=\"\",\"\",getAddress(Meetings!F30))","v":""},{"$f":"IF(Meetings!G30=\"\",\"\",getAddress(Meetings!G30))","v":""},{"$f":"IF(Meetings!H30=\"\",\"\",getAddress(Meetings!H30))","v":""},{"$f":"IF(Meetings!I30=\"\",\"\",getAddress(Meetings!I30))","v":""},{"$f":"IF(Meetings!J30=\"\",\"\",getAddress(Meetings!J30))","v":""},{"$f":"IF(Meetings!K30=\"\",\"\",getAddress(Meetings!K30))","v":""},{"$f":"IF(Meetings!L30=\"\",\"\",getAddress(Meetings!L30))","v":""},{"$f":"IF(Meetings!M30=\"\",\"\",getAddress(Meetings!M30))","v":""},{"$f":"IF(Meetings!N30=\"\",\"\",getAddress(Meetings!N30))","v":""},{"$f":"IF(Meetings!O30=\"\",\"\",getAddress(Meetings!O30))","v":""},null,{"$f":"COUNTA(Meetings!D30:'Meetings'!O30)","v":0},{"$f":"IF(W29<>\"\",CLEAN(TRIM(Meetings!W29)),\"\")","v":"Bunbury"},{"$f":"IF(Meetings!W29=\"\",\"\",getAddress(Meetings!W29))","v":"http://www.racingandsports.com.au/form-guide/meeting.asp?meeting=16368"},"16368"]
[{"$f":"IF(Race!N28<>\"\",(CLEAN(TRIM(Race!C28))),\"\")","v":""},{"$f":"IF(A30<>\"\",Race!N28,\"\")","v":""},{"$f":"IF(A30<>\"\",Race!I28,\"\")","v":""},null,null,"",{"$f":"IF(Meetings!B31=\"\",\"\",Meetings!B31)","v":""},{"$f":"IF(Meetings!D31=\"\",\"\",getAddress(Meetings!D31))","v":""},{"$f":"IF(Meetings!E31=\"\",\"\",getAddress(Meetings!E31))","v":""},{"$f":"IF(Meetings!F31=\"\",\"\",getAddress(Meetings!F31))","v":""},{"$f":"IF(Meetings!G31=\"\",\"\",getAddress(Meetings!G31))","v":""},{"$f":"IF(Meetings!H31=\"\",\"\",getAddress(Meetings!H31))","v":""},{"$f":"IF(Meetings!I31=\"\",\"\",getAddress(Meetings!I31))","v":""},{"$f":"IF(Meetings!J31=\"\",\"\",getAddress(Meetings!J31))","v":""},{"$f":"IF(Meetings!K31=\"\",\"\",getAddress(Meetings!K31))","v":""},{"$f":"IF(Meetings!L31=\"\",\"\",getAddress(Meetings!L31))","v":""},{"$f":"IF(Meetings!M31=\"\",\"\",getAddress(Meetings!M31))","v":""},{"$f":"IF(Meetings!N31=\"\",\"\",getAddress(Meetings!N31))","v":""},{"$f":"IF(Meetings!O31=\"\",\"\",getAddress(Meetings!O31))","v":""},null,{"$f":"COUNTA(Meetings!D31:'Meetings'!O31)","v":0},{"$f":"IF(W30<>\"\",CLEAN(TRIM(Meetings!W30)),\"\")","v":"Doomben"},{"$f":"IF(Meetings!W30=\"\",\"\",getAddress(Meetings!W30))","v":"http://www.racingandsports.com.au/form-guide/meeting.asp?meeting=16369"},"16369"]
[{"$f":"IF(Race!N29<>\"\",(CLEAN(TRIM(Race!C29))),\"\")","v":""},{"$f":"IF(A31<>\"\",Race!N29,\"\")","v":""},{"$f":"IF(A31<>\"\",Race!I29,\"\")","v":""},null,null,"",{"$f":"IF(Meetings!B32=\"\",\"\",Meetings!B32)","v":""},{"$f":"IF(Meetings!D32=\"\",\"\",getAddress(Meetings!D32))","v":""},{"$f":"IF(Meetings!E32=\"\",\"\",getAddress(Meetings!E32))","v":""},{"$f":"IF(Meetings!F32=\"\",\"\",getAddress(Meetings!F32))","v":""},{"$f":"IF(Meetings!G32=\"\",\"\",getAddress(Meetings!G32))","v":""},{"$f":"IF(Meetings!H32=\"\",\"\",getAddress(Meetings!H32))","v":""},{"$f":"IF(Meetings!I32=\"\",\"\",getAddress(Meetings!I32))","v":""},{"$f":"IF(Meetings!J32=\"\",\"\",getAddress(Meetings!J32))","v":""},{"$f":"IF(Meetings!K32=\"\",\"\",getAddress(Meetings!K32))","v":""},{"$f":"IF(Meetings!L32=\"\",\"\",getAddress(Meetings!L32))","v":""},{"$f":"IF(Meetings!M32=\"\",\"\",getAddress(Meetings!M32))","v":""},{"$f":"IF(Meetings!N32=\"\",\"\",getAddress(Meetings!N32))","v":""},{"$f":"IF(Meetings!O32=\"\",\"\",getAddress(Meetings!O32))","v":""},null,{"$f":"COUNTA(Meetings!D32:'Meetings'!O32)","v":0},{"$f":"IF(W31<>\"\",CLEAN(TRIM(Meetings!W31)),\"\")","v":"Randwick-Kensington"},{"$f":"IF(Meetings!W31=\"\",\"\",getAddress(Meetings!W31))","v":"http://www.racingandsports.com.au/form-guide/meeting.asp?meeting=16370"},"16370"]
[{"$f":"IF(Race!N30<>\"\",(CLEAN(TRIM(Race!C30))),\"\")","v":""},{"$f":"IF(A32<>\"\",Race!N30,\"\")","v":""},{"$f":"IF(A32<>\"\",Race!I30,\"\")","v":""},null,null,"",{"$f":"IF(Meetings!B33=\"\",\"\",Meetings!B33)","v":""},{"$f":"IF(Meetings!D33=\"\",\"\",getAddress(Meetings!D33))","v":""},{"$f":"IF(Meetings!E33=\"\",\"\",getAddress(Meetings!E33))","v":""},{"$f":"IF(Meetings!F33=\"\",\"\",getAddress(Meetings!F33))","v":""},{"$f":"IF(Meetings!G33=\"\",\"\",getAddress(Meetings!G33))","v":""},{"$f":"IF(Meetings!H33=\"\",\"\",getAddress(Meetings!H33))","v":""},{"$f":"IF(Meetings!I33=\"\",\"\",getAddress(Meetings!I33))","v":""},{"$f":"IF(Meetings!J33=\"\",\"\",getAddress(Meetings!J33))","v":""},{"$f":"IF(Meetings!K33=\"\",\"\",getAddress(Meetings!K33))","v":""},{"$f":"IF(Meetings!L33=\"\",\"\",getAddress(Meetings!L33))","v":""},{"$f":"IF(Meetings!M33=\"\",\"\",getAddress(Meetings!M33))","v":""},{"$f":"IF(Meetings!N33=\"\",\"\",getAddress(Meetings!N33))","v":""},{"$f":"IF(Meetings!O33=\"\",\"\",getAddress(Meetings!O33))","v":""},null,{"$f":"COUNTA(Meetings!D33:'Meetings'!O33)","v":0},{"$f":"IF(W32<>\"\",CLEAN(TRIM(Meetings!W32)),\"\")","v":"Sandown-Lakeside"},{"$f":"IF(Meetings!W32=\"\",\"\",getAddress(Meetings!W32))","v":"http://www.racingandsports.com.au/form-guide/meeting.asp?meeting=16371"},"16371"]
[{"$f":"IF(Race!N31<>\"\",(CLEAN(TRIM(Race!C31))),\"\")","v":""},{"$f":"IF(A33<>\"\",Race!N31,\"\")","v":""},{"$f":"IF(A33<>\"\",Race!I31,\"\")","v":""},null,null,"",{"$f":"IF(Meetings!B34=\"\",\"\",Meetings!B34)","v":""},{"$f":"IF(Meetings!D34=\"\",\"\",getAddress(Meetings!D34))","v":""},{"$f":"IF(Meetings!E34=\"\",\"\",getAddress(Meetings!E34))","v":""},{"$f":"IF(Meetings!F34=\"\",\"\",getAddress(Meetings!F34))","v":""},{"$f":"IF(Meetings!G34=\"\",\"\",getAddress(Meetings!G34))","v":""},{"$f":"IF(Meetings!H34=\"\",\"\",getAddress(Meetings!H34))","v":""},{"$f":"IF(Meetings!I34=\"\",\"\",getAddress(Meetings!I34))","v":""},{"$f":"IF(Meetings!J34=\"\",\"\",getAddress(Meetings!J34))","v":""},{"$f":"IF(Meetings!K34=\"\",\"\",getAddress(Meetings!K34))","v":""},{"$f":"IF(Meetings!L34=\"\",\"\",getAddress(Meetings!L34))","v":""},{"$f":"IF(Meetings!M34=\"\",\"\",getAddress(Meetings!M34))","v":""},{"$f":"IF(Meetings!N34=\"\",\"\",getAddress(Meetings!N34))","v":""},{"$f":"IF(Meetings!O34=\"\",\"\",getAddress(Meetings!O34))","v":""},null,{"$f":"COUNTA(Meetings!D34:'Meetings'!O34)","v":0},{"$f":"IF(W33<>\"\",CLEAN(TRIM(Meetings!W33)),\"\")","v":""},{"$f":"IF(Meetings!W33=\"\",\"\",getAddress(Meetings!W33))","v":""},""]
[{"$f":"IF(Race!N32<>\"\",(CLEAN(TRIM(Race!C32))),\"\")","v":""},{"$f":"IF(A34<>\"\",Race!N32,\"\")","v":""},{"$f":"IF(A34<>\"\",Race!I32,\"\")","v":""},{"$nulls":4},{"$f":"IF(Meetings!D36=\"\",\"\",getAddress(Meetings!D36))","v":""},{"$f":"IF(Meetings!E36=\"\",\"\",getAddress(Meetings!E36))","v":""},{"$f":"IF(Meetings!F36=\"\",\"\",getAddress(Meetings!F36))","v":""},{"$f":"IF(Meetings!G36=\"\",\"\",getAddress(Meetings!G36))","v":""},{"$f":"IF(Meetings!H36=\"\",\"\",getAddress(Meetings!H36))","v":""},{"$f":"IF(Meetings!I36=\"\",\"\",getAddress(Meetings!I36))","v":""},{"$f":"IF(Meetings!J36=\"\",\"\",getAddress(Meetings!J36))","v":""},{"$f":"IF(Meetings!K36=\"\",\"\",getAddress(Meetings!K36))","v":""},{"$f":"IF(Meetings!L36=\"\",\"\",getAddress(Meetings!L36))","v":""},{"$f":"IF(Meetings!M36=\"\",\"\",getAddress(Meetings!M36))","v":""},null,null,null,{"$f":"COUNTA(Meetings!D35:'Meetings'!O35)","v":0},{"$f":"IF(W34<>\"\",CLEAN(TRIM(Meetings!W34)),\"\")","v":""},{"$f":"IF(Meetings!W34=\"\",\"\",getAddress(Meetings!W34))","v":""},""]
[{"$f":"IF(Race!N33<>\"\",(CLEAN(TRIM(Race!C33))),\"\")","v":""},{"$f":"IF(A35<>\"\",Race!N33,\"\")","v":""},{"$f":"IF(A35<>\"\",Race!I33,\"\")","v":""},{"$nulls":4},{"$f":"IF(Meetings!D37=\"\",\"\",getAddress(Meetings!D37))","v":""},{"$f":"IF(Meetings!E37=\"\",\"\",getAddress(Meetings!E37))","v":""},{"$f":"IF(Meetings!F37=\"\",\"\",getAddress(Meetings!F37))","v":""},{"$f":"IF(Meetings!G37=\"\",\"\",getAddress(Meetings!G37))","v":""},{"$f":"IF(Meetings!H37=\"\",\"\",getAddress(Meetings!H37))","v":""},{"$f":"IF(Meetings!I37=\"\",\"\",getAddress(Meetings!I37))","v":""},{"$f":"IF(Meetings!J37=\"\",\"\",getAddress(Meetings!J37))","v":""},{"$f":"IF(Meetings!K37=\"\",\"\",getAddress(Meetings!K37))","v":""},{"$f":"IF(Meetings!L37=\"\",\"\",getAddress(Meetings!L37))","v":""},{"$f":"IF(Meetings!M37=\"\",\"\",getAddress(Meetings!M37))","v":""},{"$nulls":4},{"$f":"IF(W35<>\"\",CLEAN(TRIM(Meetings!W35)),\"\")","v":"Happy Valley"},{"$f":"IF(Meetings!W35=\"\",\"\",getAddress(Meetings!W35))","v":"http://www.racingandsports.com.au/form-guide/meeting.asp?meeting=16376"},"16376"]
[{"$f":"IF(Race!N34<>\"\",(CLEAN(TRIM(Race!C34))),\"\")","v":""},{"$f":"IF(A36<>\"\",Race!N34,\"\")","v":""},{"$f":"IF(A36<>\"\",Race!I34,\"\")","v":""},{"$nulls":4},{"$f":"IF(Meetings!D38=\"\",\"\",getAddress(Meetings!D38))","v":""},{"$f":"IF(Meetings!E38=\"\",\"\",getAddress(Meetings!E38))","v":""},{"$f":"IF(Meetings!F38=\"\",\"\",getAddress(Meetings!F38))","v":""},{"$f":"IF(Meetings!G38=\"\",\"\",getAddress(Meetings!G38))","v":""},{"$f":"IF(Meetings!H38=\"\",\"\",getAddress(Meetings!H38))","v":""},{"$f":"IF(Meetings!I38=\"\",\"\",getAddress(Meetings!I38))","v":""},{"$f":"IF(Meetings!J38=\"\",\"\",getAddress(Meetings!J38))","v":""},{"$f":"IF(Meetings!K38=\"\",\"\",getAddress(Meetings!K38))","v":""},{"$f":"IF(Meetings!L38=\"\",\"\",getAddress(Meetings!L38))","v":""},{"$f":"IF(Meetings!M38=\"\",\"\",getAddress(Meetings!M38))","v":""},{"$nulls":4},{"$f":"IF(W36<>\"\",CLEAN(TRIM(Meetings!W36)),\"\")","v":""},{"$f":"IF(Meetings!W36=\"\",\"\",getAddress(Meetings!W36))","v":""},""]
[null,null,{"$f":"IF(A37<>\"\",Race!I35,\"\")","v":""},{"$nulls":4},{"$f":"IF(Meetings!D39=\"\",\"\",getAddress(Meetings!D39))","v":""},{"$f":"IF(Meetings!E39=\"\",\"\",getAddress(Meetings!E39))","v":""},{"$f":"IF(Meetings!F39=\"\",\"\",getAddress(Meetings!F39))","v":""},{"$f":"IF(Meetings!G39=\"\",\"\",getAddress(Meetings!G39))","v":""},{"$f":"IF(Meetings!H39=\"\",\"\",getAddress(Meetings!H39))","v":""},{"$f":"IF(Meetings!I39=\"\",\"\",getAddress(Meetings!I39))","v":""},{"$f":"IF(Meetings!J39=\"\",\"\",getAddress(Meetings!J39))","v":""},{"$f":"IF(Meetings!K39=\"\",\"\",getAddress(Meetings!K39))","v":""},{"$f":"IF(Meetings!L39=\"\",\"\",getAddress(Meetings!L39))","v":""},{"$f":"IF(Meetings!M39=\"\",\"\",getAddress(Meetings!M39))","v":""},{"$nulls":4},{"$f":"IF(W37<>\"\",CLEAN(TRIM(Meetings!W37)),\"\")","v":""},{"$f":"IF(Meetings!W37=\"\",\"\",getAddress(Meetings!W37))","v":""},""]
[null,null,{"$f":"IF(A38<>\"\",Race!I36,\"\")","v":""},{"$nulls":4},{"$f":"IF(Meetings!D40=\"\",\"\",getAddress(Meetings!D40))","v":""},{"$f":"IF(Meetings!E40=\"\",\"\",getAddress(Meetings!E40))","v":""},{"$f":"IF(Meetings!F40=\"\",\"\",getAddress(Meetings!F40))","v":""},{"$f":"IF(Meetings!G40=\"\",\"\",getAddress(Meetings!G40))","v":""},{"$f":"IF(Meetings!H40=\"\",\"\",getAddress(Meetings!H40))","v":""},{"$f":"IF(Meetings!I40=\"\",\"\",getAddress(Meetings!I40))","v":""},{"$f":"IF(Meetings!J40=\"\",\"\",getAddress(Meetings!J40))","v":""},{"$f":"IF(Meetings!K40=\"\",\"\",getAddress(Meetings!K40))","v":""},{"$f":"IF(Meetings!L40=\"\",\"\",getAddress(Meetings!L40))","v":""},{"$f":"IF(Meetings!M40=\"\",\"\",getAddress(Meetings!M40))","v":""},{"$nulls":4},{"$f":"IF(W38<>\"\",CLEAN(TRIM(Meetings!W38)),\"\")","v":"Paeroa"},{"$f":"IF(Meetings!W38=\"\",\"\",getAddress(Meetings!W38))","v":"http://www.racingandsports.com.au/form-guide/meeting.asp?meeting=16363"},"16363"]
[null,null,{"$f":"IF(A39<>\"\",Race!I37,\"\")","v":""},{"$nulls":4},{"$f":"IF(Meetings!D41=\"\",\"\",getAddress(Meetings!D41))","v":""},{"$f":"IF(Meetings!E41=\"\",\"\",getAddress(Meetings!E41))","v":""},{"$f":"IF(Meetings!F41=\"\",\"\",getAddress(Meetings!F41))","v":""},{"$f":"IF(Meetings!G41=\"\",\"\",getAddress(Meetings!G41))","v":""},{"$f":"IF(Meetings!H41=\"\",\"\",getAddress(Meetings!H41))","v":""},{"$f":"IF(Meetings!I41=\"\",\"\",getAddress(Meetings!I41))","v":""},{"$f":"IF(Meetings!J41=\"\",\"\",getAddress(Meetings!J41))","v":""},{"$f":"IF(Meetings!K41=\"\",\"\",getAddress(Meetings!K41))","v":""},{"$f":"IF(Meetings!L41=\"\",\"\",getAddress(Meetings!L41))","v":""},{"$f":"IF(Meetings!M41=\"\",\"\",getAddress(Meetings!M41))","v":""},{"$nulls":4},{"$f":"IF(W39<>\"\",CLEAN(TRIM(Meetings!W39)),\"\")","v":""},{"$f":"IF(Meetings!W39=\"\",\"\",getAddress(Meetings!W39))","v":""},""]
[null,null,{"$f":"IF(A40<>\"\",Race!I38,\"\")","v":""},{"$nulls":4},{"$f":"IF(Meetings!D42=\"\",\"\",getAddress(Meetings!D42))","v":""},{"$f":"IF(Meetings!E42=\"\",\"\",getAddress(Meetings!E42))","v":""},{"$f":"IF(Meetings!F42=\"\",\"\",getAddress(Meetings!F42))","v":""},{"$f":"IF(Meetings!G42=\"\",\"\",getAddress(Meetings!G42))","v":""},{"$f":"IF(Meetings!H42=\"\",\"\",getAddress(Meetings!H42))","v":""},{"$f":"IF(Meetings!I42=\"\",\"\",getAddress(Meetings!I42))","v":""},{"$f":"IF(Meetings!J42=\"\",\"\",getAddress(Meetings!J42))","v":""},{"$f":"IF(Meetings!K42=\"\",\"\",getAddress(Meetings!K42))","v":""},{"$f":"IF(Meetings!L42=\"\",\"\",getAddress(Meetings!L42))","v":""},{"$f":"IF(Meetings!M42=\"\",\"\",getAddress(Meetings!M42))","v":""},{"$nulls":4},{"$f":"IF(W40<>\"\",CLEAN(TRIM(Meetings!W40)),\"\")","v":""},{"$f":"IF(Meetings!W40=\"\",\"\",getAddress(Meetings!W40))","v":""},""]
[null,null,{"$f":"IF(A41<>\"\",Race!I39,\"\")","v":""},{"$nulls":4},{"$f":"IF(Meetings!D43=\"\",\"\",getAddress(Meetings!D43))","v":""},{"$f":"IF(Meetings!E43=\"\",\"\",getAddress(Meetings!E43))","v":""},{"$f":"IF(Meetings!F43=\"\",\"\",getAddress(Meetings!F43))","v":""},{"$f":"IF(Meetings!G43=\"\",\"\",getAddress(Meetings!G43))","v":""},{"$f":"IF(Meetings!H43=\"\",\"\",getAddress(Meetings!H43))","v":""},{"$f":"IF(Meetings!I43=\"\",\"\",getAddress(Meetings!I43))","v":""},{"$f":"IF(Meetings!J43=\"\",\"\",getAddress(Meetings!J43))","v":""},{"$f":"IF(Meetings!K43=\"\",\"\",getAddress(Meetings!K43))","v":""},{"$f":"IF(Meetings!L43=\"\",\"\",getAddress(Meetings!L43))","v":""},{"$f":"IF(Meetings!M43=\"\",\"\",getAddress(Meetings!M43))","v":""}]
[null,null,{"$f":"IF(A42<>\"\",Race!I40,\"\")","v":""},{"$nulls":4},{"$f":"IF(Meetings!D44=\"\",\"\",getAddress(Meetings!D44))","v":""},{"$f":"IF(Meetings!E44=\"\",\"\",getAddress(Meetings!E44))","v":""},{"$f":"IF(Meetings!F44=\"\",\"\",getAddress(Meetings!F44))","v":""},{"$f":"IF(Meetings!G44=\"\",\"\",getAddress(Meetings!G44))","v":""},{"$f":"IF(Meetings!H44=\"\",\"\",getAddress(Meetings!H44))","v":""},{"$f":"IF(Meetings!I44=\"\",\"\",getAddress(Meetings!I44))","v":""},{"$f":"IF(Meetings!J44=\"\",\"\",getAddress(Meetings!J44))","v":""},{"$f":"IF(Meetings!K44=\"\",\"\",getAddress(Meetings!K44))","v":""},{"$f":"IF(Meetings!L44=\"\",\"\",getAddress(Meetings!L44))","v":""},{"$f":"IF(Meetings!M44=\"\",\"\",getAddress(Meetings!M44))","v":""}]
[null,null,{"$f":"IF(A43<>\"\",Race!I41,\"\")","v":""},{"$nulls":4},{"$f":"IF(Meetings!D45=\"\",\"\",getAddress(Meetings!D45))","v":""},{"$f":"IF(Meetings!E45=\"\",\"\",getAddress(Meetings!E45))","v":""},{"$f":"IF(Meetings!F45=\"\",\"\",getAddress(Meetings!F45))","v":""},{"$f":"IF(Meetings!G45=\"\",\"\",getAddress(Meetings!G45))","v":""},{"$f":"IF(Meetings!H45=\"\",\"\",getAddress(Meetings!H45))","v":""},{"$f":"IF(Meetings!I45=\"\",\"\",getAddress(Meetings!I45))","v":""},{"$f":"IF(Meetings!J45=\"\",\"\",getAddress(Meetings!J45))","v":""},{"$f":"IF(Meetings!K45=\"\",\"\",getAddress(Meetings!K45))","v":""},{"$f":"IF(Meetings!L45=\"\",\"\",getAddress(Meetings!L45))","v":""},{"$f":"IF(Meetings!M45=\"\",\"\",getAddress(Meetings!M45))","v":""}]
[null,null,{"$f":"IF(A44<>\"\",Race!I42,\"\")","v":""},{"$nulls":4},{"$f":"IF(Meetings!D46=\"\",\"\",getAddress(Meetings!D46))","v":""},{"$f":"IF(Meetings!E46=\"\",\"\",getAddress(Meetings!E46))","v":""},{"$f":"IF(Meetings!F46=\"\",\"\",getAddress(Meetings!F46))","v":""},{"$f":"IF(Meetings!G46=\"\",\"\",getAddress(Meetings!G46))","v":""},{"$f":"IF(Meetings!H46=\"\",\"\",getAddress(Meetings!H46))","v":""},{"$f":"IF(Meetings!I46=\"\",\"\",getAddress(Meetings!I46))","v":""},{"$f":"IF(Meetings!J46=\"\",\"\",getAddress(Meetings!J46))","v":""},{"$f":"IF(Meetings!K46=\"\",\"\",getAddress(Meetings!K46))","v":""},{"$f":"IF(Meetings!L46=\"\",\"\",getAddress(Meetings!L46))","v":""},{"$f":"IF(Meetings!M46=\"\",\"\",getAddress(Meetings!M46))","v":""}]
[null,null,{"$f":"IF(A45<>\"\",Race!I43,\"\")","v":""},{"$nulls":4},{"$f":"IF(Meetings!D47=\"\",\"\",getAddress(Meetings!D47))","v":""},{"$f":"IF(Meetings!E47=\"\",\"\",getAddress(Meetings!E47))","v":""},{"$f":"IF(Meetings!F47=\"\",\"\",getAddress(Meetings!F47))","v":""},{"$f":"IF(Meetings!G47=\"\",\"\",getAddress(Meetings!G47))","v":""},{"$f":"IF(Meetings!H47=\"\",\"\",getAddress(Meetings!H47))","v":""},{"$f":"IF(Meetings!I47=\"\",\"\",getAddress(Meetings!I47))","v":""},{"$f":"IF(Meetings!J47=\"\",\"\",getAddress(Meetings!J47))","v":""},{"$f":"IF(Meetings!K47=\"\",\"\",getAddress(Meetings!K47))","v":""},{"$f":"IF(Meetings!L47=\"\",\"\",getAddress(Meetings!L47))","v":""},{"$f":"IF(Meetings!M47=\"\",\"\",getAddress(Meetings!M47))","v":""}]

{"sheet":"Instructions","index":2,"n_rows":10,"n_cols":11,"rows_kept":10,"cut":false,"hidden":false,"merged":[]}
[]
[]
[]
[]
[null,"Instructions"]
[]
[null,"You need to get the race code from",null,null,null,"http://www.racingandsports.com.au/form-guide/",{"$nulls":4},"click on each venue and get the last set of numbers from the address bar."]
[null,"On the \"Neurals\" sheet press \"Start\" press \"OK\" for todays date or put in a date, there is a box on the right that has the days races, hightlight a race and press \"Select\"  put in race code then 1st and last race numbers for that venue then press the \"Import\" button,"]
[null,"the race will be imported, if the top Neurals selection is also the unitab top rated it will copy to the \"Selections\" sheet."]
[null,"Each race will cycle through for that meeting, when done change the meeting and the race numbers and press import again."]

{"sheet":"Meetings","index":3,"n_rows":115,"n_cols":41,"rows_kept":115,"cut":false,"hidden":false,"merged":[[0,19,97,19],[0,54,97,54],[98,20,98,53],[84,21,84,25],[86,20,86,21],[87,21,87,25],[43,20,43,25],[97,28,97,30],[88,20,92,27],[88,28,88,30],[89,28,89,30],[90,28,90,30],[91,28,91,30],[92,28,92,30],[93,20,97,27],[93,28,93,30],[113,20,113,53],[112,28,112,30],[103,20,107,27],[103,28,103,30],[104,28,104,30],[105,28,105,30],[106,28,106,30],[107,28,107,30],[108,20,112,27],[108,28,108,30],[100,26,100,28],[101,26,101,28],[102,26,102,28],[17,20,17,25],[18,21,18,25],[21,20,21,21],[22,21,22,25],[23,20,23,25],[83,26,83,28],[84,26,84,28],[85,26,85,28],[86,26,86,28],[87,26,87,28],[78,26,78,28],[79,26,79,28],[80,26,80,28],[81,26,81,28],[82,26,82,28],[73,26,73,28],[74,26,74,28],[75,26,75,28],[76,26,76,28],[77,26,77,28],[69,26,69,28],[70,26,70,28],[71,26,71,28],[72,26,72,28],[63,26,63,28],[64,26,64,28],[65,26,65,28],[66,26,66,28],[67,26,67,28],[60,26,60,28],[61,26,61,28],[62,26,62,28],[53,26,53,28],[54,26,54,28],[55,26,55,28],[56,26,56,28],[57,26,57,28],[68,26,68,28],[44,26,44,28],[45,26,45,28],[46,26,46,28],[101,20,101,21],[102,21,102,25],[29,26,30,26],[32,26,33,26],[41,26,42,26],[47,26,47,28],[48,26,48,28],[49,26,49,28],[50,26,50,28],[51,26,51,28],[52,26,52,28],[80,20,80,25],[81,21,81,25],[58,26,58,28],[59,26,59,28],[77,21,77,25],[60,20,60,25],[61,21,61,25],[63,20,63,25],[64,21,64,25],[66,20,66,25],[67,21,67,25],[69,20,69,25],[70,21,70,25],[72,20,72,21],[73,21,73,25],[74,20,74,25],[75,20,75,25],[44,20,44,25],[45,20,45,25],[46,20,46,25],[47,20,47,25],[48,20,48,25],[49,20,49,25],[50,21,50,25],[38,20,38,25],[39,21,39,25],[32,20,32,25],[33,21,33,25],[35,20,35,25],[36,21,36,25],[41,20,41,21],[42,21,42,25],[6,31,6,37],[9,20,9,25],[10,20,10,25],[11,20,11,25],[12,21,12,25],[2,32,4,32],[2,20,2,30],[3,20,3,30],[4,20,4,30],[5,20,5,30],[7,20,7,53],[8,20,8,53],[14,26,14,28],[15,26,15,28],[21,26,21,28],[22,26,22,28],[1,0,1,2],[0,20,0,30],[1,20,1,27],[1,28,1,30],[6,20,6,30],[25,20,25,25],[26,21,26,25],[23,26,23,28],[24,26,24,28],[25,0,25,2],[8,0,8,2],[15,0,15,2],[24,20,24,25],[76,20,76,25],[83,20,83,25]]}
[{"$nulls":20}," ",{"$nulls":10}," "," "," "]
["Races",null,null,1,2,3,4,5,6,7,8,9,10,11,12,{"$nulls":5}," ",{"$nulls":10}," ",null," "]
[null,"TOWNSVILLE (QR)","Fields","12:45 F4","1:20 F4","1:55 F4","2:35 F4","3:12 F4","3:50 F4","4:25 F4",{"$nulls":21}," ",null," "]
[null,"SCONE (NR)","Fields","12:25:00","01:05:00","01:40:00","02:15:00","2:50 F4","3:25 F4","4:05 F4","4:40 F4",{"$nulls":20}," ",null," "]
[null,"SALE (VR)","Fields","12:00:00","12:30:00","01:00:00","01:30:00","2:00 F4","2:30 F4","3:00 F4","3:30 F4",{"$nulls":20}," ",null," "]
[null,"KALGOORLIE (PR)","Fields","03:05:00","03:42:00","04:17:00","04:52:00","05:32:00","06:10:00","06:45:00",{"$nulls":10}," ",{"$nulls":17},"Username",null,"Password"]
[]
[]
[]
[{"$nulls":26},"Horse Records"]
[{"$nulls":20},"Tuesday, 29 March",{"$nulls":5},"Jockey Records"]
[{"$nulls":26},"Trainer Records"]
[{"$nulls":21},"Australia",{"$nulls":4},"Stallion Records"]
[{"$nulls":22},"Kalgoorlie",null,"Sunny. (Max: 29)","Speed MapNeuralsWorksheetCustomised Form Guide","Course Records"]
[{"$nulls":22},"Sale",null,"Early fog. (Max: 27)","Speed MapNeuralsWorksheetCustomised Form Guide"]
[{"$nulls":22},"Scone",null,"Possible shower. (Max: 27)","Speed MapNeuralsWorksheetCustomised Form Guide","Legend"]
[{"$nulls":22},"Townsville",null,"Rain periods (Max: 27) Rail: True Entire Course. Track: HEAVY 10","Speed MapNeuralsWorksheetCustomised Form Guide","Form Preview","Form Preview"]
[{"$nulls":26},"Neurals","Neurals"]
[{"$nulls":21},"South Africa",{"$nulls":4},"Worksheet","Worksheet"]
[{"$nulls":22},"Vaal Sand",null,null,"Speed MapNeuralsWorksheetCustomised Form Guide","Customised Form Guide","Customised Form Guide"]
[{"$nulls":22},"Greyville",null,"Sunny (Max: 29)","Speed MapNeuralsWorksheetCustomised Form Guide","Complete Form Service","Complete Form Service"]
[]
[]
[]
[{"$nulls":20},"Wednesday, 30 March",{"$nulls":5},"Media Centre"]
[]
[{"$nulls":21},"Australia",{"$nulls":4},"Punting Patto Moonee Valley 25th March 11"]
[{"$nulls":22},"Balaklava",null,"Possible shower. (Max: 23) Rail: True. Track: GOOD 3","Speed MapNeuralsWorksheetCustomised Form Guide",null,"The Smarts with Tom Waterhouse 26/3/11"]
[{"$nulls":22},"Bunbury",null,"Sunny. (Max: 30) Rail: Out 3m Track: GOOD 3","Speed MapNeuralsWorksheetCustomised Form Guide",null,"Steve Moran Selects for 24/3/11"]
[{"$nulls":22},"Doomben",null,"A few showers. (Max: 27) Rail: 5m 1000-375; 7.5m Remainder. Track: GOOD 3","Speed MapNeuralsWorksheetCustomised Form Guide"]
[{"$nulls":22},"Randwick-Kensington",null,"Possible shower. (Max: 28) Rail: True. Track: DEAD 5","Speed MapNeuralsWorksheetCustomised Form Guide",null,"Black Caviar and Peter Moody Moonee Valley Preview"]
[{"$nulls":22},"Sandown-Lakeside",null,"Few showers. (Max: 22) Rail: Out 3m Track: DEAD 5","Speed MapNeuralsWorksheetCustomised Form Guide",null,"Aquanita Track Talk 24/03/11"]
[]
[{"$nulls":21},"Hong Kong",{"$nulls":5},"Dubai Trackwork Thursday 24th March 2011"]
[{"$nulls":22},"Happy Valley",null,"Mainly cloudy. (Max: 20)","Speed MapNeuralsWorksheetCustomised Form Guide",null,"Carl O'Callaghan talks about Kinsale King in Dubai 2011"]
[{"$nulls":27},"Saimee Jumaat talks to Craig Evans about Better Than Ever"]
[{"$nulls":21},"New Zealand",{"$nulls":5},"Craig Evans speaks with Danny Beasley regarding Better Be The One in Dubai 2011"]
[{"$nulls":22},"Paeroa",null,"Cloudy (Max: 21) Rail: True Track: DEAD 6","Speed MapNeuralsWorksheetCustomised Form Guide",null,"Craig Evans talks to Felix Coetzee about Rocket Man in Dubai 2011"]
[{"$nulls":27},"Dubai World Cup Day preview - John Moore : Dim Sum & Sunny King"]
[{"$nulls":21},"South Africa",{"$nulls":5},"Dubai World Cup Day preview - Herman Brown : Bankable & Sweet Ducky"]
[{"$nulls":22},"Kenilworth",null,"Showers (Max: 24)","Speed MapNeuralsWorksheetCustomised Form Guide",null,"Fox Sports' Julian De Stoop on AFL's round one"]
[{"$nulls":27},"Australian Grand Prix preview with Matt Clayton"]
[{"$nulls":27},"Motorsport journalist Matthew Clayton previews the weekend's Australian Grand Prix in Melbourne."]
[{"$nulls":27},"Mark Webber tops opening Formula One practice"]
[]
[]
[]
[]
[{"$nulls":20},"Sunday, 27 March"]
[]
[{"$nulls":21},"Australia"]
[{"$nulls":22},"Cranbourne",null,"Partly cloudy. (Max: 22) Rail: Out 4m from 1000m-W.P. (Pent: 4.62). Track: DEAD","Speed MapNeuralsWorksheetCustomised Form Guide"]
[{"$nulls":22},"Gawler",null,"Fine. (Max: 25) Rail: True. Track: DEAD","Speed MapNeuralsWorksheetCustomised Form Guide"]
[{"$nulls":22},"Geraldton",null,"Sunny. (Max: 34) Rail: True Track: GOOD","Speed MapNeuralsWorksheetCustomised Form Guide"]
[{"$nulls":22},"Hobart",null,"Fine. (Max: 23) Rail: True entire circumference. Track: DEAD","Speed MapNeuralsWorksheetCustomised Form Guide"]
[{"$nulls":22},"Mackay",null,"Rain (Max: 26)","Speed MapNeuralsWorksheetCustomised Form Guide"]
[{"$nulls":22},"Sunshine Coast",null,"A few showers (Max: 27) Rail: 5m Entire Course. (Pent: 7.6). Track: SLOW","Speed MapNeuralsWorksheetCustomised Form Guide"]
[{"$nulls":22},"Wangaratta",null,"Clear. (Max: 25) Rail: Out 4m from 1000m-W.P. Out 4m from W.P-1600m. Track: DEAD","Speed MapNeuralsWorksheetCustomised Form Guide"]
[{"$nulls":22},"Warwick Farm",null,"Shower or two. (Max: 24) Rail: True. Track: DEAD","Speed MapNeuralsWorksheetCustomised Form Guide"]
[{"$nulls":22},"Wellington",null,"Shower or two. (Max: 24) Rail: True. Track: GOOD","Speed MapNeuralsWorksheetCustomised Form Guide"]
[]
[{"$nulls":21},"Hong Kong"]
[{"$nulls":22},"Sha Tin",null,"Mainly fine and dry with some haze. (Max: 22) Track: GOOD","Speed MapNeuralsWorksheetCustomised Form Guide"]
[]
[{"$nulls":21},"New Zealand"]
[{"$nulls":22},"Waipukurau",null,"Partly Cloudy (Max: 14) Rail: True Track: DEAD","Speed MapNeuralsWorksheetCustomised Form Guide"]
[]
[{"$nulls":21},"Singapore"]
[{"$nulls":22},"Kranji Aw",null,"Scattered Thunder Storms (Max: 24)","Form Preview Speed MapNeuralsWorksheetCustomised Form Guide"]
[]
[{"$nulls":21},"South Africa"]
[{"$nulls":22},"Scottsville",null,"Partly Cloudy (Max: 28)","Speed MapNeuralsWorksheetCustomised Form Guide"]
[]
[]
[]
[{"$nulls":20},"Monday, 28 March"]
[]
[{"$nulls":21},"Australia"]
[{"$nulls":22},"Ararat",null,"Mostly clear. (Max: 26) Track: GOOD","Speed MapNeuralsWorksheetCustomised Form Guide"]
[{"$nulls":22},"Taree",null,"Shower or two. (Max: 25) Rail: True. Track: HVY","Speed MapNeuralsWorksheetCustomised Form Guide"]
[]
[{"$nulls":21},"South Africa"]
[{"$nulls":22},"Flamingo Park",null,"Sunny (Max: 28)","Speed MapNeuralsWorksheetCustomised Form Guide"]
[]
[{"$nulls":21},"United Kingdom"]
[{"$nulls":22},"Wolverhampton",null,null,"Speed MapNeuralsWorksheetCustomised Form Guide"]
[]
[]
[{"$nulls":28},"RISA Notice:"]
[]
[{"$nulls":28},"© 2010, Racing Information Services Australia (RISA) and others working with it. These racing materials are reproduced under a copyright licence. Any unauthorised reproduction, adaptation or communication is strictly prohibited."]
[{"$nulls":28},"Full copyright notice."]
[]
[]
[]
[]
[{"$nulls":28},"Racing and Sports",null,"Racing and Sports Pty Ltd | Contact Us | R&S Terms of Use | R&S Privacy"]
[{"$nulls":28},"This site is maintained by Racing and Sports (®) Pty Ltd (ABN 093 360 108) (\"R&S\"). Copyright in all R&S materials is owned by Racing and Sports Pty Ltd (R&S). Racing and Sports is a Registered Trademark. R&S takes all care in the preparation of information appearing on the site, but accepts no responsibility nor warrants the accuracy of the information displayed. This information is provided for entertainment purposes only. All information including race fields and TAB numbers should be checked with an official source. (RAS-WWW01) (ADS1)"]
[]
[{"$nulls":19},"\"; } var allLinks = document.links; for (var i=0; i=0) { } else if (allLinks[i].href.indexOf(\"viewStallion\")>=0) { } else if (allLinks[i].href.indexOf(\"viewJockey\")>=0) { } else if (allLinks[i].href.indexOf(\"viewTrainer\")>=0) { } else if (allLinks[i].href.indexOf(\"viewCourse\")>=0) { } } //-->"]
{"$rows_empty":14}
[{"$nulls":19},"\"; } var allLinks = document.links; for (var i=0; i=0) { } else if (allLinks[i].href.indexOf(\"viewStallion\")>=0) { } else if (allLinks[i].href.indexOf(\"viewJockey\")>=0) { } else if (allLinks[i].href.indexOf(\"viewTrainer\")>=0) { } else if (allLinks[i].href.indexOf(\"viewCourse\")>=0) { } } //-->"]

{"sheet":"Race","index":4,"n_rows":34,"n_cols":14,"rows_kept":34,"cut":false,"hidden":false,"merged":[]}
[]
["SCONE",null,"NR 8","Jump","04:40:00"]
[null,null,null,"Odds","10:25:00"]
["2011-03-29","BM 65 HANDICAP"]
[{"$nulls":5},"1100M"]
["No.",null,"Name","07:25:00","Win","Plc",null,"Rider  ","Bar","Wght",null,"Form","L3S","Rtng"]
[1,null,"BOULEVARD BARON","00:00:00",47.8,0,null,"J HULL(A)",9,60,null,"W","90X",98]
[2,null,"INHERITED","00:00:00",47.8,0,null,"M LISTER",10,59.5,null,"T","01X",91]
[3,null,"FORCED TO TANGO",14.1,23.9,0,null,"T NIKORA",3,58.5,null,"WT",66,93]
[4,null,"PENTELI",0,0,0,null,"H SINGH(A)",15,58.5,null,"WT","13X",90]
[5,null,"OKANE",7,7.9,4.5,null,"R THOMPSON",13,58,null,"T","31X",97]
[6,null,"TENNESSEE MADAM",0,0,0,null,"R MURRAY(A)",8,58,null,"DW","X13",100]
[7,null,"LAST RAIN",0,11.9,1.8,null,"C REITH",6,57.5,null,"W","74X",94]
[8,null,"I'M READY",5.6,6.8,9.1,null,"C O'BRIEN",14,57,null,"DC",818,96]
[9,null,"DUNOLLY","00:00:00",0,0,null,"M BELL",12,56.5,null,"WT","4X0",95]
[10,null,"THWARTED",5.6,9.5,0,null,"B SPRIGGS(A)",4,56.5,null,"W","96X",88]
[11,null,"IZZYINHELL",4.7,4.3,1,null,"D SPRIGGS",1,56,null,"DC","L22",94]
[12,null,"SUTTON PRINCESS",28.2,23.9,9.1,null,"G RYAN",16,56,null,"DT","20X",99]
[13,null,"BAREFOOTDANCER",9.4,11.9,4.5,null,"L G HENRY",2,55,null,"W","10X",96]
[14,null,"WINGEN WIN",0,0,0,null,"G BUCKLEY",11,54.5,null,"T",622,95]
[15,null,"RIPTHIS",28.2,47.8,0,null,"J PENZA",5,54,null,"D","1X8",94]
[16,null,"TYPHOON INDY",28.2,47.8,9.1,null,null,7,54,null,"W","20X",91]
[17,null,"GLENARVY",0,47.8,0,null,"G LYNCH",18,54,null,"WT","X98",93]
[18,null,"CLOUDCRAFT",5.6,4.7,1,null,null,17,54,null,"W","0X8",89]
[]
["UNiTAB Pool Totals"]
["WN",56,"QN",34,"TF",13,"DD(7,8) "]
["PL",32,"EX",3,"F4",0,"TT(6,7,8) "]
[null,null,"A2",0,null,null,"QD(5,6,7,8) "]
[]
["<< NR  1  2  3  4  5  6  7  8  DD/TT/QD  XD Riders >>"]
[]
["Help","Gambling Advice","TAB Home","Refresh"]
["© Copyright UNiTAB Ltd","Created: Mon, 28 Mar 2011 23:54:11 Aust EST"]

{"sheet":"Selections","index":5,"n_rows":25,"n_cols":10,"rows_kept":25,"cut":false,"hidden":false,"merged":[]}
["Venue",null,"Race",null,"No","Runner",null,null,"Win","Place"]
["",null,"","","","",null,null,"",""]
["",null,"","","","",null,null,"",""]
["SCONE",null,1,3.5,4,"Buckle Me Up",null,null,"",""]
["",null,"","","","",null,null,"",""]
["",null,"","","","",null,null,"",""]
["SCONE",null,2,3.5,3,"Secret Encounter",null,null,"",""]
["",null,"","","","",null,null,"",""]
["",null,"","","","",null,null,"",""]
["SCONE",null,3,2,10,"Domesta",null,null,"",""]
["",null,"","","","",null,null,"",""]
["",null,"","","","",null,null,"",""]
["SCONE",null,4,3.9,3,"Alcancia",null,null,"",""]
["",null,"","","","",null,null,"",""]
["",null,"","","","",null,null,"",""]
["SCONE",null,5,3.6,11,"Sparkling Lily",null,null,"",""]
["SCONE",null,6,"Fav",4,"Party Legs",null,null,"",""]
["",null,"","","","",null,null,"",""]
["SCONE",null,6,2.6,4,"Party Legs",null,null,"",""]
["",null,"","","","",null,null,"",""]
["",null,"","","","",null,null,"",""]
["SCONE",null,7,2.9,7,"Domitare",null,null,"",""]
["",null,"","","","",null,null,"",""]
["",null,"","","","",null,null,"",""]
["SCONE",null,8,4,14,"Wingen Win",null,null,"",""]