{"text_format":"2","workbook":"xlsx","n_sheets":10,"sheets":["Instructions","RaceList","MainSheet","Meetings1","Meetings2","Form","Race","Tables","Data","Results"],"not_rendered":{"charts":0,"images":0,"macros":1,"external_links":0,"defined_names":6,"comments":0,"pivot_tables":0},"unopened":[],"bounds":{"document_bytes":16777216,"sheet_cells":100000,"run_cost":"one","rows_first":2000,"rows_last":500,"rows_between":2000,"halvings":0,"cell_chars":16384,"cell_head_chars":4096},"cells_cut":0,"cells_raw":0,"read":"whole","date_system":"1900"}

{"sheet":"Instructions","index":0,"n_rows":24,"n_cols":9,"rows_kept":24,"cut":false,"hidden":false,"merged":[]}
[]
[]
[{"$nulls":4},"Instructions"]
[]
[{"$nulls":4},"1) On \"MainSheet\" add the hours to subtract in cell X4 for your local time as times are EST or EDST."]
[{"$nulls":4},"2) Go to \"RaceList\" sheet and press \"Delete\" to clear any old race files."]
[{"$nulls":4},"3) Press the \"Meetings\" button you can then change the date for back testing your ratings or click \"OK\" for today's races."]
[{"$nulls":4},"4) After the races are imported you will have a list of available venues on the right, on the left you have a dropdown box where you can select that venue."]
[{"$nulls":4},"5) You can choose to import your choice of races by going to \"Meetings1\" sheet and clearing the race numbers of the races you are not interested in,"]
[{"$nulls":4},"     Then go back to \"RaceList\" sheet and press the \"Automatic\" button and let the sheet run."]
[{"$nulls":4},"6) If you want to just import a race as you go then on the \"RaceList\" sheet click on the race number you want then press \"Manual\", after the race has been imported"]
[{"$nulls":4},"    You can make a copy of that sheet by pressing \"Copy\" on the \"RaceList\" sheet, make sure that race does not already exist, if so you can delete the sheet."]
[]
[{"$nulls":4},"Results"]
[{"$nulls":4},"If you are back testing go to the \"Results\" page to see a list of your top 5 and if they won a price will be displayed.,"]
[{"$nulls":4},"you can add your own code from column H onwards to analyze the results."]
[]
[]
[{"$nulls":4},"Adjust Ratings"]
[{"$nulls":8},"`"]
[{"$nulls":4},"The sheet is unprotected so you can make any changes you want, to add your own values go to the \" Tables\" sheet, if you wish to exclude a form factor  "]
[{"$nulls":4},"from being assessed put an X in the box above that factor."]
[{"$nulls":4},"You can also change any factor in red or even add your own assessment criterior and values if you wish,"]
[{"$nulls":4}," you will need to make major changes if you want to add any new form factors so make a copy of the sheet before you start."]

{"sheet":"RaceList","index":1,"n_rows":301,"n_cols":15,"rows_kept":301,"cut":false,"hidden":false,"merged":[[17,9,17,10],[17,11,17,12],[18,9,18,10],[18,11,18,12],[20,9,20,12],[14,9,14,10],[14,11,14,12],[15,9,15,10],[15,11,15,12],[16,9,16,10],[16,11,16,12],[11,9,11,10],[11,11,11,12],[12,9,12,10],[12,11,12,12],[13,9,13,10],[13,11,13,12],[8,9,8,10],[8,11,8,12],[9,9,9,10],[9,11,9,12],[10,9,10,10],[10,11,10,12],[5,9,5,10],[5,11,5,12],[6,9,6,10],[6,11,6,12],[7,9,7,10],[7,11,7,12],[4,9,4,10],[4,11,4,12],[0,10,0,11],[2,9,2,10],[2,11,2,12],[3,9,3,10],[3,11,3,12]]}
[{"$nulls":10},"Race Venues"]
[{"$nulls":9},"Selected Venues",null,null,"Available Venues"]
[{"$nulls":11},{"$f":"IF(Data!AW1=\"\",\"\",Data!AW1)","v":""}]
[{"$nulls":9},"ROCKHAMPTON (QR)",null,{"$f":"IF(Data!AW2=\"\",\"\",Data!AW2)","v":"Rockhampton"}]
[{"$nulls":11},{"$f":"IF(Data!AW3=\"\",\"\",Data!AW3)","v":"Pinjarra"}]
[{"$nulls":11},{"$f":"IF(Data!AW4=\"\",\"\",Data!AW4)","v":"Launceston"}]
[{"$nulls":11},{"$f":"IF(Data!AW5=\"\",\"\",Data!AW5)","v":"Hawkesbury"}]
[{"$nulls":11},{"$f":"IF(Data!AW6=\"\",\"\",Data!AW6)","v":"Geelong"}]
[{"$nulls":11},{"$f":"IF(Data!AW7=\"\",\"\",Data!AW7)","v":""}]
[{"$nulls":11},{"$f":"IF(Data!AW8=\"\",\"\",Data!AW8)","v":""}]
[{"$nulls":11},{"$f":"IF(Data!AW9=\"\",\"\",Data!AW9)","v":""}]
[{"$nulls":11},{"$f":"IF(Data!AW10=\"\",\"\",Data!AW10)","v":""}]
[{"$nulls":11},{"$f":"IF(Data!AW11=\"\",\"\",Data!AW11)","v":""}]
[{"$nulls":11},{"$f":"IF(Data!AW12=\"\",\"\",Data!AW12)","v":""}]
[{"$nulls":11},{"$f":"IF(Data!AW13=\"\",\"\",Data!AW13)","v":""}]
[{"$nulls":11},{"$f":"IF(Data!AW14=\"\",\"\",Data!AW14)","v":""}]
[{"$nulls":11},{"$f":"IF(Data!AW15=\"\",\"\",Data!AW15)","v":""}]
[{"$nulls":11},{"$f":"IF(Data!AW16=\"\",\"\",Data!AW16)","v":""}]
[{"$nulls":11},{"$f":"IF(Data!AW17=\"\",\"\",Data!AW17)","v":""}]
[]
[{"$nulls":9},"Race Lists"]
[{"$nulls":9},{"$f":"IF(Meetings1!A2=\"\",\"\",Meetings1!A2)","v":"Geelong"},{"$f":"IF(Meetings1!B2=\"\",\"\",Meetings1!C2)","v":""}]
[{"$nulls":9},{"$f":"IF(Meetings1!A3=\"\",\"\",Meetings1!A3)","v":1},{"$f":"IF(Meetings1!B3=\"\",\"\",Meetings1!C3)","v":"Carr & Harvey Accountants Mdn - 1330m"},null,null,null,{"$f":"IF(Meetings1!B3=\"\",\"\",getAddress(Meetings1!E3))","v":"http://formguide.cyberhorse.com.au/index.php/Form/form.html?formdate=2010-12-02&track=G'long&raceno=1"}]
[{"$nulls":9},{"$f":"IF(Meetings1!A4=\"\",\"\",Meetings1!A4)","v":2},{"$f":"IF(Meetings1!B4=\"\",\"\",Meetings1!C4)","v":"Alc Quality Foods Mdn Plate - 1530m"},null,null,null,{"$f":"IF(Meetings1!B4=\"\",\"\",getAddress(Meetings1!E4))","v":"http://formguide.cyberhorse.com.au/index.php/Form/form.html?formdate=2010-12-02&track=G'long&raceno=2"}]
[{"$nulls":9},{"$f":"IF(Meetings1!A5=\"\",\"\",Meetings1!A5)","v":3},{"$f":"IF(Meetings1!B5=\"\",\"\",Meetings1!C5)","v":"Nib Health Funds Hcp (c1) - 1130m"},null,null,null,{"$f":"IF(Meetings1!B5=\"\",\"\",getAddress(Meetings1!E5))","v":"http://formguide.cyberhorse.com.au/index.php/Form/form.html?formdate=2010-12-02&track=G'long&raceno=3"}]
[{"$nulls":9},{"$f":"IF(Meetings1!A6=\"\",\"\",Meetings1!A6)","v":4},{"$f":"IF(Meetings1!B6=\"\",\"\",Meetings1!C6)","v":"It Trophy & Clothing Mdn - 1230m"},null,null,null,{"$f":"IF(Meetings1!B6=\"\",\"\",getAddress(Meetings1!E6))","v":"http://formguide.cyberhorse.com.au/index.php/Form/form.html?formdate=2010-12-02&track=G'long&raceno=4"}]
[{"$nulls":9},{"$f":"IF(Meetings1!A7=\"\",\"\",Meetings1!A7)","v":5},{"$f":"IF(Meetings1!B7=\"\",\"\",Meetings1!C7)","v":"Quinlan Cranes Hcp (62) - 1530m"},null,null,null,{"$f":"IF(Meetings1!B7=\"\",\"\",getAddress(Meetings1!E7))","v":"http://formguide.cyberhorse.com.au/index.php/Form/form.html?formdate=2010-12-02&track=G'long&raceno=5"}]
[{"$nulls":9},{"$f":"IF(Meetings1!A8=\"\",\"\",Meetings1!A8)","v":6},{"$f":"IF(Meetings1!B8=\"\",\"\",Meetings1!C8)","v":"Briseis Gold Cup - 1741m"},null,null,null,{"$f":"IF(Meetings1!B8=\"\",\"\",getAddress(Meetings1!E8))","v":"http://formguide.cyberhorse.com.au/index.php/Form/form.html?formdate=2010-12-02&track=G'long&raceno=6"}]
[{"$nulls":9},{"$f":"IF(Meetings1!A9=\"\",\"\",Meetings1!A9)","v":7},{"$f":"IF(Meetings1!B9=\"\",\"\",Meetings1!C9)","v":"Doxa Joe Youth Foundation (68) - 2447m"},null,null,null,{"$f":"IF(Meetings1!B9=\"\",\"\",getAddress(Meetings1!E9))","v":"http://formguide.cyberhorse.com.au/index.php/Form/form.html?formdate=2010-12-02&track=G'long&raceno=7"}]
[{"$nulls":9},{"$f":"IF(Meetings1!A10=\"\",\"\",Meetings1!A10)","v":8},{"$f":"IF(Meetings1!B10=\"\",\"\",Meetings1!C10)","v":"C Q Recruitment Hcp (62) - 1330m"},null,null,null,{"$f":"IF(Meetings1!B10=\"\",\"\",getAddress(Meetings1!E10))","v":"http://formguide.cyberhorse.com.au/index.php/Form/form.html?formdate=2010-12-02&track=G'long&raceno=8"}]
[{"$nulls":9},{"$f":"IF(Meetings1!A11=\"\",\"\",Meetings1!A11)","v":"Hawkesbury"},{"$f":"IF(Meetings1!B11=\"\",\"\",Meetings1!C11)","v":""},null,null,null,{"$f":"IF(Meetings1!B11=\"\",\"\",getAddress(Meetings1!E11))","v":""}]
[{"$nulls":9},1,{"$f":"IF(Meetings1!B12=\"\",\"\",Meetings1!C12)","v":"Clarendon Parklea Displays-c1 - 1400m"},null,null,null,{"$f":"IF(Meetings1!B12=\"\",\"\",getAddress(Meetings1!E12))","v":"http://formguide.cyberhorse.com.au/index.php/Form/form.html?formdate=2010-12-02&track=H'bury&raceno=1"}]
[{"$nulls":9},2,{"$f":"IF(Meetings1!B13=\"\",\"\",Meetings1!C13)","v":"Brivis Air Conditioning Mdn - 1000m"},null,null,null,{"$f":"IF(Meetings1!B13=\"\",\"\",getAddress(Meetings1!E13))","v":"http://formguide.cyberhorse.com.au/index.php/Form/form.html?formdate=2010-12-02&track=H'bury&raceno=2"}]
[{"$nulls":9},3,{"$f":"IF(Meetings1!B14=\"\",\"\",Meetings1!C14)","v":"Tfh Temporary Fence Hire Mdn - 1000m"},null,null,null,{"$f":"IF(Meetings1!B14=\"\",\"\",getAddress(Meetings1!E14))","v":"http://formguide.cyberhorse.com.au/index.php/Form/form.html?formdate=2010-12-02&track=H'bury&raceno=3"}]
[{"$nulls":9},4,{"$f":"IF(Meetings1!B15=\"\",\"\",Meetings1!C15)","v":"Clarendon Chairman's (bm60) - 1000m"},null,null,null,{"$f":"IF(Meetings1!B15=\"\",\"\",getAddress(Meetings1!E15))","v":"http://formguide.cyberhorse.com.au/index.php/Form/form.html?formdate=2010-12-02&track=H'bury&raceno=4"}]
[{"$nulls":9},5,{"$f":"IF(Meetings1!B16=\"\",\"\",Meetings1!C16)","v":"Clarendon Homes (bm60) - 1600m"},null,null,null,{"$f":"IF(Meetings1!B16=\"\",\"\",getAddress(Meetings1!E16))","v":"http://formguide.cyberhorse.com.au/index.php/Form/form.html?formdate=2010-12-02&track=H'bury&raceno=5"}]
[{"$nulls":9},6,{"$f":"IF(Meetings1!B17=\"\",\"\",Meetings1!C17)","v":"M & Z Tiling Mdn Plate - 1800m"},null,null,null,{"$f":"IF(Meetings1!B17=\"\",\"\",getAddress(Meetings1!E17))","v":"http://formguide.cyberhorse.com.au/index.php/Form/form.html?formdate=2010-12-02&track=H'bury&raceno=6"}]
[{"$nulls":9},7,{"$f":"IF(Meetings1!B18=\"\",\"\",Meetings1!C18)","v":"Clarendon Trades Hcp (c2) - 1200m"},null,null,null,{"$f":"IF(Meetings1!B18=\"\",\"\",getAddress(Meetings1!E18))","v":"http://formguide.cyberhorse.com.au/index.php/Form/form.html?formdate=2010-12-02&track=H'bury&raceno=7"}]
[{"$nulls":9},8,{"$f":"IF(Meetings1!B19=\"\",\"\",Meetings1!C19)","v":"Clarendon Resi Projects Mdn - 1400m"},null,null,null,{"$f":"IF(Meetings1!B19=\"\",\"\",getAddress(Meetings1!E19))","v":"http://formguide.cyberhorse.com.au/index.php/Form/form.html?formdate=2010-12-02&track=H'bury&raceno=8"}]
[{"$nulls":9},{"$f":"IF(Meetings1!A20=\"\",\"\",Meetings1!A20)","v":"Launceston"},{"$f":"IF(Meetings1!B20=\"\",\"\",Meetings1!C20)","v":""},null,null,null,{"$f":"IF(Meetings1!B20=\"\",\"\",getAddress(Meetings1!E20))","v":""}]
[{"$nulls":9},{"$f":"IF(Meetings1!A21=\"\",\"\",Meetings1!A21)","v":1},{"$f":"IF(Meetings1!B21=\"\",\"\",Meetings1!C21)","v":"Alps & Amici Mdn Plate - 1100m"},null,null,null,{"$f":"IF(Meetings1!B21=\"\",\"\",getAddress(Meetings1!E21))","v":"http://formguide.cyberhorse.com.au/index.php/Form/form.html?formdate=2010-12-02&track=Launc.&raceno=1"}]
[{"$nulls":9},{"$f":"IF(Meetings1!A22=\"\",\"\",Meetings1!A22)","v":2},{"$f":"IF(Meetings1!B22=\"\",\"\",Meetings1!C22)","v":"Juicy Isle Mdn Plate - 1200m"},null,null,null,{"$f":"IF(Meetings1!B22=\"\",\"\",getAddress(Meetings1!E22))","v":"http://formguide.cyberhorse.com.au/index.php/Form/form.html?formdate=2010-12-02&track=Launc.&raceno=2"}]
[{"$nulls":9},{"$f":"IF(Meetings1!A23=\"\",\"\",Meetings1!A23)","v":3},{"$f":"IF(Meetings1!B23=\"\",\"\",Meetings1!C23)","v":"Cripps Nu-bake Hcp (c4) - 1400m"},null,null,null,{"$f":"IF(Meetings1!B23=\"\",\"\",getAddress(Meetings1!E23))","v":"http://formguide.cyberhorse.com.au/index.php/Form/form.html?formdate=2010-12-02&track=Launc.&raceno=3"}]
[{"$nulls":9},{"$f":"IF(Meetings1!A24=\"\",\"\",Meetings1!A24)","v":4},{"$f":"IF(Meetings1!B24=\"\",\"\",Meetings1!C24)","v":"Jack Chambers (bm68) - 2100m"},null,null,null,{"$f":"IF(Meetings1!B24=\"\",\"\",getAddress(Meetings1!E24))","v":"http://formguide.cyberhorse.com.au/index.php/Form/form.html?formdate=2010-12-02&track=Launc.&raceno=4"}]
[{"$nulls":9},{"$f":"IF(Meetings1!A25=\"\",\"\",Meetings1!A25)","v":5},{"$f":"IF(Meetings1!B25=\"\",\"\",Meetings1!C25)","v":"Field Family Hcp - 1400m"},null,null,null,{"$f":"IF(Meetings1!B25=\"\",\"\",getAddress(Meetings1!E25))","v":"http://formguide.cyberhorse.com.au/index.php/Form/form.html?formdate=2010-12-02&track=Launc.&raceno=5"}]
[{"$nulls":9},{"$f":"IF(Meetings1!A26=\"\",\"\",Meetings1!A26)","v":6},{"$f":"IF(Meetings1!B26=\"\",\"\",Meetings1!C26)","v":"Pfd Foodservices W F A - 1400m"},null,null,null,{"$f":"IF(Meetings1!B26=\"\",\"\",getAddress(Meetings1!E26))","v":"http://formguide.cyberhorse.com.au/index.php/Form/form.html?formdate=2010-12-02&track=Launc.&raceno=6"}]
[{"$nulls":9},{"$f":"IF(Meetings1!A27=\"\",\"\",Meetings1!A27)","v":7},{"$f":"IF(Meetings1!B27=\"\",\"\",Meetings1!C27)","v":"West's Bakery Hcp (c2) - 1400m"},null,null,null,{"$f":"IF(Meetings1!B27=\"\",\"\",getAddress(Meetings1!E27))","v":"http://formguide.cyberhorse.com.au/index.php/Form/form.html?formdate=2010-12-02&track=Launc.&raceno=7"}]
[{"$nulls":9},{"$f":"IF(Meetings1!A28=\"\",\"\",Meetings1!A28)","v":8},{"$f":"IF(Meetings1!B28=\"\",\"\",Meetings1!C28)","v":"Abel's Tempest Hcp (c1) - 1200m"},null,null,null,{"$f":"IF(Meetings1!B28=\"\",\"\",getAddress(Meetings1!E28))","v":"http://formguide.cyberhorse.com.au/index.php/Form/form.html?formdate=2010-12-02&track=Launc.&raceno=8"}]
[{"$nulls":9},{"$f":"IF(Meetings1!A29=\"\",\"\",Meetings1!A29)","v":"Pinjarra"},{"$f":"IF(Meetings1!B29=\"\",\"\",Meetings1!C29)","v":""},null,null,null,{"$f":"IF(Meetings1!B29=\"\",\"\",getAddress(Meetings1!E29))","v":""}]
[{"$nulls":9},{"$f":"IF(Meetings1!A30=\"\",\"\",Meetings1!A30)","v":1},{"$f":"IF(Meetings1!B30=\"\",\"\",Meetings1!C30)","v":"Peel Bins Mdn - 1000m"},null,null,null,{"$f":"IF(Meetings1!B30=\"\",\"\",getAddress(Meetings1!E30))","v":"http://formguide.cyberhorse.com.au/index.php/Form/form.html?formdate=2010-12-02&track=Pinjra&raceno=1"}]
[{"$nulls":9},{"$f":"IF(Meetings1!A31=\"\",\"\",Meetings1!A31)","v":2},{"$f":"IF(Meetings1!B31=\"\",\"\",Meetings1!C31)","v":"Traders & Stable Affairs Mdn - 1200m"},null,null,null,{"$f":"IF(Meetings1!B31=\"\",\"\",getAddress(Meetings1!E31))","v":"http://formguide.cyberhorse.com.au/index.php/Form/form.html?formdate=2010-12-02&track=Pinjra&raceno=2"}]
[{"$nulls":9},{"$f":"IF(Meetings1!A32=\"\",\"\",Meetings1!A32)","v":3},{"$f":"IF(Meetings1!B32=\"\",\"\",Meetings1!C32)","v":"Crystals Surf Mdn - 1200m"},null,null,null,{"$f":"IF(Meetings1!B32=\"\",\"\",getAddress(Meetings1!E32))","v":"http://formguide.cyberhorse.com.au/index.php/Form/form.html?formdate=2010-12-02&track=Pinjra&raceno=3"}]
[{"$nulls":9},{"$f":"IF(Meetings1!A33=\"\",\"\",Meetings1!A33)","v":4},{"$f":"IF(Meetings1!B33=\"\",\"\",Meetings1!C33)","v":"George 'n' Dragon Tavern Mdn - 1600m"},null,null,null,{"$f":"IF(Meetings1!B33=\"\",\"\",getAddress(Meetings1!E33))","v":"http://formguide.cyberhorse.com.au/index.php/Form/form.html?formdate=2010-12-02&track=Pinjra&raceno=4"}]
[{"$nulls":9},{"$f":"IF(Meetings1!A34=\"\",\"\",Meetings1!A34)","v":5},{"$f":"IF(Meetings1!B34=\"\",\"\",Meetings1!C34)","v":"Bennu Intl Consultancy Hcp-68 - 1600m"},null,null,null,{"$f":"IF(Meetings1!B34=\"\",\"\",getAddress(Meetings1!E34))","v":"http://formguide.cyberhorse.com.au/index.php/Form/form.html?formdate=2010-12-02&track=Pinjra&raceno=5"}]
[{"$nulls":9},{"$f":"IF(Meetings1!A35=\"\",\"\",Meetings1!A35)","v":6},{"$f":"IF(Meetings1!B35=\"\",\"\",Meetings1!C35)","v":"Ideas In Furniture Hcp (c1) - 1400m"},null,null,null,{"$f":"IF(Meetings1!B35=\"\",\"\",getAddress(Meetings1!E35))","v":"http://formguide.cyberhorse.com.au/index.php/Form/form.html?formdate=2010-12-02&track=Pinjra&raceno=6"}]
[{"$nulls":9},{"$f":"IF(Meetings1!A36=\"\",\"\",Meetings1!A36)","v":7},{"$f":"IF(Meetings1!B36=\"\",\"\",Meetings1!C36)","v":"Boddington Earthmoving Hcp-64 - 2000m"},null,null,null,{"$f":"IF(Meetings1!B36=\"\",\"\",getAddress(Meetings1!E36))","v":"http://formguide.cyberhorse.com.au/index.php/Form/form.html?formdate=2010-12-02&track=Pinjra&raceno=7"}]
[{"$nulls":9},{"$f":"IF(Meetings1!A37=\"\",\"\",Meetings1!A37)","v":8},{"$f":"IF(Meetings1!B37=\"\",\"\",Meetings1!C37)","v":"Magic Millions (bm60+) - 1200m"},null,null,null,{"$f":"IF(Meetings1!B37=\"\",\"\",getAddress(Meetings1!E37))","v":"http://formguide.cyberhorse.com.au/index.php/Form/form.html?formdate=2010-12-02&track=Pinjra&raceno=8"}]
[{"$nulls":9},{"$f":"IF(Meetings1!A38=\"\",\"\",Meetings1!A38)","v":"Rockhampton"},{"$f":"IF(Meetings1!B38=\"\",\"\",Meetings1!C38)","v":""},null,null,null,{"$f":"IF(Meetings1!B38=\"\",\"\",getAddress(Meetings1!E38))","v":""}]
[{"$nulls":9},{"$f":"IF(Meetings1!A39=\"\",\"\",Meetings1!A39)","v":1},{"$f":"IF(Meetings1!B39=\"\",\"\",Meetings1!C39)","v":"Goody's Earth Moving Mdn Hcp - 1600m"},null,null,null,{"$f":"IF(Meetings1!B39=\"\",\"\",getAddress(Meetings1!E39))","v":"http://formguide.cyberhorse.com.au/index.php/Form/form.html?formdate=2010-12-02&track=Rocky&raceno=1"}]
[{"$nulls":9},{"$f":"IF(Meetings1!A40=\"\",\"\",Meetings1!A40)","v":2},{"$f":"IF(Meetings1!B40=\"\",\"\",Meetings1!C40)","v":"Cq Powdercoaters Hcp - 970m"},null,null,null,{"$f":"IF(Meetings1!B40=\"\",\"\",getAddress(Meetings1!E40))","v":"http://formguide.cyberhorse.com.au/index.php/Form/form.html?formdate=2010-12-02&track=Rocky&raceno=2"}]
[{"$nulls":9},{"$f":"IF(Meetings1!A41=\"\",\"\",Meetings1!A41)","v":3},{"$f":"IF(Meetings1!B41=\"\",\"\",Meetings1!C41)","v":"Rockyvegas 600 Social Clb Mdn - 970m"},null,null,null,{"$f":"IF(Meetings1!B41=\"\",\"\",getAddress(Meetings1!E41))","v":"http://formguide.cyberhorse.com.au/index.php/Form/form.html?formdate=2010-12-02&track=Rocky&raceno=3"}]
[{"$nulls":9},{"$f":"IF(Meetings1!A42=\"\",\"\",Meetings1!A42)","v":4},{"$f":"IF(Meetings1!B42=\"\",\"\",Meetings1!C42)","v":"Kele Property Group Hcp (c1) - 1400m"},null,null,null,{"$f":"IF(Meetings1!B42=\"\",\"\",getAddress(Meetings1!E42))","v":"http://formguide.cyberhorse.com.au/index.php/Form/form.html?formdate=2010-12-02&track=Rocky&raceno=4"}]
[{"$nulls":9},{"$f":"IF(Meetings1!A43=\"\",\"\",Meetings1!A43)","v":5},{"$f":"IF(Meetings1!B43=\"\",\"\",Meetings1!C43)","v":"Allenstown Hotel Hcp (c4) - 1300m"},null,null,null,{"$f":"IF(Meetings1!B43=\"\",\"\",getAddress(Meetings1!E43))","v":"http://formguide.cyberhorse.com.au/index.php/Form/form.html?formdate=2010-12-02&track=Rocky&raceno=5"}]
[{"$nulls":9},{"$f":"IF(Meetings1!A44=\"\",\"\",Meetings1!A44)","v":6},{"$f":"IF(Meetings1!B44=\"\",\"\",Meetings1!C44)","v":"Daniels Surgical & Health (c2) - 1050m"},null,null,null,{"$f":"IF(Meetings1!B44=\"\",\"\",getAddress(Meetings1!E44))","v":"http://formguide.cyberhorse.com.au/index.php/Form/form.html?formdate=2010-12-02&track=Rocky&raceno=6"}]
[{"$nulls":9},{"$f":"IF(Meetings1!A45=\"\",\"\",Meetings1!A45)","v":"END"},{"$f":"IF(Meetings1!B45=\"\",\"\",Meetings1!C45)","v":""},null,null,null,{"$f":"IF(Meetings1!B45=\"\",\"\",getAddress(Meetings1!E45))","v":""}]
[{"$nulls":9},{"$f":"IF(Meetings1!A46=\"\",\"\",Meetings1!A46)","v":""},{"$f":"IF(Meetings1!B46=\"\",\"\",Meetings1!C46)","v":""},null,null,null,{"$f":"IF(Meetings1!B46=\"\",\"\",getAddress(Meetings1!E46))","v":""}]
[{"$nulls":9},{"$f":"IF(Meetings1!A47=\"\",\"\",Meetings1!A47)","v":""},{"$f":"IF(Meetings1!B47=\"\",\"\",Meetings1!C47)","v":""},null,null,null,{"$f":"IF(Meetings1!B47=\"\",\"\",getAddress(Meetings1!E47))","v":""}]
[{"$nulls":9},{"$f":"IF(Meetings1!A48=\"\",\"\",Meetings1!A48)","v":""},{"$f":"IF(Meetings1!B48=\"\",\"\",Meetings1!C48)","v":""},null,null,null,{"$f":"IF(Meetings1!B48=\"\",\"\",getAddress(Meetings1!E48))","v":""}]
[{"$nulls":9},{"$f":"IF(Meetings1!A49=\"\",\"\",Meetings1!A49)","v":""},{"$f":"IF(Meetings1!B49=\"\",\"\",Meetings1!C49)","v":""},null,null,null,{"$f":"IF(Meetings1!B49=\"\",\"\",getAddress(Meetings1!E49))","v":""}]
[{"$nulls":9},{"$f":"IF(Meetings1!A50=\"\",\"\",Meetings1!A50)","v":""},{"$f":"IF(Meetings1!B50=\"\",\"\",Meetings1!C50)","v":""},null,null,null,{"$f":"IF(Meetings1!B50=\"\",\"\",getAddress(Meetings1!E50))","v":""}]
[{"$nulls":9},{"$f":"IF(Meetings1!A51=\"\",\"\",Meetings1!A51)","v":""},{"$f":"IF(Meetings1!B51=\"\",\"\",Meetings1!C51)","v":""},null,null,null,{"$f":"IF(Meetings1!B51=\"\",\"\",getAddress(Meetings1!E51))","v":""}]
[{"$nulls":9},{"$f":"IF(Meetings1!A52=\"\",\"\",Meetings1!A52)","v":""},{"$f":"IF(Meetings1!B52=\"\",\"\",Meetings1!C52)","v":""},null,null,null,{"$f":"IF(Meetings1!B52=\"\",\"\",getAddress(Meetings1!E52))","v":""}]
[{"$nulls":9},{"$f":"IF(Meetings1!A53=\"\",\"\",Meetings1!A53)","v":""},{"$f":"IF(Meetings1!B53=\"\",\"\",Meetings1!C53)","v":""},null,null,null,{"$f":"IF(Meetings1!B53=\"\",\"\",getAddress(Meetings1!E53))","v":""}]
[{"$nulls":9},{"$f":"IF(Meetings1!A54=\"\",\"\",Meetings1!A54)","v":""},{"$f":"IF(Meetings1!B54=\"\",\"\",Meetings1!C54)","v":""},null,null,null,{"$f":"IF(Meetings1!B54=\"\",\"\",getAddress(Meetings1!E54))","v":""}]
[{"$nulls":9},{"$f":"IF(Meetings1!A55=\"\",\"\",Meetings1!A55)","v":""},{"$f":"IF(Meetings1!B55=\"\",\"\",Meetings1!C55)","v":""},null,null,null,{"$f":"IF(Meetings1!B55=\"\",\"\",getAddress(Meetings1!E55))","v":""}]
[{"$nulls":9},{"$f":"IF(Meetings1!A56=\"\",\"\",Meetings1!A56)","v":""},{"$f":"IF(Meetings1!B56=\"\",\"\",Meetings1!C56)","v":""},null,null,null,{"$f":"IF(Meetings1!B56=\"\",\"\",getAddress(Meetings1!E56))","v":""}]
[{"$nulls":9},{"$f":"IF(Meetings1!A57=\"\",\"\",Meetings1!A57)","v":""},{"$f":"IF(Meetings1!B57=\"\",\"\",Meetings1!C57)","v":""},null,null,null,{"$f":"IF(Meetings1!B57=\"\",\"\",getAddress(Meetings1!E57))","v":""}]
[{"$nulls":9},{"$f":"IF(Meetings1!A58=\"\",\"\",Meetings1!A58)","v":""},{"$f":"IF(Meetings1!B58=\"\",\"\",Meetings1!C58)","v":""},null,null,null,{"$f":"IF(Meetings1!B58=\"\",\"\",getAddress(Meetings1!E58))","v":""}]
[{"$nulls":9},{"$f":"IF(Meetings1!A59=\"\",\"\",Meetings1!A59)","v":""},{"$f":"IF(Meetings1!B59=\"\",\"\",Meetings1!C59)","v":""},null,null,null,{"$f":"IF(Meetings1!B59=\"\",\"\",getAddress(Meetings1!E59))","v":""}]
[{"$nulls":9},{"$f":"IF(Meetings1!A60=\"\",\"\",Meetings1!A60)","v":""},{"$f":"IF(Meetings1!B60=\"\",\"\",Meetings1!C60)","v":""},null,null,null,{"$f":"IF(Meetings1!B60=\"\",\"\",getAddress(Meetings1!E60))","v":""}]
[{"$nulls":9},{"$f":"IF(Meetings1!A61=\"\",\"\",Meetings1!A61)","v":""},{"$f":"IF(Meetings1!B61=\"\",\"\",Meetings1!C61)","v":""},null,null,null,{"$f":"IF(Meetings1!B61=\"\",\"\",getAddress(Meetings1!E61))","v":""}]
[{"$nulls":9},{"$f":"IF(Meetings1!A62=\"\",\"\",Meetings1!A62)","v":""},{"$f":"IF(Meetings1!B62=\"\",\"\",Meetings1!C62)","v":""},null,null,null,{"$f":"IF(Meetings1!B62=\"\",\"\",getAddress(Meetings1!E62))","v":""}]
[{"$nulls":9},{"$f":"IF(Meetings1!A63=\"\",\"\",Meetings1!A63)","v":""},{"$f":"IF(Meetings1!B63=\"\",\"\",Meetings1!C63)","v":""},null,null,null,{"$f":"IF(Meetings1!B63=\"\",\"\",getAddress(Meetings1!E63))","v":""}]
[{"$nulls":9},{"$f":"IF(Meetings1!A64=\"\",\"\",Meetings1!A64)","v":""},{"$f":"IF(Meetings1!B64=\"\",\"\",Meetings1!C64)","v":""},null,null,null,{"$f":"IF(Meetings1!B64=\"\",\"\",getAddress(Meetings1!E64))","v":""}]
[{"$nulls":9},{"$f":"IF(Meetings1!A65=\"\",\"\",Meetings1!A65)","v":""},{"$f":"IF(Meetings1!B65=\"\",\"\",Meetings1!C65)","v":""},null,null,null,{"$f":"IF(Meetings1!B65=\"\",\"\",getAddress(Meetings1!E65))","v":""}]
[{"$nulls":9},{"$f":"IF(Meetings1!A66=\"\",\"\",Meetings1!A66)","v":""},{"$f":"IF(Meetings1!B66=\"\",\"\",Meetings1!C66)","v":""},null,null,null,{"$f":"IF(Meetings1!B66=\"\",\"\",getAddress(Meetings1!E66))","v":""}]
[{"$nulls":9},{"$f":"IF(Meetings1!A67=\"\",\"\",Meetings1!A67)","v":""},{"$f":"IF(Meetings1!B67=\"\",\"\",Meetings1!C67)","v":""},null,null,null,{"$f":"IF(Meetings1!B67=\"\",\"\",getAddress(Meetings1!E67))","v":""}]
[{"$nulls":9},{"$f":"IF(Meetings1!A68=\"\",\"\",Meetings1!A68)","v":""},{"$f":"IF(Meetings1!B68=\"\",\"\",Meetings1!C68)","v":""},null,null,null,{"$f":"IF(Meetings1!B68=\"\",\"\",getAddress(Meetings1!E68))","v":""}]
[{"$nulls":9},{"$f":"IF(Meetings1!A69=\"\",\"\",Meetings1!A69)","v":""},{"$f":"IF(Meetings1!B69=\"\",\"\",Meetings1!C69)","v":""},null,null,null,{"$f":"IF(Meetings1!B69=\"\",\"\",getAddress(Meetings1!E69))","v":""}]
[{"$nulls":9},{"$f":"IF(Meetings1!A70=\"\",\"\",Meetings1!A70)","v":""},{"$f":"IF(Meetings1!B70=\"\",\"\",Meetings1!C70)","v":""},null,null,null,{"$f":"IF(Meetings1!B70=\"\",\"\",getAddress(Meetings1!E70))","v":""}]
[{"$nulls":9},{"$f":"IF(Meetings1!A71=\"\",\"\",Meetings1!A71)","v":""},{"$f":"IF(Meetings1!B71=\"\",\"\",Meetings1!C71)","v":""},null,null,null,{"$f":"IF(Meetings1!B71=\"\",\"\",getAddress(Meetings1!E71))","v":""}]
[{"$nulls":9},{"$f":"IF(Meetings1!A72=\"\",\"\",Meetings1!A72)","v":""},{"$f":"IF(Meetings1!B72=\"\",\"\",Meetings1!C72)","v":""},null,null,null,{"$f":"IF(Meetings1!B72=\"\",\"\",getAddress(Meetings1!E72))","v":""}]
[{"$nulls":9},{"$f":"IF(Meetings1!A73=\"\",\"\",Meetings1!A73)","v":""},{"$f":"IF(Meetings1!B73=\"\",\"\",Meetings1!C73)","v":""},null,null,null,{"$f":"IF(Meetings1!B73=\"\",\"\",getAddress(Meetings1!E73))","v":""}]
[{"$nulls":9},{"$f":"IF(Meetings1!A74=\"\",\"\",Meetings1!A74)","v":""},{"$f":"IF(Meetings1!B74=\"\",\"\",Meetings1!C74)","v":""},null,null,null,{"$f":"IF(Meetings1!B74=\"\",\"\",getAddress(Meetings1!E74))","v":""}]
[{"$nulls":9},{"$f":"IF(Meetings1!A75=\"\",\"\",Meetings1!A75)","v":""},{"$f":"IF(Meetings1!B75=\"\",\"\",Meetings1!C75)","v":""},null,null,null,{"$f":"IF(Meetings1!B75=\"\",\"\",getAddress(Meetings1!E75))","v":""}]
[{"$nulls":9},{"$f":"IF(Meetings1!A76=\"\",\"\",Meetings1!A76)","v":""},{"$f":"IF(Meetings1!B76=\"\",\"\",Meetings1!C76)","v":""},null,null,null,{"$f":"IF(Meetings1!B76=\"\",\"\",getAddress(Meetings1!E76))","v":""}]
[{"$nulls":9},{"$f":"IF(Meetings1!A77=\"\",\"\",Meetings1!A77)","v":""},{"$f":"IF(Meetings1!B77=\"\",\"\",Meetings1!C77)","v":""},null,null,null,{"$f":"IF(Meetings1!B77=\"\",\"\",getAddress(Meetings1!E77))","v":""}]
[{"$nulls":9},{"$f":"IF(Meetings1!A78=\"\",\"\",Meetings1!A78)","v":""},{"$f":"IF(Meetings1!B78=\"\",\"\",Meetings1!C78)","v":""},null,null,null,{"$f":"IF(Meetings1!B78=\"\",\"\",getAddress(Meetings1!E78))","v":""}]
[{"$nulls":9},{"$f":"IF(Meetings1!A79=\"\",\"\",Meetings1!A79)","v":""},{"$f":"IF(Meetings1!B79=\"\",\"\",Meetings1!C79)","v":""},null,null,null,{"$f":"IF(Meetings1!B79=\"\",\"\",getAddress(Meetings1!E79))","v":""}]
[{"$nulls":9},{"$f":"IF(Meetings1!A80=\"\",\"\",Meetings1!A80)","v":""},{"$f":"IF(Meetings1!B80=\"\",\"\",Meetings1!C80)","v":""},null,null,null,{"$f":"IF(Meetings1!B80=\"\",\"\",getAddress(Meetings1!E80))","v":""}]
[{"$nulls":9},{"$f":"IF(Meetings1!A81=\"\",\"\",Meetings1!A81)","v":""},{"$f":"IF(Meetings1!B81=\"\",\"\",Meetings1!C81)","v":""},null,null,null,{"$f":"IF(Meetings1!B81=\"\",\"\",getAddress(Meetings1!E81))","v":""}]
[{"$nulls":9},{"$f":"IF(Meetings1!A82=\"\",\"\",Meetings1!A82)","v":""},{"$f":"IF(Meetings1!B82=\"\",\"\",Meetings1!C82)","v":""},null,null,null,{"$f":"IF(Meetings1!B82=\"\",\"\",getAddress(Meetings1!E82))","v":""}]
[{"$nulls":9},{"$f":"IF(Meetings1!A83=\"\",\"\",Meetings1!A83)","v":""},{"$f":"IF(Meetings1!B83=\"\",\"\",Meetings1!C83)","v":""},null,null,null,{"$f":"IF(Meetings1!B83=\"\",\"\",getAddress(Meetings1!E83))","v":""}]
[{"$nulls":9},{"$f":"IF(Meetings1!A84=\"\",\"\",Meetings1!A84)","v":""},{"$f":"IF(Meetings1!B84=\"\",\"\",Meetings1!C84)","v":""},null,null,null,{"$f":"IF(Meetings1!B84=\"\",\"\",getAddress(Meetings1!E84))","v":""}]
[{"$nulls":9},{"$f":"IF(Meetings1!A85=\"\",\"\",Meetings1!A85)","v":""},{"$f":"IF(Meetings1!B85=\"\",\"\",Meetings1!C85)","v":""},null,null,null,{"$f":"IF(Meetings1!B85=\"\",\"\",getAddress(Meetings1!E85))","v":""}]
[{"$nulls":9},{"$f":"IF(Meetings1!A86=\"\",\"\",Meetings1!A86)","v":""},{"$f":"IF(Meetings1!B86=\"\",\"\",Meetings1!C86)","v":""},null,null,null,{"$f":"IF(Meetings1!B86=\"\",\"\",getAddress(Meetings1!E86))","v":""}]
[{"$nulls":9},{"$f":"IF(Meetings1!A87=\"\",\"\",Meetings1!A87)","v":""},{"$f":"IF(Meetings1!B87=\"\",\"\",Meetings1!C87)","v":""},null,null,null,{"$f":"IF(Meetings1!B87=\"\",\"\",getAddress(Meetings1!E87))","v":""}]
[{"$nulls":9},{"$f":"IF(Meetings1!A88=\"\",\"\",Meetings1!A88)","v":""},{"$f":"IF(Meetings1!B88=\"\",\"\",Meetings1!C88)","v":""},null,null,null,{"$f":"IF(Meetings1!B88=\"\",\"\",getAddress(Meetings1!E88))","v":""}]
[{"$nulls":9},{"$f":"IF(Meetings1!A89=\"\",\"\",Meetings1!A89)","v":""},{"$f":"IF(Meetings1!B89=\"\",\"\",Meetings1!C89)","v":""},null,null,null,{"$f":"IF(Meetings1!B89=\"\",\"\",getAddress(Meetings1!E89))","v":""}]
[{"$nulls":9},{"$f":"IF(Meetings1!A90=\"\",\"\",Meetings1!A90)","v":""},{"$f":"IF(Meetings1!B90=\"\",\"\",Meetings1!C90)","v":""},null,null,null,{"$f":"IF(Meetings1!B90=\"\",\"\",getAddress(Meetings1!E90))","v":""}]
[{"$nulls":9},{"$f":"IF(Meetings1!A91=\"\",\"\",Meetings1!A91)","v":""},{"$f":"IF(Meetings1!B91=\"\",\"\",Meetings1!C91)","v":""},null,null,null,{"$f":"IF(Meetings1!B91=\"\",\"\",getAddress(Meetings1!E91))","v":""}]
[{"$nulls":9},{"$f":"IF(Meetings1!A92=\"\",\"\",Meetings1!A92)","v":""},{"$f":"IF(Meetings1!B92=\"\",\"\",Meetings1!C92)","v":""},null,null,null,{"$f":"IF(Meetings1!B92=\"\",\"\",getAddress(Meetings1!E92))","v":""}]
[{"$nulls":9},{"$f":"IF(Meetings1!A93=\"\",\"\",Meetings1!A93)","v":""},{"$f":"IF(Meetings1!B93=\"\",\"\",Meetings1!C93)","v":""},null,null,null,{"$f":"IF(Meetings1!B93=\"\",\"\",getAddress(Meetings1!E93))","v":""}]
[{"$nulls":9},{"$f":"IF(Meetings1!A94=\"\",\"\",Meetings1!A94)","v":""},{"$f":"IF(Meetings1!B94=\"\",\"\",Meetings1!C94)","v":""},null,null,null,{"$f":"IF(Meetings1!B94=\"\",\"\",getAddress(Meetings1!E94))","v":""}]
[{"$nulls":9},{"$f":"IF(Meetings1!A95=\"\",\"\",Meetings1!A95)","v":""},{"$f":"IF(Meetings1!B95=\"\",\"\",Meetings1!C95)","v":""},null,null,null,{"$f":"IF(Meetings1!B95=\"\",\"\",getAddress(Meetings1!E95))","v":""}]
[{"$nulls":9},{"$f":"IF(Meetings1!A96=\"\",\"\",Meetings1!A96)","v":""},{"$f":"IF(Meetings1!B96=\"\",\"\",Meetings1!C96)","v":""},null,null,null,{"$f":"IF(Meetings1!B96=\"\",\"\",getAddress(Meetings1!E96))","v":""}]
[{"$nulls":9},{"$f":"IF(Meetings1!A97=\"\",\"\",Meetings1!A97)","v":""},{"$f":"IF(Meetings1!B97=\"\",\"\",Meetings1!C97)","v":""},null,null,null,{"$f":"IF(Meetings1!B97=\"\",\"\",getAddress(Meetings1!E97))","v":""}]
[{"$nulls":9},{"$f":"IF(Meetings1!A98=\"\",\"\",Meetings1!A98)","v":""},{"$f":"IF(Meetings1!B98=\"\",\"\",Meetings1!C98)","v":""},null,null,null,{"$f":"IF(Meetings1!B98=\"\",\"\",getAddress(Meetings1!E98))","v":""}]
[{"$nulls":9},{"$f":"IF(Meetings1!A99=\"\",\"\",Meetings1!A99)","v":""},{"$f":"IF(Meetings1!B99=\"\",\"\",Meetings1!C99)","v":""},null,null,null,{"$f":"IF(Meetings1!B99=\"\",\"\",getAddress(Meetings1!E99))","v":""}]
[{"$nulls":9},{"$f":"IF(Meetings1!A100=\"\",\"\",Meetings1!A100)","v":""},{"$f":"IF(Meetings1!B100=\"\",\"\",Meetings1!C100)","v":""},null,null,null,{"$f":"IF(Meetings1!B100=\"\",\"\",getAddress(Meetings1!E100))","v":""}]
[{"$nulls":9},{"$f":"IF(Meetings1!A101=\"\",\"\",Meetings1!A101)","v":""},{"$f":"IF(Meetings1!B101=\"\",\"\",Meetings1!C101)","v":""},null,null,null,{"$f":"IF(Meetings1!B101=\"\",\"\",getAddress(Meetings1!E101))","v":""}]
[{"$nulls":9},{"$f":"IF(Meetings1!A102=\"\",\"\",Meetings1!A102)","v":""},{"$f":"IF(Meetings1!B102=\"\",\"\",Meetings1!C102)","v":""},null,null,null,{"$f":"IF(Meetings1!B102=\"\",\"\",getAddress(Meetings1!E102))","v":""}]
[{"$nulls":9},{"$f":"IF(Meetings1!A103=\"\",\"\",Meetings1!A103)","v":""},{"$f":"IF(Meetings1!B103=\"\",\"\",Meetings1!C103)","v":""},null,null,null,{"$f":"IF(Meetings1!B103=\"\",\"\",getAddress(Meetings1!E103))","v":""}]
[{"$nulls":9},{"$f":"IF(Meetings1!A104=\"\",\"\",Meetings1!A104)","v":""},{"$f":"IF(Meetings1!B104=\"\",\"\",Meetings1!C104)","v":""},null,null,null,{"$f":"IF(Meetings1!B104=\"\",\"\",getAddress(Meetings1!E104))","v":""}]
[{"$nulls":9},{"$f":"IF(Meetings1!A105=\"\",\"\",Meetings1!A105)","v":""},{"$f":"IF(Meetings1!B105=\"\",\"\",Meetings1!C105)","v":""},null,null,null,{"$f":"IF(Meetings1!B105=\"\",\"\",getAddress(Meetings1!E105))","v":""}]
[{"$nulls":9},{"$f":"IF(Meetings1!A106=\"\",\"\",Meetings1!A106)","v":""},{"$f":"IF(Meetings1!B106=\"\",\"\",Meetings1!C106)","v":""},null,null,null,{"$f":"IF(Meetings1!B106=\"\",\"\",getAddress(Meetings1!E106))","v":""}]
[{"$nulls":9},{"$f":"IF(Meetings1!A107=\"\",\"\",Meetings1!A107)","v":""},{"$f":"IF(Meetings1!B107=\"\",\"\",Meetings1!C107)","v":""},null,null,null,{"$f":"IF(Meetings1!B107=\"\",\"\",getAddress(Meetings1!E107))","v":""}]
[{"$nulls":9},{"$f":"IF(Meetings1!A108=\"\",\"\",Meetings1!A108)","v":""},{"$f":"IF(Meetings1!B108=\"\",\"\",Meetings1!C108)","v":""},null,null,null,{"$f":"IF(Meetings1!B108=\"\",\"\",getAddress(Meetings1!E108))","v":""}]
[{"$nulls":9},{"$f":"IF(Meetings1!A109=\"\",\"\",Meetings1!A109)","v":""},{"$f":"IF(Meetings1!B109=\"\",\"\",Meetings1!C109)","v":""},null,null,null,{"$f":"IF(Meetings1!B109=\"\",\"\",getAddress(Meetings1!E109))","v":""}]
[{"$nulls":9},{"$f":"IF(Meetings1!A110=\"\",\"\",Meetings1!A110)","v":""},{"$f":"IF(Meetings1!B110=\"\",\"\",Meetings1!C110)","v":""},null,null,null,{"$f":"IF(Meetings1!B110=\"\",\"\",getAddress(Meetings1!E110))","v":""}]
[{"$nulls":9},{"$f":"IF(Meetings1!A111=\"\",\"\",Meetings1!A111)","v":""},{"$f":"IF(Meetings1!B111=\"\",\"\",Meetings1!C111)","v":""},null,null,null,{"$f":"IF(Meetings1!B111=\"\",\"\",getAddress(Meetings1!E111))","v":""}]
[{"$nulls":9},{"$f":"IF(Meetings1!A112=\"\",\"\",Meetings1!A112)","v":""},{"$f":"IF(Meetings1!B112=\"\",\"\",Meetings1!C112)","v":""},null,null,null,{"$f":"IF(Meetings1!B112=\"\",\"\",getAddress(Meetings1!E112))","v":""}]
[{"$nulls":9},{"$f":"IF(Meetings1!A113=\"\",\"\",Meetings1!A113)","v":""},{"$f":"IF(Meetings1!B113=\"\",\"\",Meetings1!C113)","v":""},null,null,null,{"$f":"IF(Meetings1!B113=\"\",\"\",getAddress(Meetings1!E113))","v":""}]
[{"$nulls":9},{"$f":"IF(Meetings1!A114=\"\",\"\",Meetings1!A114)","v":""},{"$f":"IF(Meetings1!B114=\"\",\"\",Meetings1!C114)","v":""},null,null,null,{"$f":"IF(Meetings1!B114=\"\",\"\",getAddress(Meetings1!E114))","v":""}]
[{"$nulls":9},{"$f":"IF(Meetings1!A115=\"\",\"\",Meetings1!A115)","v":""},{"$f":"IF(Meetings1!B115=\"\",\"\",Meetings1!C115)","v":""},null,null,null,{"$f":"IF(Meetings1!B115=\"\",\"\",getAddress(Meetings1!E115))","v":""}]
[{"$nulls":9},{"$f":"IF(Meetings1!A116=\"\",\"\",Meetings1!A116)","v":""},{"$f":"IF(Meetings1!B116=\"\",\"\",Meetings1!C116)","v":""},null,null,null,{"$f":"IF(Meetings1!B116=\"\",\"\",getAddress(Meetings1!E116))","v":""}]
[{"$nulls":9},{"$f":"IF(Meetings1!A117=\"\",\"\",Meetings1!A117)","v":""},{"$f":"IF(Meetings1!B117=\"\",\"\",Meetings1!C117)","v":""},null,null,null,{"$f":"IF(Meetings1!B117=\"\",\"\",getAddress(Meetings1!E117))","v":""}]
[{"$nulls":9},{"$f":"IF(Meetings1!A118=\"\",\"\",Meetings1!A118)","v":""},{"$f":"IF(Meetings1!B118=\"\",\"\",Meetings1!C118)","v":""},null,null,null,{"$f":"IF(Meetings1!B118=\"\",\"\",getAddress(Meetings1!E118))","v":""}]
[{"$nulls":9},{"$f":"IF(Meetings1!A119=\"\",\"\",Meetings1!A119)","v":""},{"$f":"IF(Meetings1!B119=\"\",\"\",Meetings1!C119)","v":""},null,null,null,{"$f":"IF(Meetings1!B119=\"\",\"\",getAddress(Meetings1!E119))","v":""}]
[{"$nulls":9},{"$f":"IF(Meetings1!A120=\"\",\"\",Meetings1!A120)","v":""},{"$f":"IF(Meetings1!B120=\"\",\"\",Meetings1!C120)","v":""},null,null,null,{"$f":"IF(Meetings1!B120=\"\",\"\",getAddress(Meetings1!E120))","v":""}]
[{"$nulls":9},{"$f":"IF(Meetings1!A121=\"\",\"\",Meetings1!A121)","v":""},{"$f":"IF(Meetings1!B121=\"\",\"\",Meetings1!C121)","v":""},null,null,null,{"$f":"IF(Meetings1!B121=\"\",\"\",getAddress(Meetings1!E121))","v":""}]
[{"$nulls":9},{"$f":"IF(Meetings1!A122=\"\",\"\",Meetings1!A122)","v":""},{"$f":"IF(Meetings1!B122=\"\",\"\",Meetings1!C122)","v":""},null,null,null,{"$f":"IF(Meetings1!B122=\"\",\"\",getAddress(Meetings1!E122))","v":""}]
[{"$nulls":9},{"$f":"IF(Meetings1!A123=\"\",\"\",Meetings1!A123)","v":""},{"$f":"IF(Meetings1!B123=\"\",\"\",Meetings1!C123)","v":""},null,null,null,{"$f":"IF(Meetings1!B123=\"\",\"\",getAddress(Meetings1!E123))","v":""}]
[{"$nulls":9},{"$f":"IF(Meetings1!A124=\"\",\"\",Meetings1!A124)","v":""},{"$f":"IF(Meetings1!B124=\"\",\"\",Meetings1!C124)","v":""},null,null,null,{"$f":"IF(Meetings1!B124=\"\",\"\",getAddress(Meetings1!E124))","v":""}]
[{"$nulls":9},{"$f":"IF(Meetings1!A125=\"\",\"\",Meetings1!A125)","v":""},{"$f":"IF(Meetings1!B125=\"\",\"\",Meetings1!C125)","v":""},null,null,null,{"$f":"IF(Meetings1!B125=\"\",\"\",getAddress(Meetings1!E125))","v":""}]
[{"$nulls":9},{"$f":"IF(Meetings1!A126=\"\",\"\",Meetings1!A126)","v":""},{"$f":"IF(Meetings1!B126=\"\",\"\",Meetings1!C126)","v":""},null,null,null,{"$f":"IF(Meetings1!B126=\"\",\"\",getAddress(Meetings1!E126))","v":""}]
[{"$nulls":9},{"$f":"IF(Meetings1!A127=\"\",\"\",Meetings1!A127)","v":""},{"$f":"IF(Meetings1!B127=\"\",\"\",Meetings1!C127)","v":""},null,null,null,{"$f":"IF(Meetings1!B127=\"\",\"\",getAddress(Meetings1!E127))","v":""}]
[{"$nulls":9},{"$f":"IF(Meetings1!A128=\"\",\"\",Meetings1!A128)","v":""},{"$f":"IF(Meetings1!B128=\"\",\"\",Meetings1!C128)","v":""},null,null,null,{"$f":"IF(Meetings1!B128=\"\",\"\",getAddress(Meetings1!E128))","v":""}]
[{"$nulls":9},{"$f":"IF(Meetings1!A129=\"\",\"\",Meetings1!A129)","v":""},{"$f":"IF(Meetings1!B129=\"\",\"\",Meetings1!C129)","v":""},null,null,null,{"$f":"IF(Meetings1!B129=\"\",\"\",getAddress(Meetings1!E129))","v":""}]
[{"$nulls":9},{"$f":"IF(Meetings1!A130=\"\",\"\",Meetings1!A130)","v":""},{"$f":"IF(Meetings1!B130=\"\",\"\",Meetings1!C130)","v":""},null,null,null,{"$f":"IF(Meetings1!B130=\"\",\"\",getAddress(Meetings1!E130))","v":""}]
[{"$nulls":9},{"$f":"IF(Meetings1!A131=\"\",\"\",Meetings1!A131)","v":""},{"$f":"IF(Meetings1!B131=\"\",\"\",Meetings1!C131)","v":""},null,null,null,{"$f":"IF(Meetings1!B131=\"\",\"\",getAddress(Meetings1!E131))","v":""}]
[{"$nulls":9},{"$f":"IF(Meetings1!A132=\"\",\"\",Meetings1!A132)","v":""},{"$f":"IF(Meetings1!B132=\"\",\"\",Meetings1!C132)","v":""},null,null,null,{"$f":"IF(Meetings1!B132=\"\",\"\",getAddress(Meetings1!E132))","v":""}]
[{"$nulls":9},{"$f":"IF(Meetings1!A133=\"\",\"\",Meetings1!A133)","v":""},{"$f":"IF(Meetings1!B133=\"\",\"\",Meetings1!C133)","v":""},null,null,null,{"$f":"IF(Meetings1!B133=\"\",\"\",getAddress(Meetings1!E133))","v":""}]
[{"$nulls":9},{"$f":"IF(Meetings1!A134=\"\",\"\",Meetings1!A134)","v":""},{"$f":"IF(Meetings1!B134=\"\",\"\",Meetings1!C134)","v":""},null,null,null,{"$f":"IF(Meetings1!B134=\"\",\"\",getAddress(Meetings1!E134))","v":""}]
[{"$nulls":9},{"$f":"IF(Meetings1!A135=\"\",\"\",Meetings1!A135)","v":""},{"$f":"IF(Meetings1!B135=\"\",\"\",Meetings1!C135)","v":""},null,null,null,{"$f":"IF(Meetings1!B135=\"\",\"\",getAddress(Meetings1!E135))","v":""}]
[{"$nulls":9},{"$f":"IF(Meetings1!A136=\"\",\"\",Meetings1!A136)","v":""},{"$f":"IF(Meetings1!B136=\"\",\"\",Meetings1!C136)","v":""},null,null,null,{"$f":"IF(Meetings1!B136=\"\",\"\",getAddress(Meetings1!E136))","v":""}]
[{"$nulls":9},{"$f":"IF(Meetings1!A137=\"\",\"\",Meetings1!A137)","v":""},{"$f":"IF(Meetings1!B137=\"\",\"\",Meetings1!C137)","v":""},null,null,null,{"$f":"IF(Meetings1!B137=\"\",\"\",getAddress(Meetings1!E137))","v":""}]
[{"$nulls":9},{"$f":"IF(Meetings1!A138=\"\",\"\",Meetings1!A138)","v":""},{"$f":"IF(Meetings1!B138=\"\",\"\",Meetings1!C138)","v":""},null,null,null,{"$f":"IF(Meetings1!B138=\"\",\"\",getAddress(Meetings1!E138))","v":""}]
[{"$nulls":9},{"$f":"IF(Meetings1!A139=\"\",\"\",Meetings1!A139)","v":""},{"$f":"IF(Meetings1!B139=\"\",\"\",Meetings1!C139)","v":""},null,null,null,{"$f":"IF(Meetings1!B139=\"\",\"\",getAddress(Meetings1!E139))","v":""}]
[{"$nulls":9},{"$f":"IF(Meetings1!A140=\"\",\"\",Meetings1!A140)","v":""},{"$f":"IF(Meetings1!B140=\"\",\"\",Meetings1!C140)","v":""},null,null,null,{"$f":"IF(Meetings1!B140=\"\",\"\",getAddress(Meetings1!E140))","v":""}]
[{"$nulls":9},{"$f":"IF(Meetings1!A141=\"\",\"\",Meetings1!A141)","v":""},{"$f":"IF(Meetings1!B141=\"\",\"\",Meetings1!C141)","v":""},null,null,null,{"$f":"IF(Meetings1!B141=\"\",\"\",getAddress(Meetings1!E141))","v":""}]
[{"$nulls":9},{"$f":"IF(Meetings1!A142=\"\",\"\",Meetings1!A142)","v":""},{"$f":"IF(Meetings1!B142=\"\",\"\",Meetings1!C142)","v":""},null,null,null,{"$f":"IF(Meetings1!B142=\"\",\"\",getAddress(Meetings1!E142))","v":""}]
[{"$nulls":9},{"$f":"IF(Meetings1!A143=\"\",\"\",Meetings1!A143)","v":""},{"$f":"IF(Meetings1!B143=\"\",\"\",Meetings1!C143)","v":""},null,null,null,{"$f":"IF(Meetings1!B143=\"\",\"\",getAddress(Meetings1!E143))","v":""}]
[{"$nulls":9},{"$f":"IF(Meetings1!A144=\"\",\"\",Meetings1!A144)","v":""},{"$f":"IF(Meetings1!B144=\"\",\"\",Meetings1!C144)","v":""},null,null,null,{"$f":"IF(Meetings1!B144=\"\",\"\",getAddress(Meetings1!E144))","v":""}]
[{"$nulls":9},{"$f":"IF(Meetings1!A145=\"\",\"\",Meetings1!A145)","v":""},{"$f":"IF(Meetings1!B145=\"\",\"\",Meetings1!C145)","v":""},null,null,null,{"$f":"IF(Meetings1!B145=\"\",\"\",getAddress(Meetings1!E145))","v":""}]
[{"$nulls":9},{"$f":"IF(Meetings1!A146=\"\",\"\",Meetings1!A146)","v":""},{"$f":"IF(Meetings1!B146=\"\",\"\",Meetings1!C146)","v":""},null,null,null,{"$f":"IF(Meetings1!B146=\"\",\"\",getAddress(Meetings1!E146))","v":""}]
[{"$nulls":9},{"$f":"IF(Meetings1!A147=\"\",\"\",Meetings1!A147)","v":""},{"$f":"IF(Meetings1!B147=\"\",\"\",Meetings1!C147)","v":""},null,null,null,{"$f":"IF(Meetings1!B147=\"\",\"\",getAddress(Meetings1!E147))","v":""}]
[{"$nulls":9},{"$f":"IF(Meetings1!A148=\"\",\"\",Meetings1!A148)","v":""},{"$f":"IF(Meetings1!B148=\"\",\"\",Meetings1!C148)","v":""},null,null,null,{"$f":"IF(Meetings1!B148=\"\",\"\",getAddress(Meetings1!E148))","v":""}]
[{"$nulls":9},{"$f":"IF(Meetings1!A149=\"\",\"\",Meetings1!A149)","v":""},{"$f":"IF(Meetings1!B149=\"\",\"\",Meetings1!C149)","v":""},null,null,null,{"$f":"IF(Meetings1!B149=\"\",\"\",getAddress(Meetings1!E149))","v":""}]
[{"$nulls":9},{"$f":"IF(Meetings1!A150=\"\",\"\",Meetings1!A150)","v":""},{"$f":"IF(Meetings1!B150=\"\",\"\",Meetings1!C150)","v":""},null,null,null,{"$f":"IF(Meetings1!B150=\"\",\"\",getAddress(Meetings1!E150))","v":""}]
[{"$nulls":9},{"$f":"IF(Meetings1!A151=\"\",\"\",Meetings1!A151)","v":""},{"$f":"IF(Meetings1!B151=\"\",\"\",Meetings1!C151)","v":""},null,null,null,{"$f":"IF(Meetings1!B151=\"\",\"\",getAddress(Meetings1!E151))","v":""}]
[{"$nulls":9},{"$f":"IF(Meetings1!A152=\"\",\"\",Meetings1!A152)","v":""},{"$f":"IF(Meetings1!B152=\"\",\"\",Meetings1!C152)","v":""},null,null,null,{"$f":"IF(Meetings1!B152=\"\",\"\",getAddress(Meetings1!E152))","v":""}]
[{"$nulls":9},{"$f":"IF(Meetings1!A153=\"\",\"\",Meetings1!A153)","v":""},{"$f":"IF(Meetings1!B153=\"\",\"\",Meetings1!C153)","v":""},null,null,null,{"$f":"IF(Meetings1!B153=\"\",\"\",getAddress(Meetings1!E153))","v":""}]
[{"$nulls":9},{"$f":"IF(Meetings1!A154=\"\",\"\",Meetings1!A154)","v":""},{"$f":"IF(Meetings1!B154=\"\",\"\",Meetings1!C154)","v":""},null,null,null,{"$f":"IF(Meetings1!B154=\"\",\"\",getAddress(Meetings1!E154))","v":""}]
[{"$nulls":9},{"$f":"IF(Meetings1!A155=\"\",\"\",Meetings1!A155)","v":""},{"$f":"IF(Meetings1!B155=\"\",\"\",Meetings1!C155)","v":""},null,null,null,{"$f":"IF(Meetings1!B155=\"\",\"\",getAddress(Meetings1!E155))","v":""}]
[{"$nulls":9},{"$f":"IF(Meetings1!A156=\"\",\"\",Meetings1!A156)","v":""},{"$f":"IF(Meetings1!B156=\"\",\"\",Meetings1!C156)","v":""},null,null,null,{"$f":"IF(Meetings1!B156=\"\",\"\",getAddress(Meetings1!E156))","v":""}]
[{"$nulls":9},{"$f":"IF(Meetings1!A157=\"\",\"\",Meetings1!A157)","v":""},{"$f":"IF(Meetings1!B157=\"\",\"\",Meetings1!C157)","v":""},null,null,null,{"$f":"IF(Meetings1!B157=\"\",\"\",getAddress(Meetings1!E157))","v":""}]
[{"$nulls":9},{"$f":"IF(Meetings1!A158=\"\",\"\",Meetings1!A158)","v":""},{"$f":"IF(Meetings1!B158=\"\",\"\",Meetings1!C158)","v":""},null,null,null,{"$f":"IF(Meetings1!B158=\"\",\"\",getAddress(Meetings1!E158))","v":""}]
[{"$nulls":9},{"$f":"IF(Meetings1!A159=\"\",\"\",Meetings1!A159)","v":""},{"$f":"IF(Meetings1!B159=\"\",\"\",Meetings1!C159)","v":""},null,null,null,{"$f":"IF(Meetings1!B159=\"\",\"\",getAddress(Meetings1!E159))","v":""}]
[{"$nulls":9},{"$f":"IF(Meetings1!A160=\"\",\"\",Meetings1!A160)","v":""},{"$f":"IF(Meetings1!B160=\"\",\"\",Meetings1!C160)","v":""},null,null,null,{"$f":"IF(Meetings1!B160=\"\",\"\",getAddress(Meetings1!E160))","v":""}]
[{"$nulls":9},{"$f":"IF(Meetings1!A161=\"\",\"\",Meetings1!A161)","v":""},{"$f":"IF(Meetings1!B161=\"\",\"\",Meetings1!C161)","v":""},null,null,null,{"$f":"IF(Meetings1!B161=\"\",\"\",getAddress(Meetings1!E161))","v":""}]
[{"$nulls":9},{"$f":"IF(Meetings1!A162=\"\",\"\",Meetings1!A162)","v":""},{"$f":"IF(Meetings1!B162=\"\",\"\",Meetings1!C162)","v":""},null,null,null,{"$f":"IF(Meetings1!B162=\"\",\"\",getAddress(Meetings1!E162))","v":""}]
[{"$nulls":9},{"$f":"IF(Meetings1!A163=\"\",\"\",Meetings1!A163)","v":""},{"$f":"IF(Meetings1!B163=\"\",\"\",Meetings1!C163)","v":""},null,null,null,{"$f":"IF(Meetings1!B163=\"\",\"\",getAddress(Meetings1!E163))","v":""}]
[{"$nulls":9},{"$f":"IF(Meetings1!A164=\"\",\"\",Meetings1!A164)","v":""},{"$f":"IF(Meetings1!B164=\"\",\"\",Meetings1!C164)","v":""},null,null,null,{"$f":"IF(Meetings1!B164=\"\",\"\",getAddress(Meetings1!E164))","v":""}]
[{"$nulls":9},{"$f":"IF(Meetings1!A165=\"\",\"\",Meetings1!A165)","v":""},{"$f":"IF(Meetings1!B165=\"\",\"\",Meetings1!C165)","v":""},null,null,null,{"$f":"IF(Meetings1!B165=\"\",\"\",getAddress(Meetings1!E165))","v":""}]
[{"$nulls":9},{"$f":"IF(Meetings1!A166=\"\",\"\",Meetings1!A166)","v":""},{"$f":"IF(Meetings1!B166=\"\",\"\",Meetings1!C166)","v":""},null,null,null,{"$f":"IF(Meetings1!B166=\"\",\"\",getAddress(Meetings1!E166))","v":""}]
[{"$nulls":9},{"$f":"IF(Meetings1!A167=\"\",\"\",Meetings1!A167)","v":""},{"$f":"IF(Meetings1!B167=\"\",\"\",Meetings1!C167)","v":""},null,null,null,{"$f":"IF(Meetings1!B167=\"\",\"\",getAddress(Meetings1!E167))","v":""}]
[{"$nulls":9},{"$f":"IF(Meetings1!A168=\"\",\"\",Meetings1!A168)","v":""},{"$f":"IF(Meetings1!B168=\"\",\"\",Meetings1!C168)","v":""},null,null,null,{"$f":"IF(Meetings1!B168=\"\",\"\",getAddress(Meetings1!E168))","v":""}]
[{"$nulls":9},{"$f":"IF(Meetings1!A169=\"\",\"\",Meetings1!A169)","v":""},{"$f":"IF(Meetings1!B169=\"\",\"\",Meetings1!C169)","v":""},null,null,null,{"$f":"IF(Meetings1!B169=\"\",\"\",getAddress(Meetings1!E169))","v":""}]
[{"$nulls":9},{"$f":"IF(Meetings1!A170=\"\",\"\",Meetings1!A170)","v":""},{"$f":"IF(Meetings1!B170=\"\",\"\",Meetings1!C170)","v":""},null,null,null,{"$f":"IF(Meetings1!B170=\"\",\"\",getAddress(Meetings1!E170))","v":""}]
[{"$nulls":9},{"$f":"IF(Meetings1!A171=\"\",\"\",Meetings1!A171)","v":""},{"$f":"IF(Meetings1!B171=\"\",\"\",Meetings1!C171)","v":""},null,null,null,{"$f":"IF(Meetings1!B171=\"\",\"\",getAddress(Meetings1!E171))","v":""}]
[{"$nulls":9},{"$f":"IF(Meetings1!A172=\"\",\"\",Meetings1!A172)","v":""},{"$f":"IF(Meetings1!B172=\"\",\"\",Meetings1!C172)","v":""},null,null,null,{"$f":"IF(Meetings1!B172=\"\",\"\",getAddress(Meetings1!E172))","v":""}]
[{"$nulls":9},{"$f":"IF(Meetings1!A173=\"\",\"\",Meetings1!A173)","v":""},{"$f":"IF(Meetings1!B173=\"\",\"\",Meetings1!C173)","v":""},null,null,null,{"$f":"IF(Meetings1!B173=\"\",\"\",getAddress(Meetings1!E173))","v":""}]
[{"$nulls":9},{"$f":"IF(Meetings1!A174=\"\",\"\",Meetings1!A174)","v":""},{"$f":"IF(Meetings1!B174=\"\",\"\",Meetings1!C174)","v":""},null,null,null,{"$f":"IF(Meetings1!B174=\"\",\"\",getAddress(Meetings1!E174))","v":""}]
[{"$nulls":9},{"$f":"IF(Meetings1!A175=\"\",\"\",Meetings1!A175)","v":""},{"$f":"IF(Meetings1!B175=\"\",\"\",Meetings1!C175)","v":""},null,null,null,{"$f":"IF(Meetings1!B175=\"\",\"\",getAddress(Meetings1!E175))","v":""}]
[{"$nulls":9},{"$f":"IF(Meetings1!A176=\"\",\"\",Meetings1!A176)","v":""},{"$f":"IF(Meetings1!B176=\"\",\"\",Meetings1!C176)","v":""},null,null,null,{"$f":"IF(Meetings1!B176=\"\",\"\",getAddress(Meetings1!E176))","v":""}]
[{"$nulls":9},{"$f":"IF(Meetings1!A177=\"\",\"\",Meetings1!A177)","v":""},{"$f":"IF(Meetings1!B177=\"\",\"\",Meetings1!C177)","v":""},null,null,null,{"$f":"IF(Meetings1!B177=\"\",\"\",getAddress(Meetings1!E177))","v":""}]
[{"$nulls":9},{"$f":"IF(Meetings1!A178=\"\",\"\",Meetings1!A178)","v":""},{"$f":"IF(Meetings1!B178=\"\",\"\",Meetings1!C178)","v":""},null,null,null,{"$f":"IF(Meetings1!B178=\"\",\"\",getAddress(Meetings1!E178))","v":""}]
[{"$nulls":9},{"$f":"IF(Meetings1!A179=\"\",\"\",Meetings1!A179)","v":""},{"$f":"IF(Meetings1!B179=\"\",\"\",Meetings1!C179)","v":""},null,null,null,{"$f":"IF(Meetings1!B179=\"\",\"\",getAddress(Meetings1!E179))","v":""}]
[{"$nulls":9},{"$f":"IF(Meetings1!A180=\"\",\"\",Meetings1!A180)","v":""},{"$f":"IF(Meetings1!B180=\"\",\"\",Meetings1!C180)","v":""},null,null,null,{"$f":"IF(Meetings1!B180=\"\",\"\",getAddress(Meetings1!E180))","v":""}]
[{"$nulls":9},{"$f":"IF(Meetings1!A181=\"\",\"\",Meetings1!A181)","v":""},{"$f":"IF(Meetings1!B181=\"\",\"\",Meetings1!C181)","v":""},null,null,null,{"$f":"IF(Meetings1!B181=\"\",\"\",getAddress(Meetings1!E181))","v":""}]
[{"$nulls":9},{"$f":"IF(Meetings1!A182=\"\",\"\",Meetings1!A182)","v":""},{"$f":"IF(Meetings1!B182=\"\",\"\",Meetings1!C182)","v":""},null,null,null,{"$f":"IF(Meetings1!B182=\"\",\"\",getAddress(Meetings1!E182))","v":""}]
[{"$nulls":9},{"$f":"IF(Meetings1!A183=\"\",\"\",Meetings1!A183)","v":""},{"$f":"IF(Meetings1!B183=\"\",\"\",Meetings1!C183)","v":""},null,null,null,{"$f":"IF(Meetings1!B183=\"\",\"\",getAddress(Meetings1!E183))","v":""}]
[{"$nulls":9},{"$f":"IF(Meetings1!A184=\"\",\"\",Meetings1!A184)","v":""},{"$f":"IF(Meetings1!B184=\"\",\"\",Meetings1!C184)","v":""},null,null,null,{"$f":"IF(Meetings1!B184=\"\",\"\",getAddress(Meetings1!E184))","v":""}]
[{"$nulls":9},{"$f":"IF(Meetings1!A185=\"\",\"\",Meetings1!A185)","v":""},{"$f":"IF(Meetings1!B185=\"\",\"\",Meetings1!C185)","v":""},null,null,null,{"$f":"IF(Meetings1!B185=\"\",\"\",getAddress(Meetings1!E185))","v":""}]
[{"$nulls":9},{"$f":"IF(Meetings1!A186=\"\",\"\",Meetings1!A186)","v":""},{"$f":"IF(Meetings1!B186=\"\",\"\",Meetings1!C186)","v":""},null,null,null,{"$f":"IF(Meetings1!B186=\"\",\"\",getAddress(Meetings1!E186))","v":""}]
[{"$nulls":9},{"$f":"IF(Meetings1!A187=\"\",\"\",Meetings1!A187)","v":""},{"$f":"IF(Meetings1!B187=\"\",\"\",Meetings1!C187)","v":""},null,null,null,{"$f":"IF(Meetings1!B187=\"\",\"\",getAddress(Meetings1!E187))","v":""}]
[{"$nulls":9},{"$f":"IF(Meetings1!A188=\"\",\"\",Meetings1!A188)","v":""},{"$f":"IF(Meetings1!B188=\"\",\"\",Meetings1!C188)","v":""},null,null,null,{"$f":"IF(Meetings1!B188=\"\",\"\",getAddress(Meetings1!E188))","v":""}]
[{"$nulls":9},{"$f":"IF(Meetings1!A189=\"\",\"\",Meetings1!A189)","v":""},{"$f":"IF(Meetings1!B189=\"\",\"\",Meetings1!C189)","v":""},null,null,null,{"$f":"IF(Meetings1!B189=\"\",\"\",getAddress(Meetings1!E189))","v":""}]
[{"$nulls":9},{"$f":"IF(Meetings1!A190=\"\",\"\",Meetings1!A190)","v":""},{"$f":"IF(Meetings1!B190=\"\",\"\",Meetings1!C190)","v":""},null,null,null,{"$f":"IF(Meetings1!B190=\"\",\"\",getAddress(Meetings1!E190))","v":""}]
[{"$nulls":9},{"$f":"IF(Meetings1!A191=\"\",\"\",Meetings1!A191)","v":""},{"$f":"IF(Meetings1!B191=\"\",\"\",Meetings1!C191)","v":""},null,null,null,{"$f":"IF(Meetings1!B191=\"\",\"\",getAddress(Meetings1!E191))","v":""}]
[{"$nulls":9},{"$f":"IF(Meetings1!A192=\"\",\"\",Meetings1!A192)","v":""},{"$f":"IF(Meetings1!B192=\"\",\"\",Meetings1!C192)","v":""},null,null,null,{"$f":"IF(Meetings1!B192=\"\",\"\",getAddress(Meetings1!E192))","v":""}]
[{"$nulls":9},{"$f":"IF(Meetings1!A193=\"\",\"\",Meetings1!A193)","v":""},{"$f":"IF(Meetings1!B193=\"\",\"\",Meetings1!C193)","v":""},null,null,null,{"$f":"IF(Meetings1!B193=\"\",\"\",getAddress(Meetings1!E193))","v":""}]
[{"$nulls":9},{"$f":"IF(Meetings1!A194=\"\",\"\",Meetings1!A194)","v":""},{"$f":"IF(Meetings1!B194=\"\",\"\",Meetings1!C194)","v":""},null,null,null,{"$f":"IF(Meetings1!B194=\"\",\"\",getAddress(Meetings1!E194))","v":""}]
[{"$nulls":9},{"$f":"IF(Meetings1!A195=\"\",\"\",Meetings1!A195)","v":""},{"$f":"IF(Meetings1!B195=\"\",\"\",Meetings1!C195)","v":""},null,null,null,{"$f":"IF(Meetings1!B195=\"\",\"\",getAddress(Meetings1!E195))","v":""}]
[{"$nulls":9},{"$f":"IF(Meetings1!A196=\"\",\"\",Meetings1!A196)","v":""},{"$f":"IF(Meetings1!B196=\"\",\"\",Meetings1!C196)","v":""},null,null,null,{"$f":"IF(Meetings1!B196=\"\",\"\",getAddress(Meetings1!E196))","v":""}]
[{"$nulls":9},{"$f":"IF(Meetings1!A197=\"\",\"\",Meetings1!A197)","v":""},{"$f":"IF(Meetings1!B197=\"\",\"\",Meetings1!C197)","v":""},null,null,null,{"$f":"IF(Meetings1!B197=\"\",\"\",getAddress(Meetings1!E197))","v":""}]
[{"$nulls":9},{"$f":"IF(Meetings1!A198=\"\",\"\",Meetings1!A198)","v":""},{"$f":"IF(Meetings1!B198=\"\",\"\",Meetings1!C198)","v":""},null,null,null,{"$f":"IF(Meetings1!B198=\"\",\"\",getAddress(Meetings1!E198))","v":""}]
[{"$nulls":9},{"$f":"IF(Meetings1!A199=\"\",\"\",Meetings1!A199)","v":""},{"$f":"IF(Meetings1!B199=\"\",\"\",Meetings1!C199)","v":""},null,null,null,{"$f":"IF(Meetings1!B199=\"\",\"\",getAddress(Meetings1!E199))","v":""}]
[{"$nulls":9},{"$f":"IF(Meetings1!A200=\"\",\"\",Meetings1!A200)","v":""},{"$f":"IF(Meetings1!B200=\"\",\"\",Meetings1!C200)","v":""},null,null,null,{"$f":"IF(Meetings1!B200=\"\",\"\",getAddress(Meetings1!E200))","v":""}]
[{"$nulls":9},{"$f":"IF(Meetings1!A201=\"\",\"\",Meetings1!A201)","v":""},{"$f":"IF(Meetings1!B201=\"\",\"\",Meetings1!C201)","v":""},null,null,null,{"$f":"IF(Meetings1!B201=\"\",\"\",getAddress(Meetings1!E201))","v":""}]
[{"$nulls":9},{"$f":"IF(Meetings1!A202=\"\",\"\",Meetings1!A202)","v":""},{"$f":"IF(Meetings1!B202=\"\",\"\",Meetings1!C202)","v":""},null,null,null,{"$f":"IF(Meetings1!B202=\"\",\"\",getAddress(Meetings1!E202))","v":""}]
[{"$nulls":9},{"$f":"IF(Meetings1!A203=\"\",\"\",Meetings1!A203)","v":""},{"$f":"IF(Meetings1!B203=\"\",\"\",Meetings1!C203)","v":""},null,null,null,{"$f":"IF(Meetings1!B203=\"\",\"\",getAddress(Meetings1!E203))","v":""}]
[{"$nulls":9},{"$f":"IF(Meetings1!A204=\"\",\"\",Meetings1!A204)","v":""},{"$f":"IF(Meetings1!B204=\"\",\"\",Meetings1!C204)","v":""},null,null,null,{"$f":"IF(Meetings1!B204=\"\",\"\",getAddress(Meetings1!E204))","v":""}]
[{"$nulls":9},{"$f":"IF(Meetings1!A205=\"\",\"\",Meetings1!A205)","v":""},{"$f":"IF(Meetings1!B205=\"\",\"\",Meetings1!C205)","v":""},null,null,null,{"$f":"IF(Meetings1!B205=\"\",\"\",getAddress(Meetings1!E205))","v":""}]
[{"$nulls":9},{"$f":"IF(Meetings1!A206=\"\",\"\",Meetings1!A206)","v":""},{"$f":"IF(Meetings1!B206=\"\",\"\",Meetings1!C206)","v":""},null,null,null,{"$f":"IF(Meetings1!B206=\"\",\"\",getAddress(Meetings1!E206))","v":""}]
[{"$nulls":9},{"$f":"IF(Meetings1!A207=\"\",\"\",Meetings1!A207)","v":""},{"$f":"IF(Meetings1!B207=\"\",\"\",Meetings1!C207)","v":""},null,null,null,{"$f":"IF(Meetings1!B207=\"\",\"\",getAddress(Meetings1!E207))","v":""}]
[{"$nulls":9},{"$f":"IF(Meetings1!A208=\"\",\"\",Meetings1!A208)","v":""},{"$f":"IF(Meetings1!B208=\"\",\"\",Meetings1!C208)","v":""},null,null,null,{"$f":"IF(Meetings1!B208=\"\",\"\",getAddress(Meetings1!E208))","v":""}]
[{"$nulls":9},{"$f":"IF(Meetings1!A209=\"\",\"\",Meetings1!A209)","v":""},{"$f":"IF(Meetings1!B209=\"\",\"\",Meetings1!C209)","v":""},null,null,null,{"$f":"IF(Meetings1!B209=\"\",\"\",getAddress(Meetings1!E209))","v":""}]
[{"$nulls":9},{"$f":"IF(Meetings1!A210=\"\",\"\",Meetings1!A210)","v":""},{"$f":"IF(Meetings1!B210=\"\",\"\",Meetings1!C210)","v":""},null,null,null,{"$f":"IF(Meetings1!B210=\"\",\"\",getAddress(Meetings1!E210))","v":""}]
[{"$nulls":9},{"$f":"IF(Meetings1!A211=\"\",\"\",Meetings1!A211)","v":""},{"$f":"IF(Meetings1!B211=\"\",\"\",Meetings1!C211)","v":""},null,null,null,{"$f":"IF(Meetings1!B211=\"\",\"\",getAddress(Meetings1!E211))","v":""}]
[{"$nulls":9},{"$f":"IF(Meetings1!A212=\"\",\"\",Meetings1!A212)","v":""},{"$f":"IF(Meetings1!B212=\"\",\"\",Meetings1!C212)","v":""},null,null,null,{"$f":"IF(Meetings1!B212=\"\",\"\",getAddress(Meetings1!E212))","v":""}]
[{"$nulls":9},{"$f":"IF(Meetings1!A213=\"\",\"\",Meetings1!A213)","v":""},{"$f":"IF(Meetings1!B213=\"\",\"\",Meetings1!C213)","v":""},null,null,null,{"$f":"IF(Meetings1!B213=\"\",\"\",getAddress(Meetings1!E213))","v":""}]
[{"$nulls":9},{"$f":"IF(Meetings1!A214=\"\",\"\",Meetings1!A214)","v":""},{"$f":"IF(Meetings1!B214=\"\",\"\",Meetings1!C214)","v":""},null,null,null,{"$f":"IF(Meetings1!B214=\"\",\"\",getAddress(Meetings1!E214))","v":""}]
[{"$nulls":9},{"$f":"IF(Meetings1!A215=\"\",\"\",Meetings1!A215)","v":""},{"$f":"IF(Meetings1!B215=\"\",\"\",Meetings1!C215)","v":""},null,null,null,{"$f":"IF(Meetings1!B215=\"\",\"\",getAddress(Meetings1!E215))","v":""}]
[{"$nulls":9},{"$f":"IF(Meetings1!A216=\"\",\"\",Meetings1!A216)","v":""},{"$f":"IF(Meetings1!B216=\"\",\"\",Meetings1!C216)","v":""},null,null,null,{"$f":"IF(Meetings1!B216=\"\",\"\",getAddress(Meetings1!E216))","v":""}]
[{"$nulls":9},{"$f":"IF(Meetings1!A217=\"\",\"\",Meetings1!A217)","v":""},{"$f":"IF(Meetings1!B217=\"\",\"\",Meetings1!C217)","v":""},null,null,null,{"$f":"IF(Meetings1!B217=\"\",\"\",getAddress(Meetings1!E217))","v":""}]
[{"$nulls":9},{"$f":"IF(Meetings1!A218=\"\",\"\",Meetings1!A218)","v":""},{"$f":"IF(Meetings1!B218=\"\",\"\",Meetings1!C218)","v":""},null,null,null,{"$f":"IF(Meetings1!B218=\"\",\"\",getAddress(Meetings1!E218))","v":""}]
[{"$nulls":9},{"$f":"IF(Meetings1!A219=\"\",\"\",Meetings1!A219)","v":""},{"$f":"IF(Meetings1!B219=\"\",\"\",Meetings1!C219)","v":""},null,null,null,{"$f":"IF(Meetings1!B219=\"\",\"\",getAddress(Meetings1!E219))","v":""}]
[{"$nulls":9},{"$f":"IF(Meetings1!A220=\"\",\"\",Meetings1!A220)","v":""},{"$f":"IF(Meetings1!B220=\"\",\"\",Meetings1!C220)","v":""},null,null,null,{"$f":"IF(Meetings1!B220=\"\",\"\",getAddress(Meetings1!E220))","v":""}]
[{"$nulls":9},{"$f":"IF(Meetings1!A221=\"\",\"\",Meetings1!A221)","v":""},{"$f":"IF(Meetings1!B221=\"\",\"\",Meetings1!C221)","v":""},null,null,null,{"$f":"IF(Meetings1!B221=\"\",\"\",getAddress(Meetings1!E221))","v":""}]
[{"$nulls":9},{"$f":"IF(Meetings1!A222=\"\",\"\",Meetings1!A222)","v":""},{"$f":"IF(Meetings1!B222=\"\",\"\",Meetings1!C222)","v":""},null,null,null,{"$f":"IF(Meetings1!B222=\"\",\"\",getAddress(Meetings1!E222))","v":""}]
[{"$nulls":9},{"$f":"IF(Meetings1!A223=\"\",\"\",Meetings1!A223)","v":""},{"$f":"IF(Meetings1!B223=\"\",\"\",Meetings1!C223)","v":""},null,null,null,{"$f":"IF(Meetings1!B223=\"\",\"\",getAddress(Meetings1!E223))","v":""}]
[{"$nulls":9},{"$f":"IF(Meetings1!A224=\"\",\"\",Meetings1!A224)","v":""},{"$f":"IF(Meetings1!B224=\"\",\"\",Meetings1!C224)","v":""},null,null,null,{"$f":"IF(Meetings1!B224=\"\",\"\",getAddress(Meetings1!E224))","v":""}]
[{"$nulls":9},{"$f":"IF(Meetings1!A225=\"\",\"\",Meetings1!A225)","v":""},{"$f":"IF(Meetings1!B225=\"\",\"\",Meetings1!C225)","v":""},null,null,null,{"$f":"IF(Meetings1!B225=\"\",\"\",getAddress(Meetings1!E225))","v":""}]
[{"$nulls":9},{"$f":"IF(Meetings1!A226=\"\",\"\",Meetings1!A226)","v":""},{"$f":"IF(Meetings1!B226=\"\",\"\",Meetings1!C226)","v":""},null,null,null,{"$f":"IF(Meetings1!B226=\"\",\"\",getAddress(Meetings1!E226))","v":""}]
[{"$nulls":9},{"$f":"IF(Meetings1!A227=\"\",\"\",Meetings1!A227)","v":""},{"$f":"IF(Meetings1!B227=\"\",\"\",Meetings1!C227)","v":""},null,null,null,{"$f":"IF(Meetings1!B227=\"\",\"\",getAddress(Meetings1!E227))","v":""}]
[{"$nulls":9},{"$f":"IF(Meetings1!A228=\"\",\"\",Meetings1!A228)","v":""},{"$f":"IF(Meetings1!B228=\"\",\"\",Meetings1!C228)","v":""},null,null,null,{"$f":"IF(Meetings1!B228=\"\",\"\",getAddress(Meetings1!E228))","v":""}]
[{"$nulls":9},{"$f":"IF(Meetings1!A229=\"\",\"\",Meetings1!A229)","v":""},{"$f":"IF(Meetings1!B229=\"\",\"\",Meetings1!C229)","v":""},null,null,null,{"$f":"IF(Meetings1!B229=\"\",\"\",getAddress(Meetings1!E229))","v":""}]
[{"$nulls":9},{"$f":"IF(Meetings1!A230=\"\",\"\",Meetings1!A230)","v":""},{"$f":"IF(Meetings1!B230=\"\",\"\",Meetings1!C230)","v":""},null,null,null,{"$f":"IF(Meetings1!B230=\"\",\"\",getAddress(Meetings1!E230))","v":""}]
[{"$nulls":9},{"$f":"IF(Meetings1!A231=\"\",\"\",Meetings1!A231)","v":""},{"$f":"IF(Meetings1!B231=\"\",\"\",Meetings1!C231)","v":""},null,null,null,{"$f":"IF(Meetings1!B231=\"\",\"\",getAddress(Meetings1!E231))","v":""}]
[{"$nulls":9},{"$f":"IF(Meetings1!A232=\"\",\"\",Meetings1!A232)","v":""},{"$f":"IF(Meetings1!B232=\"\",\"\",Meetings1!C232)","v":""},null,null,null,{"$f":"IF(Meetings1!B232=\"\",\"\",getAddress(Meetings1!E232))","v":""}]
[{"$nulls":9},{"$f":"IF(Meetings1!A233=\"\",\"\",Meetings1!A233)","v":""},{"$f":"IF(Meetings1!B233=\"\",\"\",Meetings1!C233)","v":""},null,null,null,{"$f":"IF(Meetings1!B233=\"\",\"\",getAddress(Meetings1!E233))","v":""}]
[{"$nulls":9},{"$f":"IF(Meetings1!A234=\"\",\"\",Meetings1!A234)","v":""},{"$f":"IF(Meetings1!B234=\"\",\"\",Meetings1!C234)","v":""},null,null,null,{"$f":"IF(Meetings1!B234=\"\",\"\",getAddress(Meetings1!E234))","v":""}]
[{"$nulls":9},{"$f":"IF(Meetings1!A235=\"\",\"\",Meetings1!A235)","v":""},{"$f":"IF(Meetings1!B235=\"\",\"\",Meetings1!C235)","v":""},null,null,null,{"$f":"IF(Meetings1!B235=\"\",\"\",getAddress(Meetings1!E235))","v":""}]
[{"$nulls":9},{"$f":"IF(Meetings1!A236=\"\",\"\",Meetings1!A236)","v":""},{"$f":"IF(Meetings1!B236=\"\",\"\",Meetings1!C236)","v":""},null,null,null,{"$f":"IF(Meetings1!B236=\"\",\"\",getAddress(Meetings1!E236))","v":""}]
[{"$nulls":9},{"$f":"IF(Meetings1!A237=\"\",\"\",Meetings1!A237)","v":""},{"$f":"IF(Meetings1!B237=\"\",\"\",Meetings1!C237)","v":""},null,null,null,{"$f":"IF(Meetings1!B237=\"\",\"\",getAddress(Meetings1!E237))","v":""}]
[{"$nulls":9},{"$f":"IF(Meetings1!A238=\"\",\"\",Meetings1!A238)","v":""},{"$f":"IF(Meetings1!B238=\"\",\"\",Meetings1!C238)","v":""},null,null,null,{"$f":"IF(Meetings1!B238=\"\",\"\",getAddress(Meetings1!E238))","v":""}]
[{"$nulls":9},{"$f":"IF(Meetings1!A239=\"\",\"\",Meetings1!A239)","v":""},{"$f":"IF(Meetings1!B239=\"\",\"\",Meetings1!C239)","v":""},null,null,null,{"$f":"IF(Meetings1!B239=\"\",\"\",getAddress(Meetings1!E239))","v":""}]
[{"$nulls":9},{"$f":"IF(Meetings1!A240=\"\",\"\",Meetings1!A240)","v":""},{"$f":"IF(Meetings1!B240=\"\",\"\",Meetings1!C240)","v":""},null,null,null,{"$f":"IF(Meetings1!B240=\"\",\"\",getAddress(Meetings1!E240))","v":""}]
[{"$nulls":9},{"$f":"IF(Meetings1!A241=\"\",\"\",Meetings1!A241)","v":""},{"$f":"IF(Meetings1!B241=\"\",\"\",Meetings1!C241)","v":""},null,null,null,{"$f":"IF(Meetings1!B241=\"\",\"\",getAddress(Meetings1!E241))","v":""}]
[{"$nulls":9},{"$f":"IF(Meetings1!A242=\"\",\"\",Meetings1!A242)","v":""},{"$f":"IF(Meetings1!B242=\"\",\"\",Meetings1!C242)","v":""},null,null,null,{"$f":"IF(Meetings1!B242=\"\",\"\",getAddress(Meetings1!E242))","v":""}]
[{"$nulls":9},{"$f":"IF(Meetings1!A243=\"\",\"\",Meetings1!A243)","v":""},{"$f":"IF(Meetings1!B243=\"\",\"\",Meetings1!C243)","v":""},null,null,null,{"$f":"IF(Meetings1!B243=\"\",\"\",getAddress(Meetings1!E243))","v":""}]
[{"$nulls":9},{"$f":"IF(Meetings1!A244=\"\",\"\",Meetings1!A244)","v":""},{"$f":"IF(Meetings1!B244=\"\",\"\",Meetings1!C244)","v":""},null,null,null,{"$f":"IF(Meetings1!B244=\"\",\"\",getAddress(Meetings1!E244))","v":""}]
[{"$nulls":9},{"$f":"IF(Meetings1!A245=\"\",\"\",Meetings1!A245)","v":""},{"$f":"IF(Meetings1!B245=\"\",\"\",Meetings1!C245)","v":""},null,null,null,{"$f":"IF(Meetings1!B245=\"\",\"\",getAddress(Meetings1!E245))","v":""}]
[{"$nulls":9},{"$f":"IF(Meetings1!A246=\"\",\"\",Meetings1!A246)","v":""},{"$f":"IF(Meetings1!B246=\"\",\"\",Meetings1!C246)","v":""},null,null,null,{"$f":"IF(Meetings1!B246=\"\",\"\",getAddress(Meetings1!E246))","v":""}]
[{"$nulls":9},{"$f":"IF(Meetings1!A247=\"\",\"\",Meetings1!A247)","v":""},{"$f":"IF(Meetings1!B247=\"\",\"\",Meetings1!C247)","v":""},null,null,null,{"$f":"IF(Meetings1!B247=\"\",\"\",getAddress(Meetings1!E247))","v":""}]
[{"$nulls":9},{"$f":"IF(Meetings1!A248=\"\",\"\",Meetings1!A248)","v":""},{"$f":"IF(Meetings1!B248=\"\",\"\",Meetings1!C248)","v":""},null,null,null,{"$f":"IF(Meetings1!B248=\"\",\"\",getAddress(Meetings1!E248))","v":""}]
[{"$nulls":9},{"$f":"IF(Meetings1!A249=\"\",\"\",Meetings1!A249)","v":""},{"$f":"IF(Meetings1!B249=\"\",\"\",Meetings1!C249)","v":""},null,null,null,{"$f":"IF(Meetings1!B249=\"\",\"\",getAddress(Meetings1!E249))","v":""}]
[{"$nulls":9},{"$f":"IF(Meetings1!A250=\"\",\"\",Meetings1!A250)","v":""},{"$f":"IF(Meetings1!B250=\"\",\"\",Meetings1!C250)","v":""},null,null,null,{"$f":"IF(Meetings1!B250=\"\",\"\",getAddress(Meetings1!E250))","v":""}]
[{"$nulls":9},{"$f":"IF(Meetings1!A251=\"\",\"\",Meetings1!A251)","v":""},{"$f":"IF(Meetings1!B251=\"\",\"\",Meetings1!C251)","v":""},null,null,null,{"$f":"IF(Meetings1!B251=\"\",\"\",getAddress(Meetings1!E251))","v":""}]
[{"$nulls":9},{"$f":"IF(Meetings1!A252=\"\",\"\",Meetings1!A252)","v":""},{"$f":"IF(Meetings1!B252=\"\",\"\",Meetings1!C252)","v":""},null,null,null,{"$f":"IF(Meetings1!B252=\"\",\"\",getAddress(Meetings1!E252))","v":""}]
[{"$nulls":9},{"$f":"IF(Meetings1!A253=\"\",\"\",Meetings1!A253)","v":""},{"$f":"IF(Meetings1!B253=\"\",\"\",Meetings1!C253)","v":""},null,null,null,{"$f":"IF(Meetings1!B253=\"\",\"\",getAddress(Meetings1!E253))","v":""}]
[{"$nulls":9},{"$f":"IF(Meetings1!A254=\"\",\"\",Meetings1!A254)","v":""},{"$f":"IF(Meetings1!B254=\"\",\"\",Meetings1!C254)","v":""},null,null,null,{"$f":"IF(Meetings1!B254=\"\",\"\",getAddress(Meetings1!E254))","v":""}]
[{"$nulls":9},{"$f":"IF(Meetings1!A255=\"\",\"\",Meetings1!A255)","v":""},{"$f":"IF(Meetings1!B255=\"\",\"\",Meetings1!C255)","v":""},null,null,null,{"$f":"IF(Meetings1!B255=\"\",\"\",getAddress(Meetings1!E255))","v":""}]
[{"$nulls":9},{"$f":"IF(Meetings1!A256=\"\",\"\",Meetings1!A256)","v":""},{"$f":"IF(Meetings1!B256=\"\",\"\",Meetings1!C256)","v":""},null,null,null,{"$f":"IF(Meetings1!B256=\"\",\"\",getAddress(Meetings1!E256))","v":""}]
[{"$nulls":9},{"$f":"IF(Meetings1!A257=\"\",\"\",Meetings1!A257)","v":""},{"$f":"IF(Meetings1!B257=\"\",\"\",Meetings1!C257)","v":""},null,null,null,{"$f":"IF(Meetings1!B257=\"\",\"\",getAddress(Meetings1!E257))","v":""}]
[{"$nulls":9},{"$f":"IF(Meetings1!A258=\"\",\"\",Meetings1!A258)","v":""},{"$f":"IF(Meetings1!B258=\"\",\"\",Meetings1!C258)","v":""},null,null,null,{"$f":"IF(Meetings1!B258=\"\",\"\",getAddress(Meetings1!E258))","v":""}]
[{"$nulls":9},{"$f":"IF(Meetings1!A259=\"\",\"\",Meetings1!A259)","v":""},{"$f":"IF(Meetings1!B259=\"\",\"\",Meetings1!C259)","v":""},null,null,null,{"$f":"IF(Meetings1!B259=\"\",\"\",getAddress(Meetings1!E259))","v":""}]
[{"$nulls":9},{"$f":"IF(Meetings1!A260=\"\",\"\",Meetings1!A260)","v":""},{"$f":"IF(Meetings1!B260=\"\",\"\",Meetings1!C260)","v":""},null,null,null,{"$f":"IF(Meetings1!B260=\"\",\"\",getAddress(Meetings1!E260))","v":""}]
[{"$nulls":9},{"$f":"IF(Meetings1!A261=\"\",\"\",Meetings1!A261)","v":""},{"$f":"IF(Meetings1!B261=\"\",\"\",Meetings1!C261)","v":""},null,null,null,{"$f":"IF(Meetings1!B261=\"\",\"\",getAddress(Meetings1!E261))","v":""}]
[{"$nulls":9},{"$f":"IF(Meetings1!A262=\"\",\"\",Meetings1!A262)","v":""},{"$f":"IF(Meetings1!B262=\"\",\"\",Meetings1!C262)","v":""},null,null,null,{"$f":"IF(Meetings1!B262=\"\",\"\",getAddress(Meetings1!E262))","v":""}]
[{"$nulls":9},{"$f":"IF(Meetings1!A263=\"\",\"\",Meetings1!A263)","v":""},{"$f":"IF(Meetings1!B263=\"\",\"\",Meetings1!C263)","v":""},null,null,null,{"$f":"IF(Meetings1!B263=\"\",\"\",getAddress(Meetings1!E263))","v":""}]
[{"$nulls":9},{"$f":"IF(Meetings1!A264=\"\",\"\",Meetings1!A264)","v":""},{"$f":"IF(Meetings1!B264=\"\",\"\",Meetings1!C264)","v":""},null,null,null,{"$f":"IF(Meetings1!B264=\"\",\"\",getAddress(Meetings1!E264))","v":""}]
[{"$nulls":9},{"$f":"IF(Meetings1!A265=\"\",\"\",Meetings1!A265)","v":""},{"$f":"IF(Meetings1!B265=\"\",\"\",Meetings1!C265)","v":""},null,null,null,{"$f":"IF(Meetings1!B265=\"\",\"\",getAddress(Meetings1!E265))","v":""}]
[{"$nulls":9},{"$f":"IF(Meetings1!A266=\"\",\"\",Meetings1!A266)","v":""},{"$f":"IF(Meetings1!B266=\"\",\"\",Meetings1!C266)","v":""},null,null,null,{"$f":"IF(Meetings1!B266=\"\",\"\",getAddress(Meetings1!E266))","v":""}]
[{"$nulls":9},{"$f":"IF(Meetings1!A267=\"\",\"\",Meetings1!A267)","v":""},{"$f":"IF(Meetings1!B267=\"\",\"\",Meetings1!C267)","v":""},null,null,null,{"$f":"IF(Meetings1!B267=\"\",\"\",getAddress(Meetings1!E267))","v":""}]
[{"$nulls":9},{"$f":"IF(Meetings1!A268=\"\",\"\",Meetings1!A268)","v":""},{"$f":"IF(Meetings1!B268=\"\",\"\",Meetings1!C268)","v":""},null,null,null,{"$f":"IF(Meetings1!B268=\"\",\"\",getAddress(Meetings1!E268))","v":""}]
[{"$nulls":9},{"$f":"IF(Meetings1!A269=\"\",\"\",Meetings1!A269)","v":""},{"$f":"IF(Meetings1!B269=\"\",\"\",Meetings1!C269)","v":""},null,null,null,{"$f":"IF(Meetings1!B269=\"\",\"\",getAddress(Meetings1!E269))","v":""}]
[{"$nulls":9},{"$f":"IF(Meetings1!A270=\"\",\"\",Meetings1!A270)","v":""},{"$f":"IF(Meetings1!B270=\"\",\"\",Meetings1!C270)","v":""},null,null,null,{"$f":"IF(Meetings1!B270=\"\",\"\",getAddress(Meetings1!E270))","v":""}]
[{"$nulls":9},{"$f":"IF(Meetings1!A271=\"\",\"\",Meetings1!A271)","v":""},{"$f":"IF(Meetings1!B271=\"\",\"\",Meetings1!C271)","v":""},null,null,null,{"$f":"IF(Meetings1!B271=\"\",\"\",getAddress(Meetings1!E271))","v":""}]
[{"$nulls":9},{"$f":"IF(Meetings1!A272=\"\",\"\",Meetings1!A272)","v":""},{"$f":"IF(Meetings1!B272=\"\",\"\",Meetings1!C272)","v":""},null,null,null,{"$f":"IF(Meetings1!B272=\"\",\"\",getAddress(Meetings1!E272))","v":""}]
[{"$nulls":9},{"$f":"IF(Meetings1!A273=\"\",\"\",Meetings1!A273)","v":""},{"$f":"IF(Meetings1!B273=\"\",\"\",Meetings1!C273)","v":""},null,null,null,{"$f":"IF(Meetings1!B273=\"\",\"\",getAddress(Meetings1!E273))","v":""}]
[{"$nulls":9},{"$f":"IF(Meetings1!A274=\"\",\"\",Meetings1!A274)","v":""},{"$f":"IF(Meetings1!B274=\"\",\"\",Meetings1!C274)","v":""},null,null,null,{"$f":"IF(Meetings1!B274=\"\",\"\",getAddress(Meetings1!E274))","v":""}]
[{"$nulls":9},{"$f":"IF(Meetings1!A275=\"\",\"\",Meetings1!A275)","v":""},{"$f":"IF(Meetings1!B275=\"\",\"\",Meetings1!C275)","v":""},null,null,null,{"$f":"IF(Meetings1!B275=\"\",\"\",getAddress(Meetings1!E275))","v":""}]
[{"$nulls":9},{"$f":"IF(Meetings1!A276=\"\",\"\",Meetings1!A276)","v":""},{"$f":"IF(Meetings1!B276=\"\",\"\",Meetings1!C276)","v":""},null,null,null,{"$f":"IF(Meetings1!B276=\"\",\"\",getAddress(Meetings1!E276))","v":""}]
[{"$nulls":9},{"$f":"IF(Meetings1!A277=\"\",\"\",Meetings1!A277)","v":""},{"$f":"IF(Meetings1!B277=\"\",\"\",Meetings1!C277)","v":""},null,null,null,{"$f":"IF(Meetings1!B277=\"\",\"\",getAddress(Meetings1!E277))","v":""}]
[{"$nulls":9},{"$f":"IF(Meetings1!A278=\"\",\"\",Meetings1!A278)","v":""},{"$f":"IF(Meetings1!B278=\"\",\"\",Meetings1!C278)","v":""},null,null,null,{"$f":"IF(Meetings1!B278=\"\",\"\",getAddress(Meetings1!E278))","v":""}]
[{"$nulls":9},{"$f":"IF(Meetings1!A279=\"\",\"\",Meetings1!A279)","v":""},{"$f":"IF(Meetings1!B279=\"\",\"\",Meetings1!C279)","v":""},null,null,null,{"$f":"IF(Meetings1!B279=\"\",\"\",getAddress(Meetings1!E279))","v":""}]
[{"$nulls":9},{"$f":"IF(Meetings1!A280=\"\",\"\",Meetings1!A280)","v":""},{"$f":"IF(Meetings1!B280=\"\",\"\",Meetings1!C280)","v":""},null,null,null,{"$f":"IF(Meetings1!B280=\"\",\"\",getAddress(Meetings1!E280))","v":""}]
[{"$nulls":9},{"$f":"IF(Meetings1!A281=\"\",\"\",Meetings1!A281)","v":""},{"$f":"IF(Meetings1!B281=\"\",\"\",Meetings1!C281)","v":""}]

{"sheet":"MainSheet","index":2,"n_rows":34,"n_cols":25,"rows_kept":34,"cut":false,"hidden":false,"merged":[]}
[]
[null,{"$f":"Race!A5","v":"RADIO TAB"},null,{"$f":"Race!B5","v":"*1-4-3-2"},null,{"$f":"Race!C5","v":0},null,{"$f":"Race!D5","v":0},null,{"$f":"Race!E5","v":"Late Mail 1"}]
[]
[null,null,"Venue",{"$f":"Data!N1","v":"Rockhampton"},null,null,"Race",{"$f":"Data!O2","v":"5"},"Class",{"$f":"Form!E2","v":"Class 4"},null,"Value",{"$f":"Form!H3","v":10000},"Distance",{"$f":"Form!I2","v":"1300m"},{"$nulls":4},"Race Time",null,{"$f":"Form!A3-(X4/24)","v":"01:05:00"},"-",3,"Hours"]
[]
[]
[null,"Form","No","Runner",null,null,"Trainer",null,"Jockey",null,"Weight","Barrier","Rated","Rating",{"$nulls":4},"Price"]
[]
[null,{"$f":"IF(C9=\"\",\"\",Form!B5)","v":114823},{"$f":"IF(Data!BC2=\"\",\"\",Data!BC2)","v":1},{"$f":"IF(C9=\"\",\"\",IF(VLOOKUP(Data!BA2,Race!C1:N100,6,FALSE)=\"SCRATCHED\",\"SCRATCHED\",Data!BA2))","v":"Dack's Faz"},null,null,{"$f":"IF(C9=\"\",\"\",IF(D9=\"SCRATCHED\",\"\",Form!D5))","v":"Craig Smith"},null,{"$f":"IF(C9=\"\",\"\",IF(D9=\"SCRATCHED\",\"\",Form!E5))","v":"Ali Taylor"},null,{"$f":"IF(C9=\"\",\"\",IF(D9=\"SCRATCHED\",\"\",Form!F5))","v":58},{"$f":"IF(C9=\"\",\"\",IF(D9=\"SCRATCHED\",\"\",Data!BE2))","v":8},{"$f":"IF(C9=\"\",\"\",IF(N9=\"\",\"\",IF(RANK(N9,$N$9:$N$32)<6,RANK(N9,$N$9:$N$32),\"\")))","v":1},{"$f":"IF(C9=\"\",\"\",IF(D9=\"SCRATCHED\",\"\",Data!EH2))","v":81},{"$f":"IF(M9=\"\",\"\",N9)","v":81},{"$f":"IF(N9=\"\",\"\",N9)","v":81},{"$f":"IF(O9=\"\",\"\",O9/$O$34*100)","v":25.510204081632654},{"$f":"IF(P9=\"\",\"\",P9/$P$34*100)","v":19.221642145230184},{"$f":"IF(N9=\"\",\"\",IF(Q9<>\"\",100/Q9*1.15,100/R9+1.15))","v":4.508},{"$f":"IF(Race!D2=\"Paying\",\"Paying\",\"\")","v":"Paying"}]
[null,{"$f":"IF(C10=\"\",\"\",Form!B6)","v":515137},{"$f":"IF(Data!BC3=\"\",\"\",Data!BC3)","v":2},{"$f":"IF(C10=\"\",\"\",IF(VLOOKUP(Data!BA3,Race!C2:N101,6,FALSE)=\"SCRATCHED\",\"SCRATCHED\",Data!BA3))","v":"Igotitfrommymumma"},null,null,{"$f":"IF(B10=\"\",\"\",IF(D10=\"SCRATCHED\",\"\",Form!D6))","v":"T Cook"},null,{"$f":"IF(B10=\"\",\"\",IF(D10=\"SCRATCHED\",\"\",Form!E6))","v":"A Coome"},null,{"$f":"IF(B10=\"\",\"\",IF(D10=\"SCRATCHED\",\"\",Form!F6))","v":55.5},{"$f":"IF(C10=\"\",\"\",IF(D10=\"SCRATCHED\",\"\",Data!BE3))","v":3},{"$f":"IF(C10=\"\",\"\",IF(N10=\"\",\"\",IF(RANK(N10,$N$9:$N$32)<6,RANK(N10,$N$9:$N$32),\"\")))","v":2},{"$f":"IF(C10=\"\",\"\",IF(D10=\"SCRATCHED\",\"\",Data!EH3))","v":73},{"$f":"IF(M10=\"\",\"\",N10)","v":73},{"$f":"IF(N10=\"\",\"\",N10)","v":73},{"$f":"IF(O10=\"\",\"\",O10/$O$34*100)","v":22.990677752582517},{"$f":"IF(P10=\"\",\"\",P10/$P$34*100)","v":17.323208353108686},{"$f":"IF(N10=\"\",\"\",IF(Q10<>\"\",100/Q10*1.15,100/R10+1.15))","v":5.0020273972602736},{"$nulls":4},{"$f":"IF($T$9<>\"\",\"Win\",\"\")","v":"Win"},{"$f":"IF($T$9<>\"\",\"Place\",\"\")","v":"Place"}]
[null,{"$f":"IF(C11=\"\",\"\",Form!B7)","v":258918},{"$f":"IF(Data!BC4=\"\",\"\",Data!BC4)","v":3},{"$f":"IF(C11=\"\",\"\",IF(VLOOKUP(Data!BA4,Race!C3:N102,6,FALSE)=\"SCRATCHED\",\"SCRATCHED\",Data!BA4))","v":"Noble Lustre"},null,null,{"$f":"IF(B11=\"\",\"\",IF(D11=\"SCRATCHED\",\"\",Form!D7))","v":"J Brown"},null,{"$f":"IF(B11=\"\",\"\",IF(D11=\"SCRATCHED\",\"\",Form!E7))","v":"J Kropp"},null,{"$f":"IF(B11=\"\",\"\",IF(D11=\"SCRATCHED\",\"\",Form!F7))","v":55.5},{"$f":"IF(C11=\"\",\"\",IF(D11=\"SCRATCHED\",\"\",Data!BE4))","v":5},{"$f":"IF(C11=\"\",\"\",IF(N11=\"\",\"\",IF(RANK(N11,$N$9:$N$32)<6,RANK(N11,$N$9:$N$32),\"\")))","v":5},{"$f":"IF(C11=\"\",\"\",IF(D11=\"SCRATCHED\",\"\",Data!EH4))","v":47},{"$f":"IF(M11=\"\",\"\",N11)","v":47},{"$f":"IF(N11=\"\",\"\",N11)","v":47},{"$f":"IF(O11=\"\",\"\",O11/$O$34*100)","v":14.802217183169564},{"$f":"IF(P11=\"\",\"\",P11/$P$34*100)","v":11.153298528713812},{"$f":"IF(N11=\"\",\"\",IF(Q11<>\"\",100/Q11*1.15,100/R11+1.15))","v":7.7691063829787232},{"$f":"IF($T$9<>\"\",\"1st\",\"\")","v":"1st"},{"$f":"IF($T$9=\"\",\"\",INDEX(Race!$A$1:$A$20,MATCH(\"QN\",Race!$A1:$A$20,0)-4,0))","v":3},{"$f":"IF($T$9=\"\",\"\",INDEX(Race!$A$1:$C20,MATCH(\"QN\",Race!$A1:$A$20,0)-4,3))","v":"NOBLE LUSTRE"},null,{"$f":"IF($T$9=\"\",\"\",INDEX(Race!$A$1:$E20,MATCH(\"QN\",Race!$A1:$A$20,0)-4,4))","v":6.1},{"$f":"IF($T$9=\"\",\"\",INDEX(Race!$A$1:$E20,MATCH(\"QN\",Race!$A1:$A$20,0)-4,5))","v":1.7}]
[null,{"$f":"IF(C12=\"\",\"\",Form!B8)","v":351546},{"$f":"IF(Data!BC5=\"\",\"\",Data!BC5)","v":4},{"$f":"IF(C12=\"\",\"\",IF(VLOOKUP(Data!BA5,Race!C4:N103,6,FALSE)=\"SCRATCHED\",\"SCRATCHED\",Data!BA5))","v":"Chabal"},null,null,{"$f":"IF(B12=\"\",\"\",IF(D12=\"SCRATCHED\",\"\",Form!D8))","v":"R J Walsh"},null,{"$f":"IF(B12=\"\",\"\",IF(D12=\"SCRATCHED\",\"\",Form!E8))","v":"D Simmons"},null,{"$f":"IF(B12=\"\",\"\",IF(D12=\"SCRATCHED\",\"\",Form!F8))","v":55},{"$f":"IF(C12=\"\",\"\",IF(D12=\"SCRATCHED\",\"\",Data!BE5))","v":4},"",{"$f":"IF(C12=\"\",\"\",IF(D12=\"SCRATCHED\",\"\",Data!EH5))","v":45},"",45,"",10.678690080683436,10.514444444444445,{"$f":"IF($T$9<>\"\",\"2nd\",\"\")","v":"2nd"},{"$f":"IF($T$9=\"\",\"\",INDEX(Race!$A$1:$A$20,MATCH(\"QN\",Race!$A1:$A$20,0)-3,0))","v":7},{"$f":"IF($T$9=\"\",\"\",INDEX(Race!$A$1:$C21,MATCH(\"QN\",Race!$A2:$A$20,0)-2,3))","v":"ZENACITY"},null,null,{"$f":"IF($T$9=\"\",\"\",INDEX(Race!$A$1:$E20,MATCH(\"QN\",Race!$A1:$A$20,0)-3,5))","v":2.9}]
[null,{"$f":"IF(C13=\"\",\"\",Form!B9)","v":799371},{"$f":"IF(Data!BC6=\"\",\"\",Data!BC6)","v":5},{"$f":"IF(C13=\"\",\"\",IF(VLOOKUP(Data!BA6,Race!C5:N104,6,FALSE)=\"SCRATCHED\",\"SCRATCHED\",Data!BA6))","v":"SCRATCHED"},null,null,{"$f":"IF(B13=\"\",\"\",IF(D13=\"SCRATCHED\",\"\",Form!D9))","v":""},null,{"$f":"IF(B13=\"\",\"\",IF(D13=\"SCRATCHED\",\"\",Form!E9))","v":""},null,{"$f":"IF(B13=\"\",\"\",IF(D13=\"SCRATCHED\",\"\",Form!F9))","v":""},{"$f":"IF(C13=\"\",\"\",IF(D13=\"SCRATCHED\",\"\",Data!BE6))","v":""},"",{"$f":"IF(C13=\"\",\"\",IF(D13=\"SCRATCHED\",\"\",Data!EH6))","v":""},"","","","","",{"$f":"IF($T$9<>\"\",\"3rd\",\"\")","v":"3rd"},{"$f":"IF($T$9=\"\",\"\",INDEX(Race!$A$1:$A$20,MATCH(\"QN\",Race!$A1:$A$20,0)-2,0))","v":1},{"$f":"IF($T$9=\"\",\"\",INDEX(Race!$A$1:$C22,MATCH(\"QN\",Race!$A3:$A$20,0)-0,3))","v":"DACK'S FAZ"},null,null,{"$f":"IF($T$9=\"\",\"\",INDEX(Race!$A$1:$E20,MATCH(\"QN\",Race!$A1:$A$20,0)-2,5))","v":1.4}]
[null,{"$f":"IF(C14=\"\",\"\",Form!B10)","v":374161},{"$f":"IF(Data!BC7=\"\",\"\",Data!BC7)","v":6},{"$f":"IF(C14=\"\",\"\",IF(VLOOKUP(Data!BA7,Race!C6:N105,6,FALSE)=\"SCRATCHED\",\"SCRATCHED\",Data!BA7))","v":"Lola Brigida"},null,null,{"$f":"IF(B14=\"\",\"\",IF(D14=\"SCRATCHED\",\"\",Form!D10))","v":"D J Munns"},null,{"$f":"IF(B14=\"\",\"\",IF(D14=\"SCRATCHED\",\"\",Form!E10))","v":"T Bannon"},null,{"$f":"IF(B14=\"\",\"\",IF(D14=\"SCRATCHED\",\"\",Form!F10))","v":54},{"$f":"IF(C14=\"\",\"\",IF(D14=\"SCRATCHED\",\"\",Data!BE7))","v":7},3,{"$f":"IF(C14=\"\",\"\",IF(D14=\"SCRATCHED\",\"\",Data!EH7))","v":67},67,67,21.10103300579491,15.899383009017562,5.4499701492537307]
[null,{"$f":"IF(C15=\"\",\"\",Form!B11)","v":838930},{"$f":"IF(Data!BC8=\"\",\"\",Data!BC8)","v":7},{"$f":"IF(C15=\"\",\"\",IF(VLOOKUP(Data!BA8,Race!C7:N106,6,FALSE)=\"SCRATCHED\",\"SCRATCHED\",Data!BA8))","v":"Zenacity"},null,null,{"$f":"IF(B15=\"\",\"\",IF(D15=\"SCRATCHED\",\"\",Form!D11))","v":"J P O'Shea"},null,{"$f":"IF(B15=\"\",\"\",IF(D15=\"SCRATCHED\",\"\",Form!E11))","v":"C Whiteley"},null,{"$f":"IF(B15=\"\",\"\",IF(D15=\"SCRATCHED\",\"\",Form!F11))","v":54},{"$f":"IF(C15=\"\",\"\",IF(D15=\"SCRATCHED\",\"\",Data!BE8))","v":1},"",{"$f":"IF(C15=\"\",\"\",IF(D15=\"SCRATCHED\",\"\",Data!EH8))","v":36},"",36,"",8.5429520645467498,12.855555555555554,{"$f":"IF($T$9=\"\",\"\",\"QN\")","v":"QN"},{"$f":"IF($T$9=\"\",\"\",INDEX(Race!$A$1:$C20,MATCH(\"EX\",Race!$A1:$A$20,0)-1,2))","v":"3* 7"},null,null,{"$f":"IF($T$9=\"\",\"\",INDEX(Race!$A$1:$C20,MATCH(\"EX\",Race!$A1:$A$20,0)-1,3))","v":67.2}]
[null,{"$f":"IF(C16=\"\",\"\",Form!B12)","v":960457},{"$f":"IF(Data!BC9=\"\",\"\",Data!BC9)","v":8},{"$f":"IF(C16=\"\",\"\",IF(VLOOKUP(Data!BA9,Race!C8:N107,6,FALSE)=\"SCRATCHED\",\"SCRATCHED\",Data!BA9))","v":"Dandy Kat"},null,null,{"$f":"IF(B16=\"\",\"\",IF(D16=\"SCRATCHED\",\"\",Form!D12))","v":"R Vale"},null,{"$f":"IF(B16=\"\",\"\",IF(D16=\"SCRATCHED\",\"\",Form!E12))","v":"J P Stanley"},null,{"$f":"IF(B16=\"\",\"\",IF(D16=\"SCRATCHED\",\"\",Form!F12))","v":54},{"$f":"IF(C16=\"\",\"\",IF(D16=\"SCRATCHED\",\"\",Data!BE9))","v":6},4,{"$f":"IF(C16=\"\",\"\",IF(D16=\"SCRATCHED\",\"\",Data!EH9))","v":56},56,56,17.636684303350972,13.2890365448505,6.5204999999999984,{"$f":"IF($T$9=\"\",\"\",\"EX\")","v":"EX"},{"$f":"IF($T$9=\"\",\"\",INDEX(Race!$A$1:$C21,MATCH(\"QN\",Race!$A2:$A$20,0)+2,2))","v":"3* 7"},null,null,{"$f":"IF($T$9=\"\",\"\",INDEX(Race!$A$1:$C21,MATCH(\"QN\",Race!$A2:$A$20,0)+2,3))","v":139.4}]
[null,{"$f":"IF(C17=\"\",\"\",Form!B13)","v":358366},{"$f":"IF(Data!BC10=\"\",\"\",Data!BC10)","v":9},{"$f":"IF(C17=\"\",\"\",IF(VLOOKUP(Data!BA10,Race!C9:N108,6,FALSE)=\"SCRATCHED\",\"SCRATCHED\",Data!BA10))","v":"Fu Min Bu"},null,null,{"$f":"IF(B17=\"\",\"\",IF(D17=\"SCRATCHED\",\"\",Form!D13))","v":"R Sullivan"},null,{"$f":"IF(B17=\"\",\"\",IF(D17=\"SCRATCHED\",\"\",Form!E13))","v":"R Bell"},null,{"$f":"IF(B17=\"\",\"\",IF(D17=\"SCRATCHED\",\"\",Form!F13))","v":54},{"$f":"IF(C17=\"\",\"\",IF(D17=\"SCRATCHED\",\"\",Data!BE10))","v":9},"",{"$f":"IF(C17=\"\",\"\",IF(D17=\"SCRATCHED\",\"\",Data!EH10))","v":25},"",25,"",5.932605600379687,18.005999999999997,{"$f":"IF($T$9=\"\",\"\",\"TF\")","v":"TF"},{"$f":"IF($T$9=\"\",\"\",INDEX(Race!$A$1:$I20,MATCH(\"EX\",Race!$A1:$A$20,0)-1,8))","v":"3* 7* 1"},null,null,{"$f":"IF($T$9=\"\",\"\",INDEX(Race!$A$1:$I20,MATCH(\"EX\",Race!$A1:$A$20,0)-1,9))","v":553.79999999999995}]
[null,{"$f":"IF(C18=\"\",\"\",Form!B14)","v":""},{"$f":"IF(Data!BC11=\"\",\"\",Data!BC11)","v":""},{"$f":"IF(C18=\"\",\"\",IF(VLOOKUP(Data!BA11,Race!C10:N109,6,FALSE)=\"SCRATCHED\",\"SCRATCHED\",Data!BA11))","v":""},null,null,{"$f":"IF(B18=\"\",\"\",IF(D18=\"SCRATCHED\",\"\",Form!D14))","v":""},null,{"$f":"IF(B18=\"\",\"\",IF(D18=\"SCRATCHED\",\"\",Form!E14))","v":""},null,{"$f":"IF(B18=\"\",\"\",IF(D18=\"SCRATCHED\",\"\",Form!F14))","v":""},{"$f":"IF(C18=\"\",\"\",IF(D18=\"SCRATCHED\",\"\",Data!BE11))","v":""},"",{"$f":"IF(C18=\"\",\"\",IF(D18=\"SCRATCHED\",\"\",Data!EH11))","v":""},"","","","","",{"$f":"IF($T$9=\"\",\"\",\"F4\")","v":"F4"},{"$f":"IF($T$9=\"\",\"\",INDEX(Race!$A$1:$C23,MATCH(\"EX\",Race!$A4:$A$20,0)+4,2))","v":"3* 7* 1* 6"},null,null,{"$f":"IF($T$9=\"\",\"\",INDEX(Race!$A$1:$C23,MATCH(\"EX\",Race!$A4:$A$20,0)+4,3))","v":2043.4}]
[null,{"$f":"IF(C19=\"\",\"\",Form!B15)","v":""},{"$f":"IF(Data!BC12=\"\",\"\",Data!BC12)","v":""},{"$f":"IF(C19=\"\",\"\",IF(VLOOKUP(Data!BA12,Race!C11:N110,6,FALSE)=\"SCRATCHED\",\"SCRATCHED\",Data!BA12))","v":""},null,null,{"$f":"IF(B19=\"\",\"\",IF(D19=\"SCRATCHED\",\"\",Form!D15))","v":""},null,{"$f":"IF(B19=\"\",\"\",IF(D19=\"SCRATCHED\",\"\",Form!E15))","v":""},null,{"$f":"IF(B19=\"\",\"\",IF(D19=\"SCRATCHED\",\"\",Form!F15))","v":""},{"$f":"IF(C19=\"\",\"\",IF(D19=\"SCRATCHED\",\"\",Data!BE12))","v":""},"",{"$f":"IF(C19=\"\",\"\",IF(D19=\"SCRATCHED\",\"\",Data!EH12))","v":""},"","","","",""]
[null,{"$f":"IF(C20=\"\",\"\",Form!B16)","v":""},{"$f":"IF(Data!BC13=\"\",\"\",Data!BC13)","v":""},{"$f":"IF(C20=\"\",\"\",IF(VLOOKUP(Data!BA13,Race!C12:N111,6,FALSE)=\"SCRATCHED\",\"SCRATCHED\",Data!BA13))","v":""},null,null,{"$f":"IF(B20=\"\",\"\",IF(D20=\"SCRATCHED\",\"\",Form!D16))","v":""},null,{"$f":"IF(B20=\"\",\"\",IF(D20=\"SCRATCHED\",\"\",Form!E16))","v":""},null,{"$f":"IF(B20=\"\",\"\",IF(D20=\"SCRATCHED\",\"\",Form!F16))","v":""},{"$f":"IF(C20=\"\",\"\",IF(D20=\"SCRATCHED\",\"\",Data!BE13))","v":""},"",{"$f":"IF(C20=\"\",\"\",IF(D20=\"SCRATCHED\",\"\",Data!EH13))","v":""},"","","","",""]
[null,{"$f":"IF(C21=\"\",\"\",Form!B17)","v":""},{"$f":"IF(Data!BC14=\"\",\"\",Data!BC14)","v":""},{"$f":"IF(C21=\"\",\"\",IF(VLOOKUP(Data!BA14,Race!C13:N112,6,FALSE)=\"SCRATCHED\",\"SCRATCHED\",Data!BA14))","v":""},null,null,{"$f":"IF(B21=\"\",\"\",IF(D21=\"SCRATCHED\",\"\",Form!D17))","v":""},null,{"$f":"IF(B21=\"\",\"\",IF(D21=\"SCRATCHED\",\"\",Form!E17))","v":""},null,{"$f":"IF(B21=\"\",\"\",IF(D21=\"SCRATCHED\",\"\",Form!F17))","v":""},{"$f":"IF(C21=\"\",\"\",IF(D21=\"SCRATCHED\",\"\",Data!BE14))","v":""},"",{"$f":"IF(C21=\"\",\"\",IF(D21=\"SCRATCHED\",\"\",Data!EH14))","v":""},"","","","",""]
[null,{"$f":"IF(C22=\"\",\"\",Form!B18)","v":""},{"$f":"IF(Data!BC15=\"\",\"\",Data!BC15)","v":""},{"$f":"IF(C22=\"\",\"\",IF(VLOOKUP(Data!BA15,Race!C14:N113,6,FALSE)=\"SCRATCHED\",\"SCRATCHED\",Data!BA15))","v":""},null,null,{"$f":"IF(B22=\"\",\"\",IF(D22=\"SCRATCHED\",\"\",Form!D18))","v":""},null,{"$f":"IF(B22=\"\",\"\",IF(D22=\"SCRATCHED\",\"\",Form!E18))","v":""},null,{"$f":"IF(B22=\"\",\"\",IF(D22=\"SCRATCHED\",\"\",Form!F18))","v":""},{"$f":"IF(C22=\"\",\"\",IF(D22=\"SCRATCHED\",\"\",Data!BE15))","v":""},"",{"$f":"IF(C22=\"\",\"\",IF(D22=\"SCRATCHED\",\"\",Data!EH15))","v":""},"","","","",""]
[null,{"$f":"IF(C23=\"\",\"\",Form!B19)","v":""},{"$f":"IF(Data!BC16=\"\",\"\",Data!BC16)","v":""},{"$f":"IF(C23=\"\",\"\",IF(VLOOKUP(Data!BA16,Race!C15:N114,6,FALSE)=\"SCRATCHED\",\"SCRATCHED\",Data!BA16))","v":""},null,null,{"$f":"IF(B23=\"\",\"\",IF(D23=\"SCRATCHED\",\"\",Form!D19))","v":""},null,{"$f":"IF(B23=\"\",\"\",IF(D23=\"SCRATCHED\",\"\",Form!E19))","v":""},null,{"$f":"IF(B23=\"\",\"\",IF(D23=\"SCRATCHED\",\"\",Form!F19))","v":""},{"$f":"IF(C23=\"\",\"\",IF(D23=\"SCRATCHED\",\"\",Data!BE16))","v":""},"",{"$f":"IF(C23=\"\",\"\",IF(D23=\"SCRATCHED\",\"\",Data!EH16))","v":""},"","","","","",null,{"$f":"IF($T$9=\"\",\"\",D4)","v":"Rockhampton"},null,{"$f":"IF($T$9=\"\",\"\",G4)","v":"Race"},null,{"$f":"IF($T$9=\"\",\"\",H4)","v":"5"}]
[null,{"$f":"IF(C24=\"\",\"\",Form!B20)","v":""},{"$f":"IF(Data!BC17=\"\",\"\",Data!BC17)","v":""},{"$f":"IF(C24=\"\",\"\",IF(VLOOKUP(Data!BA17,Race!C16:N115,6,FALSE)=\"SCRATCHED\",\"SCRATCHED\",Data!BA17))","v":""},null,null,{"$f":"IF(B24=\"\",\"\",IF(D24=\"SCRATCHED\",\"\",Form!D20))","v":""},null,{"$f":"IF(B24=\"\",\"\",IF(D24=\"SCRATCHED\",\"\",Form!E20))","v":""},null,{"$f":"IF(B24=\"\",\"\",IF(D24=\"SCRATCHED\",\"\",Form!F20))","v":""},{"$f":"IF(C24=\"\",\"\",IF(D24=\"SCRATCHED\",\"\",Data!BE17))","v":""},"",{"$f":"IF(C24=\"\",\"\",IF(D24=\"SCRATCHED\",\"\",Data!EH17))","v":""},"","","","","",null,{"$f":"IF($T$9=\"\",\"\",\"1st\")","v":"1st"},{"$f":"IF($T$9=\"\",\"\",INDEX($D$9:$D$32,MATCH(1,$M$9:$M$32,0),1))","v":"Dack's Faz"},null,{"$f":"IF($T$9=\"\",\"\",IF(ISNA(VLOOKUP(V24,$V$11:$X$13,2,FALSE)),\"\",VLOOKUP(V24,$V$11:$X$13,3,FALSE)))","v":0}]
[null,{"$f":"IF(C25=\"\",\"\",Form!B21)","v":""},{"$f":"IF(Data!BC18=\"\",\"\",Data!BC18)","v":""},{"$f":"IF(C25=\"\",\"\",IF(VLOOKUP(Data!BA18,Race!C17:N116,6,FALSE)=\"SCRATCHED\",\"SCRATCHED\",Data!BA18))","v":""},null,null,{"$f":"IF(B25=\"\",\"\",IF(D25=\"SCRATCHED\",\"\",Form!D21))","v":""},null,{"$f":"IF(B25=\"\",\"\",IF(D25=\"SCRATCHED\",\"\",Form!E21))","v":""},null,{"$f":"IF(B25=\"\",\"\",IF(D25=\"SCRATCHED\",\"\",Form!F21))","v":""},{"$f":"IF(C25=\"\",\"\",IF(D25=\"SCRATCHED\",\"\",Data!BE18))","v":""},"",{"$f":"IF(C25=\"\",\"\",IF(D25=\"SCRATCHED\",\"\",Data!EH18))","v":""},"","","","","",null,{"$f":"IF($T$9=\"\",\"\",\"2nd\")","v":"2nd"},{"$f":"IF($T$9=\"\",\"\",INDEX($D$9:$D$32,MATCH(2,$M$9:$M$32,0),1))","v":"Igotitfrommymumma"},null,{"$f":"IF($T$9=\"\",\"\",IF(ISNA(VLOOKUP(V25,$V$11:$X$13,2,FALSE)),\"\",VLOOKUP(V25,$V$11:$X$13,3,FALSE)))","v":""}]
[null,{"$f":"IF(C26=\"\",\"\",Form!B22)","v":""},{"$f":"IF(Data!BC19=\"\",\"\",Data!BC19)","v":""},{"$f":"IF(C26=\"\",\"\",IF(VLOOKUP(Data!BA19,Race!C18:N117,6,FALSE)=\"SCRATCHED\",\"SCRATCHED\",Data!BA19))","v":""},null,null,{"$f":"IF(B26=\"\",\"\",IF(D26=\"SCRATCHED\",\"\",Form!D22))","v":""},null,{"$f":"IF(B26=\"\",\"\",IF(D26=\"SCRATCHED\",\"\",Form!E22))","v":""},null,{"$f":"IF(B26=\"\",\"\",IF(D26=\"SCRATCHED\",\"\",Form!F22))","v":""},{"$f":"IF(C26=\"\",\"\",IF(D26=\"SCRATCHED\",\"\",Data!BE19))","v":""},"",{"$f":"IF(C26=\"\",\"\",IF(D26=\"SCRATCHED\",\"\",Data!EH19))","v":""},"","","","","",null,{"$f":"IF($T$9=\"\",\"\",\"3rd\")","v":"3rd"},{"$f":"IF($T$9=\"\",\"\",INDEX($D$9:$D$32,MATCH(3,$M$9:$M$32,0),1))","v":"Lola Brigida"},null,{"$f":"IF($T$9=\"\",\"\",IF(ISNA(VLOOKUP(V26,$V$11:$X$13,2,FALSE)),\"\",VLOOKUP(V26,$V$11:$X$13,3,FALSE)))","v":""}]
[null,{"$f":"IF(C27=\"\",\"\",Form!B23)","v":""},{"$f":"IF(Data!BC20=\"\",\"\",Data!BC20)","v":""},{"$f":"IF(C27=\"\",\"\",IF(VLOOKUP(Data!BA20,Race!C19:N118,6,FALSE)=\"SCRATCHED\",\"SCRATCHED\",Data!BA20))","v":""},null,null,{"$f":"IF(B27=\"\",\"\",IF(D27=\"SCRATCHED\",\"\",Form!D23))","v":""},null,{"$f":"IF(B27=\"\",\"\",IF(D27=\"SCRATCHED\",\"\",Form!E23))","v":""},null,{"$f":"IF(B27=\"\",\"\",IF(D27=\"SCRATCHED\",\"\",Form!F23))","v":""},{"$f":"IF(C27=\"\",\"\",IF(D27=\"SCRATCHED\",\"\",Data!BE20))","v":""},"",{"$f":"IF(C27=\"\",\"\",IF(D27=\"SCRATCHED\",\"\",Data!EH20))","v":""},"","","","","",null,{"$f":"IF($T$9=\"\",\"\",\"4th\")","v":"4th"},{"$f":"IF($T$9=\"\",\"\",INDEX($D$9:$D$32,MATCH(4,$M$9:$M$32,0),1))","v":"Dandy Kat"},null,{"$f":"IF($T$9=\"\",\"\",IF(ISNA(VLOOKUP(V27,$V$11:$X$13,2,FALSE)),\"\",VLOOKUP(V27,$V$11:$X$13,3,FALSE)))","v":""}]
[null,{"$f":"IF(C28=\"\",\"\",Form!B24)","v":""},{"$f":"IF(Data!BC21=\"\",\"\",Data!BC21)","v":""},{"$f":"IF(C28=\"\",\"\",IF(VLOOKUP(Data!BA21,Race!C20:N119,6,FALSE)=\"SCRATCHED\",\"SCRATCHED\",Data!BA21))","v":""},null,null,{"$f":"IF(B28=\"\",\"\",IF(D28=\"SCRATCHED\",\"\",Form!D24))","v":""},null,{"$f":"IF(B28=\"\",\"\",IF(D28=\"SCRATCHED\",\"\",Form!E24))","v":""},null,{"$f":"IF(B28=\"\",\"\",IF(D28=\"SCRATCHED\",\"\",Form!F24))","v":""},{"$f":"IF(C28=\"\",\"\",IF(D28=\"SCRATCHED\",\"\",Data!BE21))","v":""},"",{"$f":"IF(C28=\"\",\"\",IF(D28=\"SCRATCHED\",\"\",Data!EH21))","v":""},"","","","","",null,{"$f":"IF($T$9=\"\",\"\",\"5th\")","v":"5th"},{"$f":"IF($T$9=\"\",\"\",INDEX($D$9:$D$32,MATCH(5,$M$9:$M$32,0),1))","v":"Noble Lustre"},null,{"$f":"IF($T$9=\"\",\"\",IF(ISNA(VLOOKUP(V28,$V$11:$X$13,2,FALSE)),\"\",VLOOKUP(V28,$V$11:$X$13,3,FALSE)))","v":6.1}]
[null,{"$f":"IF(C29=\"\",\"\",Form!B25)","v":""},{"$f":"IF(Data!BC22=\"\",\"\",Data!BC22)","v":""},{"$f":"IF(C29=\"\",\"\",IF(VLOOKUP(Data!BA22,Race!C21:N120,6,FALSE)=\"SCRATCHED\",\"SCRATCHED\",Data!BA22))","v":""},null,null,{"$f":"IF(B29=\"\",\"\",IF(D29=\"SCRATCHED\",\"\",Form!D25))","v":""},null,{"$f":"IF(B29=\"\",\"\",IF(D29=\"SCRATCHED\",\"\",Form!E25))","v":""},null,{"$f":"IF(B29=\"\",\"\",IF(D29=\"SCRATCHED\",\"\",Form!F25))","v":""},{"$f":"IF(C29=\"\",\"\",IF(D29=\"SCRATCHED\",\"\",Data!BE22))","v":""},"",{"$f":"IF(C29=\"\",\"\",IF(D29=\"SCRATCHED\",\"\",Data!EH22))","v":""},"","","","",""]
[null,{"$f":"IF(C30=\"\",\"\",Form!B26)","v":""},{"$f":"IF(Data!BC23=\"\",\"\",Data!BC23)","v":""},{"$f":"IF(C30=\"\",\"\",IF(VLOOKUP(Data!BA23,Race!C22:N121,6,FALSE)=\"SCRATCHED\",\"SCRATCHED\",Data!BA23))","v":""},null,null,{"$f":"IF(B30=\"\",\"\",IF(D30=\"SCRATCHED\",\"\",Form!D26))","v":""},null,{"$f":"IF(B30=\"\",\"\",IF(D30=\"SCRATCHED\",\"\",Form!E26))","v":""},null,{"$f":"IF(B30=\"\",\"\",IF(D30=\"SCRATCHED\",\"\",Form!F26))","v":""},{"$f":"IF(C30=\"\",\"\",IF(D30=\"SCRATCHED\",\"\",Data!BE23))","v":""},"",{"$f":"IF(C30=\"\",\"\",IF(D30=\"SCRATCHED\",\"\",Data!EH23))","v":""},"","","","",""]
[null,{"$f":"IF(C31=\"\",\"\",Form!B27)","v":""},{"$f":"IF(Data!BC24=\"\",\"\",Data!BC24)","v":""},{"$f":"IF(C31=\"\",\"\",IF(VLOOKUP(Data!BA24,Race!C23:N122,6,FALSE)=\"SCRATCHED\",\"SCRATCHED\",Data!BA24))","v":""},null,null,{"$f":"IF(B31=\"\",\"\",IF(D31=\"SCRATCHED\",\"\",Form!D27))","v":""},null,{"$f":"IF(B31=\"\",\"\",IF(D31=\"SCRATCHED\",\"\",Form!E27))","v":""},null,{"$f":"IF(B31=\"\",\"\",IF(D31=\"SCRATCHED\",\"\",Form!F27))","v":""},{"$f":"IF(C31=\"\",\"\",IF(D31=\"SCRATCHED\",\"\",Data!BE24))","v":""},"",{"$f":"IF(C31=\"\",\"\",IF(D31=\"SCRATCHED\",\"\",Data!EH24))","v":""},"","","","",""]
[null,{"$f":"IF(C32=\"\",\"\",Form!B28)","v":""},{"$f":"IF(Data!BC25=\"\",\"\",Data!BC25)","v":""},{"$f":"IF(C32=\"\",\"\",IF(VLOOKUP(Data!BA25,Race!C24:N123,6,FALSE)=\"SCRATCHED\",\"SCRATCHED\",Data!BA25))","v":""},null,null,{"$f":"IF(B32=\"\",\"\",IF(D32=\"SCRATCHED\",\"\",Form!D28))","v":""},null,{"$f":"IF(B32=\"\",\"\",IF(D32=\"SCRATCHED\",\"\",Form!E28))","v":""},null,{"$f":"IF(B32=\"\",\"\",IF(D32=\"SCRATCHED\",\"\",Form!F28))","v":""},{"$f":"IF(C32=\"\",\"\",IF(D32=\"SCRATCHED\",\"\",Data!BE25))","v":""},"",{"$f":"IF(C32=\"\",\"\",IF(D32=\"SCRATCHED\",\"\",Data!EH25))","v":""},"","","","",""]
[]
[{"$nulls":14},{"$f":"SUM(O9:O33)*0.98","v":317.52},{"$f":"SUM(P9:P33)*0.98","v":421.4}]

{"sheet":"Meetings1","index":3,"n_rows":45,"n_cols":8,"rows_kept":45,"cut":false,"hidden":false,"merged":[]}
["Select Date",{"$nulls":6},"Live Odds By"]
["Geelong"]
[1,"01:00:00","Carr & Harvey Accountants Mdn - 1330m","Fields","Form","Xtra Ratings","Consistency"]
[2,"01:35:00","Alc Quality Foods Mdn Plate - 1530m","Fields","Form","Xtra Ratings","Consistency"]
[3,"02:10:00","Nib Health Funds Hcp (c1) - 1130m","Fields","Form","Xtra Ratings","Consistency"]
[4,"02:45:00","It Trophy & Clothing Mdn - 1230m","Fields","Form","Xtra Ratings","Consistency"]
[5,"03:20:00","Quinlan Cranes Hcp (62) - 1530m","Fields","Form","Xtra Ratings","Consistency"]
[6,"03:57:00","Briseis Gold Cup - 1741m","Fields","Form","Xtra Ratings","Consistency"]
[7,"04:37:00","Doxa Joe Youth Foundation (68) - 2447m","Fields","Form","Xtra Ratings","Consistency"]
[8,"05:17:00","C Q Recruitment Hcp (62) - 1330m","Fields","Form","Xtra Ratings","Consistency"]
["Hawkesbury"]
[1,"01:15:00","Clarendon Parklea Displays-c1 - 1400m","Fields","Form","Xtra Ratings","Consistency"]
[2,"01:50:00","Brivis Air Conditioning Mdn - 1000m","Fields","Form","Xtra Ratings","Consistency"]
[3,"02:25:00","Tfh Temporary Fence Hire Mdn - 1000m","Fields","Form","Xtra Ratings","Consistency"]
[4,"03:00:00","Clarendon Chairman's (bm60) - 1000m","Fields","Form","Xtra Ratings","Consistency"]
[5,"03:35:00","Clarendon Homes (bm60) - 1600m","Fields","Form","Xtra Ratings","Consistency"]
[6,"04:14:00","M & Z Tiling Mdn Plate - 1800m","Fields","Form","Xtra Ratings","Consistency"]
[7,"04:54:00","Clarendon Trades Hcp (c2) - 1200m","Fields","Form","Xtra Ratings","Consistency"]
[8,"05:34:00","Clarendon Resi Projects Mdn - 1400m","Fields","Form","Xtra Ratings","Consistency"]
["Launceston"]
[1,"06:28:00","Alps & Amici Mdn Plate - 1100m","Fields","Form","Xtra Ratings","Consistency"]
[2,"07:02:00","Juicy Isle Mdn Plate - 1200m","Fields","Form","Xtra Ratings","Consistency"]
[3,"07:34:00","Cripps Nu-bake Hcp (c4) - 1400m","Fields","Form","Xtra Ratings","Consistency"]
[4,"08:11:00","Jack Chambers (bm68) - 2100m","Fields","Form","Xtra Ratings","Consistency"]
[5,"08:41:00","Field Family Hcp - 1400m","Fields","Form","Xtra Ratings","Consistency"]
[6,"09:12:00","Pfd Foodservices W F A - 1400m","Fields","Form","Xtra Ratings","Consistency"]
[7,"09:42:00","West's Bakery Hcp (c2) - 1400m","Fields","Form","Xtra Ratings","Consistency"]
[8,"10:12:00","Abel's Tempest Hcp (c1) - 1200m","Fields","Form","Xtra Ratings","Consistency"]
["Pinjarra"]
[1,"01:07:00","Peel Bins Mdn - 1000m","Fields","Form","Xtra Ratings","Consistency"]
[2,"01:47:00","Traders & Stable Affairs Mdn - 1200m","Fields","Form","Xtra Ratings","Consistency"]
[3,"02:27:00","Crystals Surf Mdn - 1200m","Fields","Form","Xtra Ratings","Consistency"]
[4,"03:07:00","George 'n' Dragon Tavern Mdn - 1600m","Fields","Form","Xtra Ratings","Consistency"]
[5,"03:42:00","Bennu Intl Consultancy Hcp-68 - 1600m","Fields","Form","Xtra Ratings","Consistency"]
[6,"04:22:00","Ideas In Furniture Hcp (c1) - 1400m","Fields","Form","Xtra Ratings","Consistency"]
[7,"04:57:00","Boddington Earthmoving Hcp-64 - 2000m","Fields","Form","Xtra Ratings","Consistency"]
[8,"05:36:00","Magic Millions (bm60+) - 1200m","Fields","Form","Xtra Ratings","Consistency"]
["Rockhampton"]
[1,"01:35:00","Goody's Earth Moving Mdn Hcp - 1600m","Fields","Form","Xtra Ratings","Consistency"]
[2,"02:10:00","Cq Powdercoaters Hcp - 970m","Fields","Form","Xtra Ratings","Consistency"]
[3,"02:45:00","Rockyvegas 600 Social Clb Mdn - 970m","Fields","Form","Xtra Ratings","Consistency"]
[4,"03:25:00","Kele Property Group Hcp (c1) - 1400m","Fields","Form","Xtra Ratings","Consistency"]
[5,"04:05:00","Allenstown Hotel Hcp (c4) - 1300m","Fields","Form","Xtra Ratings","Consistency"]
[6,"04:45:00","Daniels Surgical & Health (c2) - 1050m","Fields","Form","Xtra Ratings","Consistency"]
["END"]

{"sheet":"Meetings2","index":4,"n_rows":41,"n_cols":15,"rows_kept":41,"cut":false,"hidden":false,"merged":[[1,0,2,0],[1,1,2,1],[6,0,6,2],[15,0,15,2],[24,0,24,2]]}
[]
["Thursday, 2 December 2010","Times are Aust EST"]
[]
["Daily Double Jackpot!","ALBION PARK (BG) race 07 ($1,064)"]
["First4 Jackpot!","ALBION PARK (BG) race 08 ($9,161)"]
["Exacta Jackpot!","ANGLE PARK (AG) race 08 ($8,636)"]
["Races",null,null,1,2,3,4,5,6,7,8,9,10,11,12]
[null,"ROCKHAMPTON (QR)","Fields","3,1,8 F4","5,7,8 F4","14,9,10 F4","4,8,6 F4","3,7,1 F4","2,4,11 F4"]
[null,"HAWKESBURY (NR)","Fields","Abnd ","Abnd ","Abnd ","Abnd ","Abnd ","Abnd ","Abnd ","Abnd "]
[null,"GEELONG (VR)","Fields","5,7,10 ","7,4,5 ","7,3,1 ","2,11,4 ","9,8,6 F4","4,1,3 F4","7,8,10 F4","7,6,9 F4"]
[null,"PINJARRA (PR)","Fields","13,4,6 ","9,1,2 ","4,3,6 ","17,12,10 ","25m ","06:22:00","06:57:00","07:36:00"]
[null,"LAUNCESTON (TR)","Fields","11m ","45m ","06:34:00","07:11:00","07:41:00","08:12:00","08:42:00","09:12:00"]
[null,"VAAL (AS)","Fields","08:55:00","09:30:00","10:05:00","10:40:00","11:15:00","11:50:00","12:25am "]
[null,"LINGFIELD (ES)","Fields","11:00:00","11:30:00","12:00am ","12:30am "]
[null,"MATAMATA (ZS)","Fields","15,13,7 ","10,7,2 ","12,1,9 ","1,7,9 ","8,14,6 ","4,12,3 ","11,12,1 ","3,4,9 ","8,10,5 ","1,8,3 "]
["Trots",null,null,1,2,3,4,5,6,7,8,9,10,11,12]
[null,"PENRITH (ST)","Fields","7m ","33m ","58m ","06:47:00","07:17:00","07:47:00","08:17:00","08:47:00"]
[null,"MELTON (MT)","Fields","1,2,6 ","1,5,4 ","6,2,3 ","4,9,2 ","10,6,5 ","8,1,2 ","9,4,1 ","Closed "]
[null,"GOLD COAST (QT)","Fields","5,7,6 F4","3,1,6 F4","2,8,1 F4","4,3,7 F4","9,8,1 F4","1,8,9 F4","10,11,7 F4"]
[null,"NEWCASTLE (NT)","Fields","10,8,2 ","3,6,5 ","6,5,8 ","9,3,6 ","12,8,11 ","2,8,7 ","3,1,9 ","11,3,9 "]
[null,"BALLARAT (VT)","Fields","16m ","41m ","06:30:00","07:02:00","07:30:00","08:00:00","08:30:00","09:00:00"]
[null,"HARVEY (PT)","Fields","07:54:00","08:24:00","08:54:00","09:24:00","09:54:00","10:24:00","10:50:00","11:21:00"]
[null,"VINCENNES (FT)","Fields","10:40:00","11:10:00","11:40:00",null,"12:45am "]
[null,"ASCOT PARK (ZT)","Fields","5,9,3 ","13,6,14 ","14,1,10 ","5,4,8 ","2,3,14 ","9,2,4 ","2,1,7 ","Interim ","17m "]
["Greyhounds",null,null,1,2,3,4,5,6,7,8,9,10,11,12]
[null,"ALBION PARK (BG)","Fields","6:41 F4","7:06 F4","7:25 F4","7:45 F4","8:08 F4","8:28 F4","8:52 F4","9:11 F4","9:32 F4","9:52 F4"]
[null,"DAPTO (SG)","Fields","06:28:00","06:52:00","07:12:00","07:34:00","07:55:00","08:14:00","08:38:00","08:58:00","09:22:00","09:40:00"]
[null,"SANDOWN PARK (MG)","Fields","50m ","06:25:00","06:44:00","07:09:00","07:28:00","07:52:00","08:11:00","08:35:00","08:55:00","09:14:00","09:36:00"]
[null,"MAITLAND (NG)","Fields","8,1,6 ","5,1,7 ","8,4,7 ","2,8,6 ","4,3,5 ","8,6,2 ","3m ","21m ","38m ","57m "]
[null,"SHEPPARTON (VG)","Fields","3,8,1 ","1,6,8 ","8,7,5 ","8,5,3 ","4,8,5 ","6,2,3 ","7,1,8 ","1,7,2 ","13m ","30m ","46m ","06:19:00"]
[null,"ANGLE PARK (AG)","Fields","55m F4","6:35 F4","6:55 F4","7:15 F4","7:39 F4","7:58 F4","8:22 F4","8:41 F4","9:05 F4","9:25 F4","9:44 F4"]
[null,"GRAFTON (CG)","Fields","3,7,4 ","6,7,2 ","3,1,8 ","9,4,8 ","4,5,1 ","8,2,3 ","4,8,5 ","3,6,7 ","5,6,1 ","5,8,6 "]
[null,"MANDURAH (PG)","Fields","08:36:00","08:51:00","09:06:00","09:21:00","09:39:00","10:00:00","10:17:00","10:35:00","10:57:00","11:12:00","11:32:00","11:52:00"]
[null,"WARRAGUL (EG)","Fields","6,1,8 ","1,4,5 ","7,8,3 ","2,5,3 ","7,1,3 ","4,2,1 ","4,8,7 ","7,6,4 ","2,3,6 ","8,1,10 ","8,5,1 ","5,2,7 "]
[null,"CAMBRIDGE (OG)","Fields","5,7,2 ","6,1,7 ","5,6,2 ","8,7,3 ","8,5,3 ","2,1,7 ","8,7,5 ","2,5,3 ","1,3,5 ","1,2,6 ","5,1,4 ","7,6,4 "]
[null,"ADDINGTON (ZG)","Fields","1,4,7 ","8,7,1 ","5,8,9 ","8,1,2 ","6,2,5 ","Abnd ","Abnd ","Abnd ","Abnd ","Abnd ","Abnd ","Abnd "]
[null,"HOBART (TG)","Fields","06:38:00","07:00:00","07:22:00","07:42:00","08:05:00","08:25:00","08:44:00","09:08:00","09:28:00","09:48:00"]
["Last Race Results","Multi-leg Info","Scratchings"]
[]
["Help","Gambling Advice","TAB Home","Refresh"]
["© Copyright UNiTAB Ltd","Created: Thu, 02 Dec 2010 17:16:50 Aust EST"]

{"sheet":"Form","index":5,"n_rows":167,"n_cols":9,"rows_kept":167,"cut":false,"hidden":false,"merged":[[161,0,161,7],[162,0,162,7],[163,0,163,7],[144,0,144,7],[145,0,145,7],[146,0,146,7],[150,0,150,2],[150,3,150,5],[150,6,150,7],[151,0,151,2],[151,3,151,7],[155,5,155,7],[133,0,133,2],[133,3,133,5],[133,6,133,7],[134,0,134,2],[134,3,134,7],[138,5,138,7],[140,0,140,7],[141,0,141,7],[143,0,143,7],[99,0,99,2],[99,3,99,5],[99,6,99,7],[100,0,100,2],[100,3,100,7],[104,5,104,7],[106,0,106,7],[107,0,107,7],[109,0,109,7],[83,0,83,2],[83,3,83,7],[87,5,87,7],[89,0,89,7],[90,0,90,7],[92,0,92,7],[93,0,93,7],[94,0,94,7],[95,0,95,7],[72,0,72,7],[73,0,73,7],[75,0,75,7],[76,0,76,7],[77,0,77,7],[78,0,78,7],[82,0,82,2],[82,3,82,5],[82,6,82,7],[36,5,36,7],[38,0,38,7],[39,0,39,7],[41,0,41,7],[42,0,42,7],[43,0,43,7],[44,0,44,7],[48,0,48,2],[48,3,48,5],[48,6,48,7],[24,0,24,7],[25,0,25,7],[26,0,26,7],[27,0,27,7],[31,0,31,2],[31,3,31,5],[31,6,31,7],[32,0,32,2],[32,3,32,7],[14,0,14,2],[14,3,14,5],[14,6,14,7],[15,0,15,2],[15,3,15,7],[16,0,16,7],[19,5,19,7],[21,0,21,7],[22,0,22,7],[211,0,211,7],[179,5,179,7],[202,0,202,2],[202,3,202,5],[202,6,202,7],[203,0,203,2],[203,3,203,7],[207,5,207,7],[209,0,209,7],[210,0,210,7],[131,0,131,7],[132,0,132,7],[101,0,101,7],[110,0,110,7],[111,0,111,7],[112,0,112,7],[116,0,116,2],[116,3,116,5],[116,6,116,7],[117,0,117,2],[117,3,117,7],[121,5,121,7],[123,0,123,7],[124,0,124,7],[126,0,126,7],[127,0,127,7],[128,0,128,7],[129,0,129,7],[196,5,196,7],[188,0,188,7],[189,0,189,7],[191,0,191,2],[191,3,191,5],[191,6,191,7],[192,0,192,2],[192,3,192,7],[193,0,193,7],[171,0,171,7],[172,0,172,7],[176,0,176,7],[174,0,174,2],[174,3,174,5],[174,6,174,7],[175,0,175,2],[175,3,175,7],[157,0,157,7],[158,0,158,7],[160,0,160,7],[125,0,125,7],[108,0,108,7],[135,0,135,7],[130,0,130,7],[49,0,49,2],[49,3,49,7],[53,5,53,7],[55,0,55,7],[56,0,56,7],[58,0,58,7],[59,0,59,7],[60,0,60,7],[61,0,61,7],[65,0,65,2],[65,3,65,5],[65,6,65,7],[66,0,66,2],[66,3,66,7],[70,5,70,7],[115,0,115,7],[113,0,113,7],[114,0,114,7],[91,0,91,7],[74,0,74,7],[57,0,57,7],[23,0,23,7],[40,0,40,7],[277,0,277,7],[258,0,258,7],[259,0,259,7],[260,0,260,7],[255,5,255,7],[257,0,257,7],[251,0,251,2],[234,3,234,7],[235,0,235,7],[238,5,238,7],[240,0,240,7],[250,0,250,2],[250,3,250,5],[250,6,250,7],[251,3,251,7],[274,0,274,7],[275,0,275,7],[268,0,268,2],[268,3,268,7],[272,5,272,7],[166,0,166,7],[216,0,216,2],[216,3,216,5],[216,6,216,7],[200,0,200,7],[201,0,201,7],[204,0,204,7],[170,0,170,7],[173,0,173,7],[187,0,187,7],[190,0,190,7],[199,0,199,7],[152,0,152,7],[165,0,165,7],[167,0,167,7],[142,0,142,7],[159,0,159,7],[225,0,225,7],[217,3,217,7],[218,0,218,7],[221,5,221,7],[223,0,223,7],[233,0,233,2],[233,3,233,5],[233,6,233,7],[267,0,267,2],[267,3,267,5],[267,6,267,7],[234,0,234,2],[217,0,217,2],[264,0,264,7],[252,0,252,7],[261,0,261,7],[230,0,230,7],[242,0,242,7],[224,0,224,7],[336,0,336,7],[342,0,342,7],[343,0,343,7],[344,0,344,7],[0,0,0,4],[0,5,0,8],[1,0,1,1],[1,2,1,3],[1,4,1,5],[1,6,1,7],[168,0,168,7],[164,0,164,7],[147,0,147,7],[148,0,148,7],[149,0,149,7],[276,0,276,7],[2,0,2,1],[2,2,2,3],[2,4,2,6],[2,7,2,8],[308,0,308,7],[286,0,286,7],[245,0,245,7],[290,0,290,7],[303,0,303,7],[306,0,306,7],[232,0,232,7],[186,0,186,7],[169,0,169,7],[244,0,244,7],[226,0,226,7],[227,0,227,7],[229,0,229,7],[231,0,231,7],[305,0,305,7],[266,0,266,7],[265,0,265,7],[307,0,307,7],[280,0,280,7],[285,0,285,7],[287,0,287,7],[284,0,284,7],[278,0,278,7],[279,0,279,7],[281,0,281,7],[301,0,301,7],[295,0,295,7],[282,0,282,7],[283,0,283,7],[288,0,288,2],[288,3,288,5],[288,6,288,7],[302,0,302,7],[304,0,304,7],[289,0,289,2],[289,3,289,7],[293,5,293,7],[296,0,296,7],[297,0,297,7],[298,0,298,7],[299,0,299,7],[309,0,309,7],[310,0,310,7],[348,0,348,7],[354,0,354,7],[351,5,351,7],[353,0,353,7],[320,0,320,7],[311,0,311,7],[322,0,322,7],[323,0,323,7],[312,3,312,5],[312,6,312,7],[329,6,329,7],[313,0,313,2],[313,3,313,7],[317,5,317,7],[319,0,319,7],[321,0,321,7],[326,0,326,7],[324,0,324,7],[347,0,347,2],[347,3,347,7],[345,0,345,7],[338,0,338,7],[329,3,329,5],[314,0,314,7],[312,0,312,2],[358,0,358,7],[359,0,359,7],[360,0,360,7],[355,0,355,7],[356,0,356,7],[357,0,357,7],[327,0,327,7],[328,0,328,7],[325,0,325,7],[331,0,331,7],[330,0,330,2],[330,3,330,7],[329,0,329,2],[339,0,339,7],[340,0,340,7],[341,0,341,7],[346,0,346,2],[346,3,346,5],[346,6,346,7],[337,0,337,7],[334,5,334,7],[370,3,370,7],[371,0,371,7],[385,0,385,7],[386,0,386,2],[386,3,386,5],[386,6,386,7],[387,0,387,2],[387,3,387,7],[361,0,361,7],[362,0,362,7],[363,0,363,7],[364,0,364,7],[365,0,365,7],[384,0,384,7],[383,0,383,7],[374,5,375,7],[376,0,376,7],[377,0,377,7],[366,0,366,7],[367,0,367,7],[368,0,368,7],[369,0,369,2],[369,3,369,5],[369,6,369,7],[400,0,400,7],[401,0,401,2],[378,0,378,7],[379,0,379,7],[380,0,380,7],[381,0,381,7],[382,0,382,7],[401,3,401,5],[401,6,401,7],[388,0,388,7],[399,0,399,7],[393,0,393,7],[394,0,394,7],[395,0,395,7],[396,0,396,7],[397,0,397,7],[398,0,398,7],[391,5,392,7],[420,0,420,7],[413,0,413,7],[414,0,414,7],[415,0,415,7],[416,0,416,7],[402,0,402,2],[402,3,402,7],[403,0,403,7],[406,5,407,7],[408,0,408,7],[212,0,212,7],[181,0,181,7],[182,0,182,7],[213,0,213,7],[185,0,185,7],[370,0,370,2],[432,0,432,7],[428,0,428,7],[429,0,429,7],[430,0,430,7],[431,0,431,7],[409,0,409,7],[410,0,410,7],[411,0,411,7],[412,0,412,7],[423,5,424,7],[419,0,419,2],[419,3,419,7],[418,0,418,2],[418,3,418,5],[418,6,418,7],[425,0,425,7],[426,0,426,7],[427,0,427,7],[62,0,62,7],[63,0,63,7],[417,0,417,7],[263,0,263,7],[183,0,183,7],[184,0,184,7],[262,0,262,7],[243,0,243,7],[228,0,228,7],[198,0,198,7],[248,0,248,7],[246,0,246,7],[247,0,247,7],[249,0,249,7],[118,0,118,7],[214,0,214,7],[300,0,300,7],[269,0,269,7],[241,0,241,7],[215,0,215,7],[96,0,96,7],[97,0,97,7],[98,0,98,7],[28,0,28,7],[50,0,50,7],[29,0,29,7],[67,0,67,7],[30,0,30,7],[84,0,84,7],[47,0,47,7],[64,0,64,7],[45,0,45,7],[46,0,46,7],[33,0,33,7],[79,0,79,7],[80,0,80,7],[81,0,81,7]]}
["Form - Rockhampton 02/12/10"]
["Race 5",null,"Allenstown Hotel Hcp (c4)",null,"Class 4",null,null,null,"1300m"]
["04:05:00",null,"Apprentices Can Claim",null,"Handicap Min Hcp Wgt : 54.0",null,null,10000]
["#","Form","Horse (Barrier)","Trainer","Jockey","Weight","API","Win %","Place %"]
[1,114823,"Dack's Faz (8)","Craig Smith","Ali Taylor",58,2.4,28.6,64.3]
[2,515137,"Igotitfrommymumma (3)","T Cook","A Coome",55.5,1.3,12.9,41.9]
[3,258918,"Noble Lustre (5)","J Brown","J Kropp",55.5,2.1,11.1,33.299999999999997]
[4,351546,"Chabal (4)","R J Walsh","D Simmons",55,1.1000000000000001,12.5,41.7]
[5,799371,"Craiglea Tina (2)","P Fleming",null,54,2.2999999999999998,17.600000000000001,41.2]
[6,374161,"Lola Brigida (7)","D J Munns","T Bannon",54,1.1000000000000001,9.1,30.3]
[7,838930,"Zenacity (1)","J P O'Shea","C Whiteley",54,0.9,8.6,28.6]
["1900-01-08","4529-08-21","Dandy Kat (6)","R Vale","J P Stanley",54,1.3,11.8,47.1]
[9,358366,"Fu Min Bu (9)","R Sullivan","R Bell",54,0.5,5.4,21.6]
[]
["1 Dack's Faz (8) 58.0kg 5yo b/br g",null,null,"Trainer: Craig Smith at Roma",null,null,"Jockey: Ali Taylor"]
["Colours: Gold, black sash and cap",null,null,"Breeding: Fasliyev (USA) - Fifth Ward (USA) by Houston"]
["Owners: D L McLennan"]
["Career:","Earnings:","Win: 28.6%","API:","First Up:","Second Up:","Distance:","Track:"]
["2010-02-03T14:04:00",33125,"Place: 64.3%",2.4,"2010-01-01T04:02:00","3:1-0-0","0:0-0-0","3:1-1-0"]
["Fast:","Good:","Dead:","Slow:","Heavy:"]
["1:1-0-0","2010-02-03T09:00:00","2:1-0-0","1:1-0-0","1:1-0-0"]
["3-12 2.0L, Roma, 2010-11-20, 1200m, Good, Race 4, Plate, Cls 6, $15000, ($1500), Ali Taylor, 4, Cd 57.5-0.0, (SW), 1:12.99, (), 7/1, Settled-- 1200-- 800-- Turn--, 1-Fidakat 57.0"]
["2-9 0.1L, Emrld, 2010-11-06, 1200m, Good, Race 3, Hcp, Cls 4, $6000, ($1200), Ali Taylor, 8, Cd 60.5-0.0, (55.0), 1:09.56, (), 13/4, Settled-- 1200-- 800-- Turn--, 1-Senorina 53.0"]
["8-10 4.7L, G Cst, 2010-10-28, 1100m, Dead, Race 6, Hcp, Cls 5, $12000, ($0), C McIver, 1, Cd 54.5-0.0, (54.0), 1:04.47, (34.63), 10/1, Settled-5 1200-- 800-- Turn-10, 1-Tonkatsu 55.5"]
["4-11 3.4L, Emrld, 2010-10-09, 1000m, Good, Race 2, Hcp, Cls 4, $6000, ($200), R Cox, 3, Cd 59.5--1.5, (55.0), 0:57.38, (), 1/1F, Settled-- 1200-- 800-- Turn--, 1-Black Angus 56.0"]
["1-9 0.3L, Rocky, 2010-09-23, 970m, Heavy, Race 6, Hcp, Cls 3, $12000, ($7800), C McIver, 6, Cd 56.5-0.0, (54.0), 0:57.42, (34.27), 7/2, Settled-- 1200-- 800-- Turn--, 2-Basheeba 54.5"]
["1-7 4.3L, Chinch, 2008-11-08, 1200m, Dead, Race 2, Plate, Cls 3, $6500, ($4200), L McCoy, 6, Cd 58.0-0.0, (SW), 1:10.02, (), 8/11F, Settled-- 1200-- 800-- Turn--, 2-My Kavita 54.5"]
["2-8 3.0L, Twba, 2008-10-24, 1000m, Good, Race 8, 3yo+ Hcp, Cls 3 3+, $10000, ($2000), L McCoy, 3, Cd 54.0-0.0, (54.0), 0:58.95, (34.59), 13/4, Settled-2 1200-- 800-- Turn-2, 1-Morcombe 52.0"]
["1-9 2.5L, Twba, 2008-10-11, 1012m, Slow, Race 2, 3yo+ Hcp, Cls 1 3+, $10000, ($6500), C Eaton, 1, Cd 54.0-0.0, (54.0), 1:01.05, (36.05), 8/1, Settled-1 1200-- 800-- Turn-1, 2-Magical Joker 58.0"]
["1-10 2.5L, Taroom, 2008-09-27, 1000m, Fast, Race 1, 3yo+ Mdn, Mdn 3+, $8000, ($5200), L McCoy, 1, Cd 57.0-0.0, (SW), 0:58.86, (), 2/1F, Settled-- 1200-- 800-- Turn--, 2-Mon Jolie 56.5"]
["7-10 10.3L, Rocky, 2008-04-19, 1200m, Good, Race 4, 2yo Classic, Open 2, $30000, ($0), L McCoy, 9, Cd 57.0-0.0, (54.0), 1:12.27, (), 6/1, Settled-- 1200-- 800-- Turn--, 1-Ready Royal 55.0"]
["2 Igotitfrommymumma (3) 55.5kg 6yo b g",null,null,"Trainer: T Cook at Rockhampton",null,null,"Jockey: A Coome"]
["Colours: White with green dollar sign, red sleeves and cap",null,null,"Breeding: Natural Act - Fuji Mama by Fuji Kiseki"]
["Owners: Mrs K & C Curd"]
["Career:","Earnings:","Win: 12.9%","API:","First Up:","Second Up:","Distance:","Track:"]
[40303.294444444444,41245,"Place: 41.9%","1900-01-01T07:12:00","4:0-0-1","3:0-0-1","3:0-0-0","2010-01-01T11:01:00"]
["Fast:","Good:","Dead:","Slow:","Heavy:"]
["0:0-0-0",40242.043749999997,"5:1-0-2","0:0-0-0","1:0-0-0"]
["7-8 4.2L, Rocky, 2010-11-04, 1300m, Dead, Race 4, Hcp, Cls 5, $12000, ($0), C Pye, 1, Cd 52.0--2.0, (54.0), 1:18.05, (35.11), 12/1, Settled-- 1200-- 800-- Turn--, 1-Martiros 54.5"]
["3-7 2.4L, Mackay, 2010-10-19, 1500m, Good, Race 2, Plate, Cls 6, $10000, ($1000), C Pye, 6, Cd 52.5--3.0, (SW), 1:30.50, (), 5/1, Settled-2 1200-- 800-- Turn-3, 1-Polrossa 55.5"]
["1-6 0.2L, Mackay, 2010-10-09, 1500m, Good, Race 2, Hcp, Cls 4, $7500, ($4800), K Cross, 6, Cd 51.0--3.0, (54.0), 1:28.90, (), 5/2, Settled-- 1200-- 800-- Turn--, 2-Ellehro 54.0"]
["5-9 8.5L, Mackay, 2010-09-28, 1250m, Heavy, Race 6, Plate, Cls 3, $10000, ($0), H O'Hara, 9, Cd 55.5--3.0, (SW), 1:16.40, (), 8/1, Settled-8 1200-- 800-- Turn-8, 1-Achill Island 57.0"]
["1-7 3.0L, S'sure, 2010-09-18, 1400m, Good, Race 5, Hcp, Cls 2, $5100, ($3400), H O'Hara, 6, Cd 54.5--2.0, (55.0), 1:27.55, (), 3/1, Settled-- 1200-- 800-- Turn--, 2-Craiglea Fancy 53.0"]
["5-11 5.7L, Mackay, 2010-09-07, 1250m, Good, Race 5, Hcp, Cls 2, $10000, ($0), H O'Hara, 7, Cd 52.0--2.0, (54.0), 1:14.00, (), 20/1, Settled-9 1200-- 800-- Turn-8, 1-Essington 58.0"]
["10-12 7.7L, Mackay, 2010-06-17, 1500m, Good, Race 5, Hcp, Cls 2, $10000, ($0), R Wiggins, 9, Cd 54.0-0.0, (54.0), 1:29.75, (), 12/1, Settled-8 1200-- 800-- Turn-11, 1-Great Gretzky 56.0"]
["9-10 8.6L, Rocky, 2010-05-22, 1600m, Good, Race 3, Hcp, Cls 3, $6000, ($0), C McIver, 2, Cd 54.0-0.0, (54.0), 1:36.03, (37.20), 14/1, Settled-- 1200-- 800-- Turn--, 1-Timecall 58.0"]
["4-6 5.5L, Mackay, 2010-05-01, 1250m, Good, Race 1, Hcp, Cls 3, $6000, ($200), D Simmons, 4, Cd 54.0-0.0, (54.0), 1:14.13, (), 5/2, Settled-- 1200-- 800-- Turn--, 1-Eagledance Kid 54.0"]
["3-9 1.8L, Mackay, 2010-04-13, 1050m, Dead, Race 7, Hcp, Cls 2, $12000, ($1200), T Bannon, 1, Cd 55.0-0.0, (54.5), 1:01.58, (), 12/1, Settled-- 1200-- 800-- Turn--, 1-God's Window 55.5"]
["3 Noble Lustre (5) 55.5kg 5yo b/br g",null,null,"Trainer: J Brown at Rockhampton",null,null,"Jockey: J Kropp"]
["Colours: Dark blue, yellow seams and cap",null,null,"Breeding: Lujain (USA) - Noreaster by Fuji Kiseki"]
["Owners: J Brown, L L Chang & V Brown"]
["Career:","Earnings:","Win: 11.1%","API:","First Up:","Second Up:","Distance:","Track:"]
[40241.127083333333,57482,"Place: 33.3%",2.1,"5:1-0-0","5:0-1-0","0:0-0-0","5:1-0-0"]
["Fast:","Good:","Dead:","Slow:","Heavy:"]
["0:0-0-0","2010-01-02T11:01:00","2010-01-01T08:00:00","4:1-0-1","4:1-0-0"]
["8-13 4.5L, Rocky, 2010-11-11, 1200m, Good, Race 7, Hcp, Cls 3, $10000, ($0), B Stewart, 6, Cd 57.0-0.0, (54.0), 1:10.07, (34.16), 7/1, Settled-- 1200-- 800-- Turn--, 1-Angel Force 54.0"]
["1-6 2.0L, Rocky, 2010-11-02, 1200m, Good, Race 4, Plate, Cls 3, $6000, ($4000), K Cross, 1, Cd 54.0--3.0, (SW), 1:10.31, (33.24), 5/2, Settled-- 1200-- 800-- Turn--, 2-Mountain King 54.0"]
["9-15 7.2L, Rocky, 2010-10-07, 1200m, Good, Race 7, Hcp, Cls 3, $10000, ($0), B Stewart, 12, Cd 56.0-0.0, (54.0), 1:10.26, (34.68), 7/1, Settled-- 1200-- 800-- Turn--, 1-Basheeba 56.0"]
["8-9 5.4L, Rocky, 2010-09-23, 970m, Heavy, Race 6, Hcp, Cls 3, $12000, ($0), B Stewart, 2, Cd 55.5-0.0, (54.0), 0:57.42, (34.27), 13/4E, Settled-- 1200-- 800-- Turn--, 1-Dack's Faz 56.5"]
["5-10 4.0L, Rocky, 2010-09-09, 970m, Good, Race 1, Hcp, Cls 2, $10000, ($0), D Simmons, 7, Cd 58.0-0.0, (54.0), 0:55.87, (33.16), 3/1E, Settled-- 1200-- 800-- Turn--, 1-Noosa Bay 53.0"]
["2-5 2.0L, Ball't, 2010-03-04, 1100m, Dead, Race 5, Hcp, RB72, $15000, ($2700), L Nolen, 2, Cd 55.0-0.0, (53.0), 1:06.04, (), 7/4, Settled-3 1200-- 800-- Turn-2, 1-My Girl Helen 56.5"]
["6-11 1.8L, K'more, 2010-02-14, 1200m, Dead, Race 6, Hcp, RB68, $22500, ($200), B Rawiller, 9, Cd 57.5-0.0, (53.0), 1:11.22, (), 9/2E, Settled-2 1200-- 800-- Turn-1, 1-De Dion Bouton 57.5"]
["4-8 2.0L, Morn., 2010-01-29, 1223m, Dead, Race 5, Hcp, RB68, $13000, ($500), B Rawiller, 5, Cd 57.5-0.0, (54.0), 1:13.52, (), 7/4F, Settled-2 1200-- 800-- Turn-1, 1-Into The Sun 58.0"]
["2-13 0.5L, Ball't, 2010-01-14, 1200m, Good, Race 8, Hcp, RB68, $22500, ($4200), B Rawiller, 11, Cd 57.0-0.0, (53.0), 1:10.18, (), 12/1, Settled-3 1200-- 800-- Turn-2, 1-Mikeys Magic 56.0"]
["3-8 1.1L, St.Ck, 2009-12-28, 1100m, Good, Race 6, Hcp, RB68, $12000, ($1000), J Noonan, 8, Cd 56.0--2.0, (53.0), 1:06.52, (), 13/2, Settled-8 1200-- 800-- Turn-7, 1-Shaemist Mountain 54.5"]
["4 Chabal (4) 55.0kg 5yo b g",null,null,"Trainer: R J Walsh at Mackay",null,null,"Jockey: D Simmons"]
["Colours: Black, lime green sleeves and cap",null,null,"Breeding: Kbenjar - Fietinski by Semipalatinsk"]
["Owners: Mrs K E Walsh, C E Watts & D W Matsen"]
["Career:","Earnings:","Win: 12.5%","API:","First Up:","Second Up:","Distance:","Track:"]
[40301.002083333333,26875,"Place: 41.7%","1900-01-01T02:24:00","4:0-0-3","4:0-0-0","3:1-0-0","5:0-0-1"]
["Fast:","Good:","Dead:","Slow:","Heavy:"]
["0:0-0-0","2010-03-02T17:02:00","5:1-0-1","1:0-0-1","1:0-0-0"]
["6-13 3.1L, Rocky, 2010-11-11, 1200m, Good, Race 7, Hcp, Cls 3, $10000, ($0), J P Stanley, 7, Cd 56.5-0.0, (54.0), 1:10.07, (34.16), 25/1, Settled-- 1200-- 800-- Turn--, 1-Angel Force 54.0"]
["4-11 2.8L, Rocky, 2010-08-26, 2243m, Dead, Race 4, Hcp, Cls 4, $12000, ($600), Dale Missen, 8, Cd 56.5-0.0, (54.0), 2:21.97, (36.58), 8/1, Settled-- 1200-- 800-- Turn--, 1-Sir Echo 55.5"]
["5-11 2.2L, T'vill, 2010-08-21, 1630m, Good, Race 4, Hcp, Cls 4, $15000, ($0), A Merritt, 11, Cd 54.0-0.0, (54.0), 1:39.31, (35.60), 8/1, Settled-- 1200-- 800-- Turn--, 1-Northern Apache 54.0"]
["1-11 0.1L, T'vill, 2010-08-03, 1630m, Good, Race 5, Hcp, Cls 3, $12000, ($7800), T Bannon, 2, Cd 54.0-0.0, (54.0), 1:39.75, (35.37), 11/1, Settled-- 1200-- 800-- Turn--, 2-Hamatym 56.5"]
["5-11 5.0L, Rocky, 2010-07-15, 1814m, Good, Race 3, Hcp, Cls 2, $12000, ($0), Dale Missen, 10, Cd 57.5-0.0, (54.0), 1:54.00, (34.39), 13/4, Settled-- 1200-- 800-- Turn--, 1-Hot Shot Henry 54.0"]
["3-12 0.3L, T'vill, 2010-06-14, 1630m, Good, Race 2, Plate, Cls 3, $10000, ($1000), Dale Missen, 6, Cd 57.0-0.0, (SW), 1:39.48, (35.81), 5/1, Settled-- 1200-- 800-- Turn--, 1-Keen On You 58.5"]
["1-8 5.0L, Mackay, 2010-05-29, 1800m, Dead, Race 4, Hcp, Cls 1, $7500, ($4800), Dale Missen, 7, Cd 58.0-0.0, (54.0), 1:50.22, (), 15/4, Settled-- 1200-- 800-- Turn--, 2-Sure Of Heart 54.0"]
["3-6 11.1L, Mackay, 2010-05-11, 1800m, Slow, Race 1, Hcp, Cls 1, $10000, ($1000), Dale Missen, 1, Cd 57.0-0.0, (54.0), 1:57.79, (), 2/1, Settled-- 1200-- 800-- Turn--, 1-Galaxy Stalker 56.0"]
["2-8 0.4L, Mackay, 2010-05-01, 1500m, Good, Race 6, Hcp, Cls 1, $6000, ($1200), N Patchett, 5, Cd 54.0-0.0, (54.0), 1:31.04, (), 7/1, Settled-- 1200-- 800-- Turn--, 1-Prom Knight 54.0"]
["6-8 4.1L, T'vill, 2010-04-22, 1400m, Good, Race 1, Hcp, Cls 1, $10000, ($0), A Spinks, 6, Cd 54.0-0.0, (54.0), 1:23.39, (34.60), 7/1, Settled-- 1200-- 800-- Turn--, 1-Cinque Terre 58.5"]
["5 Craiglea Tina (2) 54.0kg 3yo br f",null,null,"Trainer: P Fleming at Sunshine Coast",null,null,"Jockey: "]
["Colours: Blue, white crossed sashes, white striped sleeves, blue cap",null,null,"Breeding: Top Echelon - Clementina by Scenic"]
["Owners: S M Johnston, Mrs M L Johnston, W A & J J Johnston & Miss K J E Johnston"]
["Career:","Earnings:","Win: 17.6%","API:","First Up:","Second Up:","Distance:","Track:"]
["2010-03-01T17:03:00",39150,"Place: 41.2%","1900-01-02T07:12:00","2:1-0-0","2:1-0-0","2:0-1-0","2:0-0-0"]
["Fast:","Good:","Dead:","Slow:","Heavy:"]
["0:0-0-0","2010-03-01T15:03:00","0:0-0-0","2:0-0-0","0:0-0-0"]
["1-9 2.0L, Gympie, 2010-11-27, 1470m, Good, Race 3, Plate, Cls 3, $6000, ($4000), K James, 4, Cd 53.0--3.0, (SW), 1:31.06, (), 5/2, Settled-- 1200-- 800-- Turn--, 2-Tic Toc Tiger 56.0"]
["7-12 6.4L, Roma, 2010-11-20, 1640m, Good, Race 6, Plate, Cls 3, $15000, ($0), K James, 8, Cd 54.0--3.0, (SW), 1:45.13, (), 7/1, Settled-- 1200-- 800-- Turn--, 1-Bruncher 59.0"]
["3-6 2.2L, SCstIn, 2010-11-14, 1250m, Good, Race 2, Hcp, Cls 2, $10000, ($1000), K Wharton, 2, Cd 54.0-0.0, (54.0), 1:16.65, (35.16), 5/2, Settled-1 1200-- 800-- Turn-2, 1-Monashee Matty 51.0"]
["9-11 6.8L, Rocky, 2010-10-21, 1300m, Good, Race 7, Hcp, Cls 4, $10000, ($0), J Kropp, 11, Cd 52.0--2.0, (54.0), 1:17.04, (34.86), 12/1, Settled-- 1200-- 800-- Turn--, 1-Ewey Bay 51.0"]
["9-14 11.5L, E.Farm, 2010-10-02, 1400m, Slow, Race 5, 3yo Hcp, Open 3, $50000, ($0), J Kropp, 4, Cd 51.5--1.5, (53.0), 1:25.45, (37.84), 100/1, Settled-3 1200-- 800-- Turn-3, 1-Random Orbit 53.0"]
["7-8 2.2L, Suncst, 2010-09-19, 1600m, Good, Race 2, 3yo Hcp, Cls 2 3, $10000, ($0), J Kropp, 6, Cd 53.0--2.0, (54.0), 1:37.87, (35.19), 14/1, Settled-1 1200-- 800-1 Turn-1, 1-Satch 57.5"]
["3-11 1.5L, Mackay, 2010-09-07, 1250m, Good, Race 5, Hcp, Cls 2, $10000, ($1000), K Cross, 3, Cd 51.0--3.0, (54.0), 1:14.00, (), 13/4, Settled-2 1200-- 800-- Turn-1, 1-Essington 58.0"]
["4-7 3.8L, Suncst, 2010-08-15, 1600m, Slow, Race 1, 3yo Hcp, Cls 2 3, $10000, ($500), K Wharton, 4, Cd 55.5-0.0, (54.0), 1:39.71, (37.59), 4/1, Settled-3 1200-- 800-5 Turn-4, 1-Just About Ready 56.0"]
["10-15 9.1L, E.Farm, 2010-07-24, 1500m, Good, Race 1, 2yo Hcp, Open 2, $50000, ($0), J Kropp, 2, Cd 51.5--3.0, (53.0), 1:30.06, (35.91), 60/1, Settled-1 1200-- 800-- Turn-1, 1-Fillydelphia 56.0"]
["2-7 5.0L, Twbc, 2010-07-17, 1300m, Good, Race 6, 2yo Hcp, Open 2, $10000, ($2000), K Wharton, 1, Cd 56.0-0.0, (54.0), 1:20.16, (36.70), 15/4, Settled-4 1200-- 800-- Turn-3, 1-Hidden Treasure 57.0"]
["6 Lola Brigida (7) 54.0kg 5yo ch m",null,null,"Trainer: D J Munns at Bluff",null,null,"Jockey: T Bannon"]
["Colours: Lime green, maroon sash, maroon sleeves",null,null,"Breeding: Street Cry (IRE) - Kiss The Flame by Prince Of Birds"]
["Owners: D Munns"]
["Career:","Earnings:","Win: 9.1%","API:","First Up:","Second Up:","Distance:","Track:"]
[40272.377083333333,36350,"Place: 30.3%","1900-01-01T02:24:00","3:0-0-0","3:1-0-0","4:1-0-1","8:1-0-3"]
["Fast:","Good:","Dead:","Slow:","Heavy:"]
["0:0-0-0","2010-03-01T13:01:00","2010-01-01T18:02:00","0:0-0-0","2:0-1-0"]
["1-11 4.5L, Emrld, 2010-11-27, 1300m, Good, Race 5, Plate, Cls 3, $6000, ($4000), T Bannon, 10, Cd 56.0-0.0, (SW), 1:17.32, (), 5/1, Settled-- 1200-- 800-- Turn--, 2-Senorina 55.5"]
["6-11 4.4L, Rocky, 2010-11-18, 1200m, Good, Race 6, Hcp, Cls 4, $12000, ($0), C McIver, 7, Cd 54.0-0.0, (54.0), 1:10.05, (34.36), 14/1, Settled-- 1200-- 800-- Turn--, 1-Two Tone 58.5"]
["1-9 0.5L, Rocky, 2010-11-04, 1200m, Dead, Race 5, Hcp, Cls 1, $10000, ($6500), Ash Butler, 9, Cd 54.5-0.0, (54.0), 1:11.60, (35.17), 11/1, Settled-- 1200-- 800-- Turn--, 2-Kickdahabit 53.5"]
["4-6 9.3L, Glad., 2010-10-23, 1194m, Good, Race 5, Hcp, Cls 2, $6000, ($200), C A Beets, 3, Cd 57.0-0.0, (55.0), 1:12.77, (), 13/8, Settled-- 1200-- 800-- Turn--, 1-Old Flame 55.0"]
["7-12 4.7L, Rocky, 2010-10-14, 1100m, Good, Race 5, F&m Hcp, Cls 1 fm, $10000, ($0), T Bannon, 3, Cd 57.5-0.0, (54.0), 1:03.96, (33.99), 4/1, Settled-- 1200-- 800-- Turn--, 1-Run Kylie Run 58.5"]
["3-14 1.4L, Rocky, 2010-09-16, 1200m, Good, Race 5, Hcp, Cls 2, $10000, ($1000), H O'Hara, 6, Cd 53.0--2.0, (54.0), 1:10.21, (34.58), 6/1, Settled-- 1200-- 800-- Turn--, 1-Senorina 52.0"]
["3-9 2.8L, Rocky, 2010-09-09, 1300m, Good, Race 3, Hcp, Cls 4, $12000, ($1200), H O'Hara, 1, Cd 53.0--1.0, (54.0), 1:16.40, (34.90), 9/1, Settled-- 1200-- 800-- Turn--, 1-Martiros 55.0"]
["6-11 1.8L, Emrld, 2010-09-04, 1200m, Good, Race 3, Hcp, Cls 4, $6000, ($0), M Cant, 6, Cd 55.0-0.0, (55.0), 1:09.81, (), 8/1, Settled-- 1200-- 800-- Turn--, 1-Kalkie Miss 54.5"]
["13-13 50.1L, Rocky, 2010-08-26, 1100m, Dead, Race 6, Hcp, Cls 1, $10000, ($0), N Thomas, 10, Cd 54.5-0.0, (54.0), 1:04.66, (34.91), 10/1, Settled-- 1200-- 800-- Turn--, 1-Dad's Best Mate 54.0"]
["3-10 2.5L, Rocky, 2010-08-12, 1200m, Dead, Race 6, Hcp, Cls 2, $10000, ($1000), N Thomas, 2, Cd 54.0-0.0, (54.0), 1:11.28, (34.02), 8/1, Settled-- 1200-- 800-- Turn--, 1-Aladah 56.0"]
["7 Zenacity (1) 54.0kg 7yo b m",null,null,"Trainer: J P O'Shea at Rockhampton",null,null,"Jockey: C Whiteley"]
["Colours: Pink, blue hooped sleeves and pink cap",null,null,"Breeding: Ne Coupez Pas (USA) - Ancity Roller (NZ) by Citidancer"]
["Owners: D O'Shea & S J Little"]
["Career:","Earnings:","Win: 8.6%","API:","First Up:","Second Up:","Distance:","Track:"]
[40272.460416666669,30725,"Place: 28.6%","21:36:00","6:1-0-2","6:0-0-2","3:0-1-0","5:0-0-1"]
["Fast:","Good:","Dead:","Slow:","Heavy:"]
["0:0-0-0","2010-02-01T20:03:00","5:0-0-1","5:0-2-0","5:0-0-1"]
["11-11 7.5L, Rocky, 2010-11-18, 1200m, Good, Race 6, Hcp, Cls 4, $12000, ($0), R Hall, 10, Cd 54.0-0.0, (54.0), 1:10.05, (34.36), 25/1, Settled-- 1200-- 800-- Turn--, 1-Two Tone 58.5"]
["3-5 3.7L, Glad., 2010-11-02, 1000m, Dead, Race 2, Plate, Cls 3, $6000, ($600), R Hall, 2, Cd 57.5-0.0, (SW), 1:00.21, (), 6/4, Settled-- 1200-- 800-- Turn--, 1-Mala Mala 54.0"]
["9-13 8.4L, Rocky, 2010-06-01, 1400m, Good, Race 7, Hcp, Cls 4, $10000, ($0), C Whiteley, 1, Cd 54.0-0.0, (54.0), 1:22.03, (34.27), 12/1, Settled-- 1200-- 800-- Turn--, 1-Writer 54.5"]
["8-12 4.2L, Rocky, 2010-05-18, 1300m, Good, Race 8, Hcp, Cls 4, $10000, ($0), M Hellyer, 5, Cd 54.0-0.0, (54.0), 1:16.57, (35.01), 12/1, Settled-- 1200-- 800-- Turn--, 1-Allbutmine 54.0"]
["3-10 3.1L, Rocky, 2010-05-06, 1050m, Good, Race 7, Hcp, Cls 4, $10000, ($1000), C Whiteley, 2, Cd 54.0-0.0, (54.0), 1:00.35, (33.75), 25/1, Settled-- 1200-- 800-- Turn--, 1-Andy Said 55.5"]
["8-10 3.3L, Rocky, 2010-04-20, 970m, Good, Race 5, Hcp, Cls 4, $10000, ($0), R Hall, 6, Cd 55.0-0.0, (54.0), 0:56.50, (33.40), 20/1, Settled-- 1200-- 800-- Turn--, 1-Falvalea 58.0"]
["6-7 8.8L, Cushio, 2010-01-22, 1600m, Good, Race 2, Hcp, Cls 4, $10000, ($0), J Holder, 7, Cd 54.0-0.0, (54.0), 1:38.76, (36.89), 5/1, Settled-6 1200-- 800-5 Turn-4, 1-Irishkiwi 56.5"]
["7-11 6.0L, D'Ben, 2010-01-13, 1650m, Good, Race 5, Hcp, Cls 4, $13000, ($0), J Wood, 2, Cd 50.0--3.0, (53.0), 1:39.23, (35.33), 12/1, Settled-9 1200-- 800-10 Turn-10, 1-Bretonneux 53.5"]
["6-13 4.0L, D'Ben, 2009-12-26, 1350m, Dead, Race 2, F&m Rst0, RS0MW fm, $45000, ($0), J Holder, 5, Cd 53.0-0.0, (53.0), 1:19.84, (35.23), 25/1, Settled-10 1200-- 800-- Turn-11, 1-Alberton Park 53.0"]
["1-12 0.4L, Cushio, 2009-12-11, 1400m, Good, Race 9, Hcp, Cls 2, $10000, ($6500), S Katsidis, 9, Cd 54.0-0.0, (54.0), 1:25.80, (37.38), 2/1E, Settled-8 1200-- 800-- Turn-8, 2-Qwerty 54.0"]
["8 Dandy Kat (6) 54.0kg 6yo b g",null,null,"Trainer: R Vale at Rockhampton",null,null,"Jockey: J P Stanley"]
["Colours: Blue, gold horseshoe, gold armbands and blue and gold qtrd cap",null,null,"Breeding: Tabkir (USA) - Racing Queen (USA) by Alysheba"]
["Owners: A P Pianta & C R Green"]
["Career:","Earnings:","Win: 11.8%","API:","First Up:","Second Up:","Distance:","Track:"]
[40306.419444444444,43660,"Place: 47.1%","1900-01-01T07:12:00","2010-01-01T05:00:00","5:0-1-0","2010-01-02T04:01:00","2010-01-02T17:02:00"]
["Fast:","Good:","Dead:","Slow:","Heavy:"]
["0:0-0-0",40276.252083333333,"3:1-0-1","1:0-0-0","0:0-0-0"]
["7-8 9.9L, Twbc, 2010-11-06, 1850m, Good, Race 5, Plate, Cls 3, $12000, ($0), P Wolfgram, 5, Cd 58.5-0.0, (SW), 1:56.75, (37.93), 7/2, Settled-5 1200-- 800-5 Turn-7, 1-Sunday Advice 55.5"]
["5-7 6.4L, Rocky, 2010-10-21, 1500m, Good, Race 3, Open, Open, $10000, ($0), A Coome, 7, Cd 54.0-0.0, (54.0), 1:29.91, (34.58), 5/1, Settled-- 1200-- 800-- Turn--, 1-Tantat Secret 60.0"]
["4-10 3.0L, Rocky, 2010-10-14, 1821m, Good, Race 4, Hcp, Cls 3, $12000, ($600), A Coome, 10, Cd 57.0-0.0, (54.0), 1:50.68, (35.19), 4/1, Settled-- 1200-- 800-- Turn--, 1-Ewey Bay 52.5"]
["11-15 7.7L, Rocky, 2010-10-07, 1200m, Good, Race 7, Hcp, Cls 3, $10000, ($0), C McIver, 4, Cd 56.0-0.0, (54.0), 1:10.26, (34.68), 25/1, Settled-- 1200-- 800-- Turn--, 1-Basheeba 56.0"]
["6-7 8.7L, Mackay, 2010-09-18, 1250m, Good, Race 2, Plate, Cls 3, $7500, ($0), D Whitmore, 2, Cd 58.5-0.0, (SW), 1:13.30, (), 5/1, Settled-- 1200-- 800-- Turn--, 1-Springbok Lad 58.5"]
["9-10 6.3L, Rocky, 2010-06-01, 1828m, Good, Race 6, Hcp, Cls 3, $12000, ($0), A Coome, 3, Cd 58.0-0.0, (54.0), 1:50.41, (35.43), 5/1, Settled-- 1200-- 800-- Turn--, 1-A Boy Called Sue 57.0"]
["2-8 0.2L, Rocky, 2010-05-06, 1823m, Good, Race 3, Hcp, Cls 3, $10000, ($2000), Dale Missen, 5, Cd 57.5-0.0, (54.0), 1:51.02, (35.41), 4/1, Settled-- 1200-- 800-- Turn--, 1-Sir Echo 55.0"]
["9-13 8.7L, Rocky, 2010-04-28, 1500m, Good, Race 7, Hcp, Cls 4, $10000, ($0), B Hull, 10, Cd 54.5-0.0, (54.0), 1:28.69, (35.45), 8/1, Settled-- 1200-- 800-- Turn--, 1-Tomkins 52.0"]
["2-9 1.5L, Rocky, 2010-04-09, 2203m, Good, Race 5, Plate, Cls 3, $15000, ($3000), A Coome, 2, Cd 58.5-0.0, (SW), 2:14.98, (), 9/2, Settled-- 1200-- 800-- Turn--, 1-Craiglea Bella 55.0"]
["5-8 3.1L, Rocky, 2010-03-25, 2200m, Dead, Race 2, Hcp, Cls 3, $10000, ($0), A Coome, 2, Cd 57.5-0.0, (54.0), 2:24.47, (), 9/4F, Settled-- 1200-- 800-- Turn--, 1-Gremmo 56.5"]
["9 Fu Min Bu (9) 54.0kg 5yo b/br m",null,null,"Trainer: R Sullivan at Charleville",null,null,"Jockey: R Bell"]
["Colours: Red with purple sash, purple armbands and white cap",null,null,"Breeding: Fubu - Theaminda by Marwina"]
["Owners: Mrs G J Sullivan & B Sullivan"]
["Career:","Earnings:","Win: 5.4%","API:","First Up:","Second Up:","Distance:","Track:"]
[40241.543055555558,19300,"Place: 21.6%",0.5,"5:1-0-0","5:0-1-0","4:0-0-1","0:0-0-0"]
["Fast:","Good:","Dead:","Slow:","Heavy:"]
["0:0-0-0",40212.001388888886,"7:0-0-1","4:0-1-0","2:0-0-0"]
["6-8 4.0L, Corowa, 2010-11-02, 1000m, Dead, Race 5, , BM45, $4000, ($0), A Beer, 4, Cd 53.5--2.0, (54.0), 0:57.88, (), 4/1, Settled-- 1200-- 800-- Turn--, 1-Teshi Tallarah 55.5"]
["6-7 4.8L, Wagga, 2010-10-02, 1200m, Dead, Race 4, F&m, BM45 fm, $4000, ($0), A Bloomfield, 3, Cd 58.0-0.0, (54.0), 1:11.44, (), 5/2E, Settled-- 1200-- 800-- Turn--, 1-Rustie Bugles 59.5"]
["3-12 1.8L, Grenfl, 2010-09-25, 1200m, Good, Race 4, , BM45, $3500, ($300), A Bloomfield, 10, Cd 56.0-0.0, (54.0), 1:13.44, (), 9/1, Settled-- 1200-- 800-- Turn--, 1-Cleary's Creek 57.5"]
["8-11 7.0L, G'burn, 2010-09-07, 1300m, Dead, Race 7, , BM50, $10000, ($0), R Bensley, 4, Cd 54.0-0.0, (54.0), 1:18.55, (37.39), 20/1, Settled-8 1200-- 800-- Turn-7, 1-Monzero 59.0"]
["5-12 1.1L, Narran, 2010-08-28, 1400m, Dead, Race 7, F&m, BM50 fm, $9000, ($0), A Bloomfield, 3, Cd 56.0-0.0, (54.0), 1:25.77, (37.40), 7/1, Settled-- 1200-- 800-- Turn--, 1-Covers 59.5"]
["3-12 2.4L, Narran, 2010-08-21, 1200m, Dead, Race 3, , BM45, $4000, ($400), W Pearson, 8, Cd 56.5-0.0, (54.0), 1:12.68, (37.93), 5/1, Settled-- 1200-- 800-- Turn--, 1-Awesome Feeling 58.5"]
["5-8 4.2L, Leeton, 2010-08-08, 1000m, Dead, Race 7, , BM55, $9000, ($0), J Kissick, 5, Cd 50.0--4.0, (54.0), 0:59.40, (35.26), 8/1, Settled-- 1200-- 800-- Turn--, 1-Prime Cognac 59.5"]
["4-10 3.0L, Wagga, 2010-07-27, 1000m, Slow, Race 7, , BM50, $9000, ($0), S G Walsh, 8, Cd 55.0-0.0, (54.0), 0:58.91, (), 20/1, Settled-- 1200-- 800-- Turn--, 1-Look At The Rose 58.0"]
["11-12 9.1L, Acton, 2010-07-11, 1080m, Good, Race 6, Hcp, Cls 2, $11000, ($0), A Bloomfield, 12, Cd 54.0-0.0, (54.0), 1:02.68, (34.61), 25/1, Settled-11 1200-- 800-- Turn-12, 1-Plutonic 55.0"]
["8-10 3.6L, Tumut, 2010-03-13, 1200m, Good, Race 3, Hcp, BM45, $5100, ($0), T Jeffries, 1, Cd 56.5--2.0, (54.0), 1:12.04, (), 13/4, Settled-- 1200-- 800-- Turn--, 1-Thatsmyemgee 56.0"]

{"sheet":"Race","index":6,"n_rows":35,"n_cols":14,"rows_kept":35,"cut":false,"hidden":false,"merged":[]}
[]
["ROCKHAMPTON",null,"QR 5","PAYING"]
[]
["2010-12-02","CLASS 4 HANDICAP",null,null,"Fixed Price"]
["RADIO TAB","*1-4-3-2",null,null,"Late Mail 1","1300M","OVERCAST","DEAD(5)"]
[]
[{"$nulls":6},"SCR 5"]
[3,null,"NOBLE LUSTRE",6.1,1.7]
[7,null,"ZENACITY",null,2.9,null,"Sub Fav 6"]
[1,null,"DACK'S FAZ",null,1.4]
[]
["QN","3* 7",67.2,null,null,null,"TF","3* 7* 1",553.79999999999995]
["EX","3* 7",139.4,null,null,null,"A2","3* 7",16.5]
["F4","3* 7* 1* 6",2043.4,{"$nulls":4},"1* 3",3.2]
[{"$nulls":7},"1* 7",12.8]
["No.",null,"Name","04:03:00","Win","Plc",null,"Rider  ","Bar","Wght",null,"Form","L3S","Rtng"]
[1,null,"DACK'S FAZ",2.9,3.1,1.4,null,"ALISHA TAYLOR(A)",8,58,null,"WT",823,99]
[2,null,"IGOTITFROMMYMUMMA",8,9.4,2.1,null,"A COOME",3,55.5,null,"T",137,99]
[3,null,"NOBLE LUSTRE",8.6,6.1,1.7,null,"J KROPP(A)",5,55.5,null,"WT",918,100]
[4,null,"CHABAL",8,9.3000000000000007,2.7,null,"D SIMMONS",4,55,null,"D","4X6",98]
[5,null,"CRAIGLEA TINA",{"$nulls":4},"SCRATCHED",2]
[6,null,"LOLA BRIGIDA",4.5,3,1.6,null,"T BANNON",7,54,null,"DWT",161,96]
[7,null,"ZENACITY",10.1,15,2.9,null,"C WHITELEY",1,54,null,null,"X30",92]
[8,null,"DANDY KAT",9.6999999999999993,17.899999999999999,3.3,null,"J P STANLEY",6,54,null,"TC",457,94]
[9,null,"FU MIN BU",23.9,42.8,5.8,null,"J STEPHENS",9,54,null,null,366,96]
[]
["UNiTAB Pool Totals"]
["WN",33061,"QN",2730,"TF",12157,"DD(5,6) $5309"]
["PL",9339,"EX",1485,"F4",2162,"TT(4,5,6) "]
[null,null,"A2",506,null,null,"QD(3,4,5,6) "]
[]
["<< QR  1  2  3  4  5  6  DD/TT/QD  XD Riders  Fixed Price >>"]
[]
["Help","Gambling Advice","TAB Home","Refresh"]
["© Copyright UNiTAB Ltd","Created: Thu, 02 Dec 2010 16:12:13 Aust EST"]

{"sheet":"Tables","index":7,"n_rows":95,"n_cols":44,"rows_kept":95,"cut":false,"hidden":false,"merged":[]}
[{"$nulls":20},"Track",{"$f":"Data!N2","v":"DEAD"},{"$f":"IF(V1=\"SLOW\",1,IF(V1=\"HEAVY\",1,0))","v":0}]
[]
["Exclude",null,"Exclude",null,"Exclude",null,"Exclude",null,"Exclude",null,"Exclude",null,"Exclude",null,"Exclude",null,"Exclude",null,"Exclude",null,"Exclude",null,"Exclude",null,"Exclude",null,"Exclude",null,"Exclude",null,"Exclude",null,"Exclude",null,"Exclude",null,"Exclude",null,"Exclude",null,"Exclude",null,"Exclude"]
["Tab Number",null,"Barrier",null,"Weight",null,"L/S Weight Change",null,"API",null,"Win%",null,"Place%",null,"Distance",null,"Track",null,"Course",null,"Wet",null,"Days L/S",null,"Days 2nd L/S",null,"Days 3rd L/S",null,"Class",null,"LS FP",null,"L/S Margin",null,"2nd LS FP",null,"2nd L/S Margin",null,"3rd LS FP",null,"3rd L/S Margin",null,"Qld Tab Rating"]
[{"$f":"IF(B$3<>\"\",\"\",1)","v":1},5,{"$f":"IF(D$3<>\"\",\"\",1)","v":1},5,{"$f":"IF(F$3<>\"\",\"\",70)","v":70},0,{"$f":"IF(H$3<>\"\",\"\",0+12)","v":12},0,{"$f":"IF(J$3<>\"\",\"\",1)","v":1},8,{"$f":"IF(L$3<>\"\",\"\",1)","v":1},8,{"$f":"IF(N$3<>\"\",\"\",1)","v":1},8,{"$f":"IF(P$3<>\"\",\"\",\"Y\")","v":"Y"},5,{"$f":"IF(R$3<>\"\",\"\",\"Y\")","v":"Y"},5,{"$f":"IF(T$3<>\"\",\"\",\"Y\")","v":"Y"},8,{"$f":"IF(W1=0,\"\",IF(V$3<>\"\",\"\",\"Y\"))","v":""},8,{"$f":"IF(X$3<>\"\",\"\",1)","v":1},3,{"$f":"IF(Z$3<>\"\",\"\",1)","v":1},3,{"$f":"IF(AB$3<>\"\",\"\",1)","v":1},3,{"$f":"IF(AD$3<>\"\",\"\",1)","v":1},-5,{"$f":"IF(AF$3<>\"\",\"\",1)","v":1},7,{"$f":"IF(AH$3<>\"\",\"\",0.5)","v":0.5},7,{"$f":"IF(AJ$3<>\"\",\"\",1)","v":1},7,{"$f":"IF(AL$3<>\"\",\"\",0.5)","v":0.5},7,{"$f":"IF(AN$3<>\"\",\"\",1)","v":1},7,{"$f":"IF(AP$3<>\"\",\"\",0.5)","v":0.5},7,{"$f":"IF(AR$3<>\"\",\"\",100)","v":100},7]
[{"$f":"IF(B$3<>\"\",\"\",A5+1)","v":2},5,{"$f":"IF(D$3<>\"\",\"\",C5+1)","v":2},5,{"$f":"IF(F$3<>\"\",\"\",E5-0.5)","v":69.5},0,{"$f":"IF(H$3<>\"\",\"\",0+G5-0.5)","v":11.5},0,{"$f":"IF(J$3<>\"\",\"\",I5+1)","v":2},6,{"$f":"IF(L$3<>\"\",\"\",K5+1)","v":2},6,{"$f":"IF(N$3<>\"\",\"\",M5+1)","v":2},6,{"$f":"IF(P$3<>\"\",\"\",\"N\")","v":"N"},0,{"$f":"IF(R$3<>\"\",\"\",\"N\")","v":"N"},0,{"$f":"IF(T$3<>\"\",\"\",\"N\")","v":"N"},0,{"$f":"IF(W1=0,\"\",IF(V$3<>\"\",\"\",\"Y\"))","v":""},0,{"$f":"IF(X$3<>\"\",\"\",W5+1)","v":2},3,{"$f":"IF(Z$3<>\"\",\"\",Y5+1)","v":2},3,{"$f":"IF(AB$3<>\"\",\"\",AA5+1)","v":2},3,{"$f":"IF(AD$3<>\"\",\"\",2)","v":2},10,{"$f":"IF(AF$3<>\"\",\"\",AE5+1)","v":2},5,{"$f":"IF(AH$3<>\"\",\"\",AG5+0.5)","v":1},7,{"$f":"IF(AJ$3<>\"\",\"\",AI5+1)","v":2},5,{"$f":"IF(AL$3<>\"\",\"\",AK5+0.5)","v":1},7,{"$f":"IF(AN$3<>\"\",\"\",AM5+1)","v":2},5,{"$f":"IF(AP$3<>\"\",\"\",AO5+0.5)","v":1},7,{"$f":"IF(AR$3<>\"\",\"\",AQ5-1)","v":99},5]
[{"$f":"IF(B$3<>\"\",\"\",A6+1)","v":3},5,{"$f":"IF(D$3<>\"\",\"\",C6+1)","v":3},5,{"$f":"IF(F$3<>\"\",\"\",E6-0.5)","v":69},0,{"$f":"IF(H$3<>\"\",\"\",0+G6-0.5)","v":11},0,{"$f":"IF(J$3<>\"\",\"\",I6+1)","v":3},4,{"$f":"IF(L$3<>\"\",\"\",K6+1)","v":3},4,{"$f":"IF(N$3<>\"\",\"\",M6+1)","v":3},4,{"$nulls":8},{"$f":"IF(X$3<>\"\",\"\",W6+1)","v":3},3,{"$f":"IF(Z$3<>\"\",\"\",Y6+1)","v":3},3,{"$f":"IF(AB$3<>\"\",\"\",AA6+1)","v":3},3,{"$f":"IF(AD$3<>\"\",\"\",3)","v":3},0,{"$f":"IF(AF$3<>\"\",\"\",AE6+1)","v":3},3,{"$f":"IF(AH$3<>\"\",\"\",AG6+0.5)","v":1.5},5,3,3,{"$f":"IF(AL$3<>\"\",\"\",AK6+0.5)","v":1.5},5,3,3,{"$f":"IF(AP$3<>\"\",\"\",AO6+0.5)","v":1.5},5,{"$f":"IF(AR$3<>\"\",\"\",AQ6-1)","v":98},3]
[4,3,4,3,68.5,0,10.5,0,4,3,4,3,4,3,{"$nulls":8},4,3,4,3,4,3,null,null,4,2,{"$f":"IF(AH$3<>\"\",\"\",AG7+0.5)","v":2},5,4,2,2,5,4,2,2,5,97,3]
[5,3,5,3,68,0,10,0,5,3,5,3,5,3,{"$nulls":8},5,5,5,3,5,3,null,null,5,2,2.5,5,5,2,2.5,5,5,2,2.5,5,96,3]
[6,3,6,3,67.5,0,9.5,0,6,2,6,2,6,2,{"$nulls":8},6,5,6,3,6,3,null,null,6,0,3,3,6,0,3,3,6,0,3,3,95,2]
[7,2,7,2,67,0,9,0,7,2,7,2,7,2,{"$nulls":8},7,5,7,3,7,3,null,null,7,0,3.5,2,7,0,3.5,2,7,0,3.5,2,94,2]
[8,2,8,2,66.5,0,8.5,0,8,2,8,2,8,2,{"$nulls":8},8,5,8,3,8,3,null,null,8,0,4,2,8,0,4,2,8,0,4,2,93,0]
[9,2,9,2,66,0,8,0,9,2,9,2,9,2,{"$nulls":8},9,5,9,3,9,3,null,null,9,0,4.5,2,9,0,4.5,2,9,0,4.5,2,92,0]
[10,1,10,1,65.5,0,7.5,0,10,2,10,2,10,2,{"$nulls":8},10,5,10,3,10,3,null,null,10,0,5,2,10,0,5,2,10,0,5,2,91,0]
[11,1,11,1,65,0,7,2,11,2,11,2,11,2,{"$nulls":8},11,3,11,3,11,3,null,null,{"$f":"IF(AF$3<>\"\",\"\",0)","v":0},0,5.5,0,{"$f":"IF(AJ$3<>\"\",\"\",0)","v":0},0,5.5,0,{"$f":"IF(AN$3<>\"\",\"\",0)","v":0},0,5.5,0,90,0]
[12,1,12,1,64.5,0,6.5,2,12,0,12,0,12,0,{"$nulls":8},12,3,12,5,12,3,{"$nulls":4},6,0,null,null,6,0,null,null,6,0,89,0]
[13,0,13,0,64,0,6,2,13,0,13,0,13,0,{"$nulls":8},13,3,13,5,13,3,{"$nulls":4},6.5,0,null,null,6.5,0,null,null,6.5,0,88,0]
[14,0,14,0,63.5,0,5.5,2,14,0,14,0,14,0,{"$nulls":8},14,3,14,5,14,3,{"$nulls":4},7,0,null,null,7,0,null,null,7,0,87,0]
[15,0,15,0,63,0,5,5,15,0,15,0,15,0,{"$nulls":8},15,2,15,5,15,3,{"$nulls":4},7.5,0,null,null,7.5,0,null,null,7.5,0,86,0]
[16,0,16,0,62.5,0,4.5,5,16,0,16,0,16,0,{"$nulls":8},16,2,16,5,16,3,{"$nulls":4},8,0,null,null,8,0,null,null,8,0,85,0]
[17,0,17,0,62,0,4,5,17,0,17,0,17,0,{"$nulls":8},17,2,17,5,17,3,{"$nulls":4},8.5,0,null,null,8.5,0,null,null,8.5,0,{"$f":"IF(AR$3<>\"\",\"\",0)","v":0},0]
[18,0,18,0,61.5,0,3.5,5,18,0,18,0,18,0,{"$nulls":8},18,2,18,3,18,3,{"$nulls":4},9,0,null,null,9,0,null,null,9,0]
[19,0,19,0,61,1,3,5,19,0,19,0,19,0,{"$nulls":8},19,2,19,3,19,5,{"$nulls":4},9.5,0,null,null,9.5,0,null,null,9.5,0]
[20,0,20,0,60.5,1,2.5,5,20,0,20,0,20,0,{"$nulls":8},20,2,20,3,20,5,{"$nulls":4},10,0,null,null,10,0,null,null,10,0]
[21,0,21,0,60,1,2,3,21,0,21,0,21,0,{"$nulls":8},21,2,21,3,21,5,{"$nulls":4},{"$f":"IF(AH$3<>\"\",\"\",0)","v":0},7,null,null,{"$f":"IF(AL$3<>\"\",\"\",0)","v":0},7,null,null,{"$f":"IF(AP$3<>\"\",\"\",0)","v":0},7]
[22,0,22,0,59.5,2,1.5,3,22,0,22,0,22,0,{"$nulls":8},22,0,22,2,22,5]
[23,0,23,0,59,2,1,3,23,0,23,0,null,0,{"$nulls":8},23,0,23,2,23,5]
[24,0,24,0,58.5,3,0.5,3,24,0,24,0,{"$f":"IF(N$3<>\"\",\"\",Data!BT25)","v":""},0,{"$nulls":8},24,0,24,2,24,5]
[null,null,{"$f":"IF(D$3<>\"\",\"\",0)","v":0},0,58,3,0,3,{"$nulls":14},25,0,25,2,25,3]
[{"$nulls":4},57.5,3,-0.5,3,{"$nulls":14},26,0,26,2,26,3]
[{"$nulls":4},57,5,-1,3,{"$nulls":14},27,0,27,2,27,3]
[{"$nulls":4},56.5,5,-1.5,3,{"$nulls":14},28,0,28,2,28,3]
[{"$nulls":4},56,5,-2,3,{"$nulls":14},29,0,29,0,29,2]
[{"$nulls":4},55.5,3,-2.5,5,{"$nulls":14},30,0,30,0,30,2]
[{"$nulls":4},55,3,-3,5,{"$nulls":14},31,0,31,0,31,2]
[{"$nulls":4},54.5,3,-3.5,5,null,null,null,{"$f":"IF(K36=\"\",\"\",K36/2.5)","v":""},{"$nulls":10},32,0,32,0,32,2]
[{"$nulls":4},54,2,-4,5,null,null,null,{"$f":"IF(K37=\"\",\"\",K37/10)","v":""},{"$nulls":10},33,0,33,0,33,2]
[{"$nulls":4},53.5,2,-4.5,5,null,null,null,"",{"$nulls":10},34,0,34,0,34,2]
[{"$nulls":4},53,1,-5,5,null,null,null,"",{"$nulls":10},35,0,35,0,35,2]
[{"$nulls":4},52.5,1,-5.5,2,null,null,null,"",{"$nulls":10},36,0,36,0,36,2]
[{"$nulls":4},52,1,-6,2,null,null,null,"",{"$nulls":10},37,0,37,0,37,0]
[{"$nulls":4},51.5,0,-6.5,2,null,null,null,"",{"$nulls":10},38,0,38,0,38,0]
[{"$nulls":4},51,0,-7,2,null,null,null,"",{"$nulls":10},39,0,39,0,39,0]
[{"$nulls":4},50.5,0,-7.5,0,null,null,null,"",{"$nulls":10},40,0,40,0,40,0]
[{"$nulls":4},50,0,-8,0,null,null,null,"",{"$nulls":10},41,0,41,0,41,0]
[{"$nulls":4},49.5,0,-8.5,0,null,null,null,"",{"$nulls":10},42,0,42,0,42,0]
[{"$nulls":4},49,0,-9,0,null,null,null,"",{"$nulls":10},43,0,43,0,43,0]
[{"$nulls":4},48.5,0,-9.5,0,null,null,null,"",{"$nulls":10},44,0,44,0,44,0]
[{"$nulls":4},48,0,-10,0,null,null,null,"",{"$nulls":10},45,0,45,0,45,0]
[{"$nulls":4},47.5,0,-10.5,0,null,null,null,"",{"$nulls":10},46,0,46,0,46,0]
[{"$nulls":4},47,0,-11,0,null,null,null,"",{"$nulls":10},47,0,47,0,47,0]
[{"$nulls":4},46.5,0,-11.5,0,null,null,null,"",{"$nulls":10},48,0,48,0,48,0]
[{"$nulls":4},46,0,-12,0,null,null,null,"",{"$nulls":10},49,0,49,0,49,0]
[{"$nulls":4},45.5,0,{"$nulls":5},"",{"$nulls":10},50,0,50,0,50,0]
[{"$nulls":4},45,0,{"$nulls":5},"",{"$nulls":10},51,0,51,0,51,0]
[{"$nulls":22},52,0,52,0,52,0]
[{"$nulls":22},53,0,53,0,53,0]
[{"$nulls":22},54,0,54,0,54,0]
[{"$nulls":22},55,0,55,0,55,0]
[{"$nulls":22},56,0,56,0,56,0]
[{"$nulls":22},57,0,57,0,57,0]
[{"$nulls":22},58,0,58,0,58,0]
[{"$nulls":22},59,0,59,0,59,0]
[{"$nulls":22},60,0,60,0,60,0]
[{"$nulls":22},61,0,61,0,61,0]
[{"$nulls":22},62,0,62,0,62,0]
[{"$nulls":22},63,0,63,0,63,0]
[{"$nulls":22},64,0,64,0,64,0]
[{"$nulls":22},65,0,65,0,65,0]
[{"$nulls":22},66,0,66,0,66,0]
[{"$nulls":22},{"$f":"IF(X$3<>\"\",\"\",W70+1)","v":67},0,{"$f":"IF(Z$3<>\"\",\"\",Y70+1)","v":67},0,{"$f":"IF(AB$3<>\"\",\"\",AA70+1)","v":67},0]
[{"$nulls":22},68,0,68,0,68,0]
[{"$nulls":22},69,0,69,0,69,0]
[{"$nulls":22},70,0,70,0,70,0]
[{"$nulls":22},71,0,71,0,71,0]
[{"$nulls":22},72,0,72,0,72,0]
[{"$nulls":22},73,0,73,0,73,0]
[{"$nulls":22},74,0,74,0,74,0]
[{"$nulls":22},75,0,75,0,75,0]
[{"$nulls":22},76,0,76,0,76,0]
[{"$nulls":22},77,0,77,0,77,0]
[{"$nulls":22},78,0,78,0,78,0]
[{"$nulls":22},79,0,79,0,79,0]
[{"$nulls":22},80,0,80,0,80,0]
[{"$nulls":22},81,0,81,0,81,0]
[{"$nulls":22},82,0,82,0,82,0]
[{"$nulls":22},83,0,83,0,83,0]
[{"$nulls":22},84,0,84,0,84,0]
[{"$nulls":22},85,0,85,0,85,0]
[{"$nulls":22},86,0,86,0,86,0]
[{"$nulls":22},87,0,87,0,87,0]
[{"$nulls":22},88,0,88,0,88,0]
[{"$nulls":22},89,0,89,0,89,0]
[{"$nulls":22},90,0,90,0,90,0]
[{"$nulls":22},0,0,0,0,0,0]

{"sheet":"Data","index":8,"n_rows":1162,"n_cols":141,"rows_kept":1162,"cut":false,"hidden":false,"merged":[[7,52,7,53],[8,52,8,53],[9,52,9,53],[1,52,1,53],[2,52,2,53],[3,52,3,53],[4,52,4,53],[5,52,5,53],[6,52,6,53],[10,52,10,53],[11,52,11,53],[12,52,12,53],[24,52,24,53],[13,52,13,53],[14,52,14,53],[15,52,15,53],[16,52,16,53],[17,52,17,53],[18,52,18,53],[19,52,19,53],[20,52,20,53],[21,52,21,53],[22,52,22,53],[23,52,23,53]]}
[{"$f":"A2","v":"http://formguide.cyberhorse.com.au/index.php/Form/form.html?formdate=2010-12-02&track=Rocky&raceno=5"},{"$nulls":10},"END",{"$f":"IF(Form!A1=\"\",\"\",LEFT(Form!A1,FIND(\"/\",Form!A1)-3))","v":"Form - Rockhampton "},{"$f":"IF(M1=\"\",\"\",TRIM(MID(M1,7,20)))","v":"Rockhampton"},{"$nulls":11},{"$f":"IF(AA1=\"\",\"\",IF(ISERROR(MID(AA1,FIND(\" \",AA1,1)+1,FIND(\"(\",AA1,1)-FIND(\" \",AA1,1)-2)),\"\",MID(AA1,FIND(\" \",AA1,1)+1,FIND(\"(\",AA1,1)-FIND(\" \",AA1,1)-2)))","v":""},"Form - Rockhampton 02/12/10",{"$nulls":20},"Select Date",{"$f":"IF(ISNUMBER(AV1),\"\",IF(AV1=\"Select Date\",\"\",AV1))","v":""},{"$f":"IF(Race!N1<>\"\",Race!C1,\"\")","v":""},{"$f":"IF(AX1<>\"\",Race!N1,\"\")","v":""},{"$f":"IF(AX1<>\"\",Race!I1,\"\")","v":""},"Name",null,"Tab No","Tab No","Barrier","Barrier","Weight","Weight",null,null,null,"LS/Weight","LS/Weight","API",null,"API","Win%",null,"Win%","Place%",null,"Place%",null,"D","Distance","Distance","T","Track","Track","C","Course","Course","w","Wet","Wet",null,"Days LS",null,"Days LS",null,"Days 2ndLS",null,"Days 2ndLS",null,"Days 3rdLS",null,"Days 3rdLS","Class",null,null,"Class",null,null,"LS FP","LS FP",{"$nulls":4},"LS Mrg","LS Mrg",null,null,"2nd LS FP","2nd LS FP",{"$nulls":4},"2nd LS Mrg","2nd LS Mrg",null,null,"3rd LS FP","3rd LS FP",{"$nulls":4},"3rd Las Mrg","3rd Las Mrg",null,"Qld Rtg",null,"Qld Rtg","Final Rating",null,null,{"$f":"MAX(EH2:EH25)","v":81}]
["http://formguide.cyberhorse.com.au/index.php/Form/form.html?formdate=2010-12-02&track=Rocky&raceno=5",{"$nulls":11},"2010-12-02",{"$f":"IF(Race!H5=\"\",\"\",LEFT(Race!H5,FIND(\"(\",Race!H5)-1))","v":"DEAD"},{"$f":"IF(Form!A2=\"\",\"\",TRIM(MID(Form!A2,5,2)))","v":"5"},{"$f":"IF(ISNA(VLOOKUP(N1,M3:Y20,$O$2+2,FALSE)),\"\",VLOOKUP(N1,M3:Y20,$O$2+2,FALSE))","v":"http://www.tabonline.com.au/2010/12/02/QR05.html"},{"$nulls":9},{"$f":"IF(AA2=\"\",\"\",IF(ISERROR(MID(AA2,FIND(\" \",AA2,1)+1,FIND(\"(\",AA2,1)-FIND(\" \",AA2,1)-2)),\"\",MID(AA2,FIND(\" \",AA2,1)+1,FIND(\"(\",AA2,1)-FIND(\" \",AA2,1)-2)))","v":""},"Race 5",{"$nulls":20},"Rockhampton",{"$f":"IF(ISNUMBER(AV2),\"\",IF(AV2=\"Select Date\",\"\",AV2))","v":"Rockhampton"},{"$f":"IF(Race!N2<>\"\",Race!C2,\"\")","v":""},{"$f":"IF(AX2<>\"\",Race!N2,\"\")","v":""},{"$f":"IF(AX2<>\"\",Race!I2,\"\")","v":""},{"$f":"IF(Form!I5<>\"\",LEFT(Form!C5,FIND(\"(\",Form!C5)-2),\"\")","v":"Dack's Faz"},null,{"$f":"IF(BA2=\"\",\"\",Form!A5)","v":1},{"$f":"IF($BA2=\"\",\"\",IF(ISNA(VLOOKUP(BC2,Tables!A$5:B$100,2,FALSE)),\"0\",VLOOKUP(BC2,Tables!A$5:B$100,2,FALSE)))","v":5},{"$f":"IF($BA2=\"\",\"\",IF(ISNA(VLOOKUP(BA2,AX1:AZ100,3,FALSE)),\"\",VLOOKUP(BA2,AX1:AZ100,3,FALSE)))","v":8},{"$f":"IF($BE2=\"\",\"0\",IF(ISNA(VLOOKUP(BE2,Tables!C$5:D$100,2,FALSE)),\"0\",VLOOKUP(BE2,Tables!C$5:D$100,2,FALSE)))","v":2},{"$f":"IF(BA2=\"\",\"\",Form!F5)","v":58},{"$f":"IF($BA2=\"\",\"\",IF(ISNA(VLOOKUP(BG2,Tables!E$5:F$100,2,FALSE)),\"0\",VLOOKUP(BG2,Tables!E$5:F$100,2,FALSE)))","v":3},{"$f":"IF($BA2=\"\",\"\",INDEX($AA$1:$AT$499,MATCH($BA2,$Z$1:$Z$499,0)+7,13))","v":" Cd 57.5-0.0"},{"$f":"IF($BA2=\"\",\"\",LEFT(BI2,FIND(\"-\",BI2)-1))","v":" Cd 57.5"},{"$f":"IF(BG2=\"\",\"\",BG2-BL2)","v":0.5},{"$f":"IF($BA2=\"\",\"\",TRIM(MID(BJ2,4,5)))","v":"57.5"},{"$f":"IF($BA2=\"\",\"\",IF(ISERROR(BL2),0,IF(ISNA(VLOOKUP(BK2,Tables!G$5:H$100,2,FALSE)),\"0\",VLOOKUP(BK2,Tables!G5:H$100,2,FALSE))))","v":3},{"$f":"IF($BA2=\"\",\"\",Form!G5)","v":2.4},{"$f":"IF(BN2=\"\",\"\",IF(RANK(BN2,$BN$2:$BN$32)<25,RANK(BN2,$BN$2:$BN$32),\"\"))","v":1},{"$f":"IF($BA2=\"\",\"\",IF(ISNA(VLOOKUP(BO2,Tables!I$5:J$100,2,FALSE)),\"0\",VLOOKUP(BO2,Tables!I$5:J$100,2,FALSE)))","v":8},{"$f":"IF($BA2=\"\",\"\",Form!H5)","v":28.6},{"$f":"IF(BA2=\"\",\"\",IF(RANK(BQ2,$BQ$2:$BQ$32)<25,RANK(BQ2,$BQ$2:$BQ$32),\"\"))","v":1},{"$f":"IF($BA2=\"\",\"\",IF(ISNA(VLOOKUP(BR2,Tables!K$5:L$100,2,FALSE)),\"0\",VLOOKUP(BR2,Tables!K$5:L$100,2,FALSE)))","v":8},{"$f":"IF($BA2=\"\",\"\",Form!I5)","v":64.3},{"$f":"IF(BA2=\"\",\"\",IF(RANK(BT2,$BT$2:$BT$32)<25,RANK(BT2,$BT$2:$BT$32),\"\"))","v":1},{"$f":"IF($BA2=\"\",\"\",IF(ISNA(VLOOKUP(BU2,Tables!M$5:N$100,2,FALSE)),\"0\",VLOOKUP(BU2,Tables!M$5:N$100,2,FALSE)))","v":8},{"$f":"IF($BA2=\"\",\"\",INDEX(Race!$D$1:$P$100,MATCH($BA2,Race!$C$1:$C$100,0)+0,9))","v":0},{"$f":"IF($BA2=\"\",\"\",IF(ISERROR(FIND(BX$1,$BW2,1)),\"\",BX$1))","v":""},{"$f":"IF(BX2<>\"\",\"Y\",\"N\")","v":"N"},{"$f":"IF($BA2=\"\",\"\",IF(ISNA(VLOOKUP(BY2,Tables!O$5:P$100,2,FALSE)),0,VLOOKUP(BY2,Tables!O$5:P$100,2,FALSE)))","v":0},{"$f":"IF($BA2=\"\",\"\",IF(ISERROR(FIND(CA$1,$BW2,1)),\"\",CA$1))","v":""},{"$f":"IF(CA2<>\"\",\"Y\",\"N\")","v":"N"},{"$f":"IF($BA2=\"\",\"\",IF(ISNA(VLOOKUP(CB2,Tables!Q$5:R$100,2,FALSE)),0,VLOOKUP(CB2,Tables!Q$5:R$100,2,FALSE)))","v":0},{"$f":"IF($BA2=\"\",\"\",IF(ISERROR(FIND(CD$1,$BW2,1)),\"\",CD$1))","v":""},{"$f":"IF(CD2<>\"\",\"Y\",\"N\")","v":"N"},{"$f":"IF($BA2=\"\",\"\",IF(ISNA(VLOOKUP(CE2,Tables!S$5:T$100,2,FALSE)),0,VLOOKUP(CE2,Tables!S$5:T$100,2,FALSE)))","v":0},{"$f":"IF($BA2=\"\",\"\",IF(ISERROR(FIND(CG$1,$BW2,1)),\"\",CG$1))","v":""},{"$f":"IF(CG2<>\"\",\"Y\",\"N\")","v":"N"},{"$f":"IF($BA2=\"\",\"\",IF(ISNA(VLOOKUP(CH2,Tables!U$5:V$100,2,FALSE)),0,VLOOKUP(CH2,Tables!U$5:V$100,2,FALSE)))","v":0},{"$f":"IF($BA2=\"\",\"\",INDEX($AA$1:$AT$499,MATCH($BA2,$Z$1:$Z$499,0)+7,3))","v":"2010-11-20"},{"$f":"IF(CJ2=\"\",\"\",($M$2-CJ2))","v":12},{"$f":"IF(CK2>90,0,CK2)","v":12},{"$f":"IF($BA2=\"\",\"\",IF(ISERROR(CL2),0,IF(ISNA(VLOOKUP(CL2,Tables!W$5:X$100,2,FALSE)),\"0\",VLOOKUP(CL2,Tables!W$5:X$100,2,FALSE))))","v":3},{"$f":"IF($BA2=\"\",\"\",INDEX($AA$1:$AT$499,MATCH($BA2,$Z$1:$Z$499,0)+8,3))","v":"2010-11-06"},{"$f":"IF(CN2=\"\",\"\",$M$2-CN2)","v":26},{"$f":"IF(CO2>90,0,CO2)","v":26},{"$f":"IF($BA2=\"\",\"\",IF(ISERROR(CP2),0,IF(ISNA(VLOOKUP(CP2,Tables!Y$5:Z$100,2,FALSE)),\"0\",VLOOKUP(CP2,Tables!Y$5:Z$100,2,FALSE))))","v":2},{"$f":"IF($BA2=\"\",\"\",INDEX($AA$1:$AT$499,MATCH($BA2,$Z$1:$Z$499,0)+9,3))","v":"2010-10-28"},{"$f":"IF(CR2=\"\",\"\",$M$2-CR2)","v":35},{"$f":"IF(CS2>90,0,CS2)","v":35},{"$f":"IF($BA2=\"\",\"\",IF(ISERROR(CT2),0,IF(ISNA(VLOOKUP(CT2,Tables!AA$5:AB$100,2,FALSE)),\"0\",VLOOKUP(CT2,Tables!AA$5:AB$100,2,FALSE))))","v":2},{"$f":"IF($BA2=\"\",\"\",INDEX($AA$1:$AT$499,MATCH($BA2,$Z$1:$Z$499,0)+7,9))","v":15000},{"$f":"IF(CV2=\"\",\"\",(Form!$H$3-CV2)/CV2*100)","v":-33.333333333333329},{"$f":"IF(CW2=\"\",\"\",IF(CW2>10,1,IF(CW2<-10,2,3)))","v":2},{"$f":"IF($BA2=\"\",\"\",IF(ISERROR(CX2),0,IF(ISNA(VLOOKUP(CX2,Tables!AC$5:AD$100,2,FALSE)),\"0\",VLOOKUP(CX2,Tables!AC$5:AD$100,2,FALSE))))","v":10},{"$f":"IF($BA2=\"\",\"\",INDEX($AA$1:$AT$499,MATCH($BA2,$Z$1:$Z$499,0)+7,1))","v":"3-12 2.0L"},{"$f":"IF($CZ2=\"\",\"\",CLEAN(LEFT(CZ2,FIND(\"-\",CZ2)-1)))","v":"3"},{"$f":"IF($DA2=\"\",\"\",IF(0+DA2>10,0,0+DA2))","v":3},{"$f":"IF($BA2=\"\",\"\",IF(ISERROR(DB2),0,IF(ISNA(VLOOKUP(DB2,Tables!AE$5:AF$100,2,FALSE)),\"0\",VLOOKUP(DB2,Tables!AE$5:AF$100,2,FALSE))))","v":3},{"$f":"IF(CZ2=\"\",\"\",MID(CZ2,FIND(CHAR(22),SUBSTITUTE(CZ2,\" \",CHAR(22),LEN(CZ2)-LEN(SUBSTITUTE(CZ2,\" \",\"\"))))+1,255))","v":"2.0L"},{"$f":"IF($BI2=\"\",\"\",LEFT(DD2,FIND(\"L\",DD2)-1))","v":"2.0"},{"$f":"IF($BI2=\"\",\"\",ROUND(0+DE2/0.5,0)*0.5)","v":2},{"$f":"IF(DF2=\"\",\"\",IF(DB2=1,0,DF2))","v":2},{"$f":"IF(DG2=\"\",\"\",DG2)","v":2},{"$f":"IF($BA2=\"\",\"\",IF(ISERROR(DH2),0,IF(ISNA(VLOOKUP(DG2,Tables!AG$5:AH$100,2,FALSE)),\"0\",VLOOKUP(DG2,Tables!AG$5:AH$100,2,FALSE))))","v":5},{"$f":"IF($BA2=\"\",\"\",INDEX($AA$1:$AT$499,MATCH($BA2,$Z$1:$Z$499,0)+8,1))","v":"2-9 0.1L"},{"$f":"IF($DJ2=\"\",\"\",CLEAN(LEFT(DJ2,FIND(\"-\",DJ2)-1)))","v":"2"},{"$f":"IF($DK2=\"\",\"\",IF(0+DK2>10,0,0+DK2))","v":2},{"$f":"IF($BA2=\"\",\"\",IF(ISERROR(DL2),0,IF(ISNA(VLOOKUP(DL2,Tables!AI$5:AJ$100,2,FALSE)),\"0\",VLOOKUP(DL2,Tables!AI$5:AJ$100,2,FALSE))))","v":5},{"$f":"IF(DJ2=\"\",\"\",MID(DJ2,FIND(CHAR(22),SUBSTITUTE(DJ2,\" \",CHAR(22),LEN(DJ2)-LEN(SUBSTITUTE(DJ2,\" \",\"\"))))+1,255))","v":"0.1L"},{"$f":"IF($BI2=\"\",\"\",LEFT(DN2,FIND(\"L\",DN2)-1))","v":"0.1"},{"$f":"IF($BI2=\"\",\"\",ROUND(0+DO2/0.5,0)*0.5)","v":0},{"$f":"IF(DP2=\"\",\"\",IF(DL2=1,0,DP2))","v":0},{"$f":"IF(DQ2=\"\",\"\",DQ2)","v":0},{"$f":"IF($BA2=\"\",\"\",IF(ISERROR(DR2),0,IF(ISNA(VLOOKUP(DQ2,Tables!AK$5:AL$100,2,FALSE)),\"0\",VLOOKUP(DQ2,Tables!AK$5:AL$100,2,FALSE))))","v":7},{"$f":"IF($BA2=\"\",\"\",INDEX($AA$1:$AT$499,MATCH($BA2,$Z$1:$Z$499,0)+9,1))","v":"8-10 4.7L"},{"$f":"IF($DJ2=\"\",\"\",CLEAN(LEFT(DT2,FIND(\"-\",DT2)-1)))","v":"8"},{"$f":"IF($DU2=\"\",\"\",IF(ISERROR(IF(0+DU2>10,0,0+DU2)),0,IF(0+DU2>10,0,0+DU2)))","v":8},{"$f":"IF($BA2=\"\",\"\",IF(ISERROR(DV2),0,IF(ISNA(VLOOKUP(DV2,Tables!AM$5:AN$100,2,FALSE)),\"0\",VLOOKUP(DV2,Tables!AM$5:AN$100,2,FALSE))))","v":0},{"$f":"IF(DT2=\"\",\"\",MID(DT2,FIND(CHAR(22),SUBSTITUTE(DT2,\" \",CHAR(22),LEN(DT2)-LEN(SUBSTITUTE(DT2,\" \",\"\"))))+1,255))","v":"4.7L"},{"$f":"IF($BI2=\"\",\"\",LEFT(DX2,FIND(\"L\",DX2)-1))","v":"4.7"},{"$f":"IF($BI2=\"\",\"\",ROUND(0+DY2/0.5,0)*0.5)","v":4.5},{"$f":"IF(DZ2=\"\",\"\",IF(DV2=1,0,DZ2))","v":4.5},{"$f":"IF(EA2=\"\",\"\",EA2)","v":4.5},{"$f":"IF($BC2=\"\",\"\",IF(ISERROR(EB2),0,IF(ISNA(VLOOKUP(EA2,Tables!AO$5:AP$100,2,FALSE)),\"0\",VLOOKUP(EA2,Tables!AO$5:AP$100,2,FALSE))))","v":2},{"$f":"IF(BA2=\"\",\"\",IF(ISNA(VLOOKUP(BA2,$AX$1:$AY$100,2,FALSE)),\"\",VLOOKUP(BA2,$AX$1:$AY$100,2,FALSE)))","v":99},{"$f":"IF($BA2=\"\",\"\",CLEAN(TRIM(ED2)))","v":"99"},{"$f":"IF(EE2=\"\",\"\",0+EE2)","v":99},{"$f":"IF($EE2=\"\",\"0\",IF(ISNA(VLOOKUP(EF2,Tables!AQ$5:AR$100,2,FALSE)),\"0\",VLOOKUP(EF2,Tables!AQ$5:AR$100,2,FALSE)))","v":5},{"$f":"IF(BA2=\"\",\"\",IF(MainSheet!D9=\"Scratched\",\"\",BD2+BF2+BH2+BM2+BP2+BS2+BV2+BZ2+CC2+CF2+CI2+CM2+CQ2+CU2+CY2+DC2+DI2+DM2+DS2+DW2+EC2+EG2))","v":81}]
[{"$f":"IF(Meetings1!A3=\"\",\"\",IF(Meetings1!A3=\"END\",\"END\",IF(Meetings1!E3=\"\",\"\",getAddress(Meetings1!E3))))","v":"http://formguide.cyberhorse.com.au/index.php/Form/form.html?formdate=2010-12-02&track=G'long&raceno=1"},{"$nulls":11},{"$f":"IF(ISNA(VLOOKUP(N3,RaceList!$J$3:$L$19,3,FALSE)),\"\",VLOOKUP(N3,RaceList!$J$3:$L$19,3,FALSE))","v":""},{"$f":"IF(Meetings2!$B3=\"\",\"\",Meetings2!$B3)","v":""},{"$f":"IF(Meetings2!D3=\"\",\"\",getAddress(Meetings2!D3))","v":""},{"$f":"IF(Meetings2!E3=\"\",\"\",getAddress(Meetings2!E3))","v":""},{"$f":"IF(Meetings2!F3=\"\",\"\",getAddress(Meetings2!F3))","v":""},{"$f":"IF(Meetings2!G3=\"\",\"\",getAddress(Meetings2!G3))","v":""},{"$f":"IF(Meetings2!H3=\"\",\"\",getAddress(Meetings2!H3))","v":""},{"$f":"IF(Meetings2!I3=\"\",\"\",getAddress(Meetings2!I3))","v":""},{"$f":"IF(Meetings2!J3=\"\",\"\",getAddress(Meetings2!J3))","v":""},{"$f":"IF(Meetings2!K3=\"\",\"\",getAddress(Meetings2!K3))","v":""},{"$f":"IF(Meetings2!L3=\"\",\"\",getAddress(Meetings2!L3))","v":""},{"$f":"IF(Meetings2!M3=\"\",\"\",getAddress(Meetings2!M3))","v":""},{"$f":"IF(Meetings2!N3=\"\",\"\",getAddress(Meetings2!N3))","v":""},"",0.17013888888888901,{"$nulls":20},"Pinjarra","Pinjarra",{"$f":"IF(Race!N3<>\"\",Race!C3,\"\")","v":""},{"$f":"IF(AX3<>\"\",Race!N3,\"\")","v":""},{"$f":"IF(AX3<>\"\",Race!I3,\"\")","v":""},{"$f":"IF(Form!I6<>\"\",LEFT(Form!C6,FIND(\"(\",Form!C6)-2),\"\")","v":"Igotitfrommymumma"},null,{"$f":"IF(BA3=\"\",\"\",Form!A6)","v":2},{"$f":"IF($BA3=\"\",\"\",IF(ISNA(VLOOKUP(BC3,Tables!A$5:B$100,2,FALSE)),\"0\",VLOOKUP(BC3,Tables!A$5:B$100,2,FALSE)))","v":5},{"$f":"IF($BA3=\"\",\"\",IF(ISNA(VLOOKUP(BA3,AX2:AZ101,3,FALSE)),\"\",VLOOKUP(BA3,AX2:AZ101,3,FALSE)))","v":3},{"$f":"IF($BE3=\"\",\"0\",IF(ISNA(VLOOKUP(BE3,Tables!C$5:D$100,2,FALSE)),\"0\",VLOOKUP(BE3,Tables!C$5:D$100,2,FALSE)))","v":5},{"$f":"IF(BA3=\"\",\"\",Form!F6)","v":55.5},{"$f":"IF($BA3=\"\",\"\",IF(ISNA(VLOOKUP(BG3,Tables!E$5:F$100,2,FALSE)),\"0\",VLOOKUP(BG3,Tables!E$5:F$100,2,FALSE)))","v":3},{"$f":"IF($BA3=\"\",\"\",INDEX($AA$1:$AT$499,MATCH($BA3,$Z$1:$Z$499,0)+7,13))","v":" Cd 52.0--2.0"},{"$f":"IF($BA3=\"\",\"\",LEFT(BI3,FIND(\"-\",BI3)-1))","v":" Cd 52.0"},{"$f":"IF(BG3=\"\",\"\",BG3-BL3)","v":3.5},{"$f":"IF($BA3=\"\",\"\",TRIM(MID(BJ3,4,5)))","v":"52.0"},{"$f":"IF($BA3=\"\",\"\",IF(ISERROR(BL3),0,IF(ISNA(VLOOKUP(BK3,Tables!G$5:H$100,2,FALSE)),\"0\",VLOOKUP(BK3,Tables!G6:H$100,2,FALSE))))","v":5},{"$f":"IF($BA3=\"\",\"\",Form!G6)","v":1.3},{"$f":"IF(BN3=\"\",\"\",IF(RANK(BN3,$BN$2:$BN$32)<25,RANK(BN3,$BN$2:$BN$32),\"\"))","v":4},{"$f":"IF($BA3=\"\",\"\",IF(ISNA(VLOOKUP(BO3,Tables!I$5:J$100,2,FALSE)),\"0\",VLOOKUP(BO3,Tables!I$5:J$100,2,FALSE)))","v":3},{"$f":"IF($BA3=\"\",\"\",Form!H6)","v":12.9},{"$f":"IF(BA3=\"\",\"\",IF(RANK(BQ3,$BQ$2:$BQ$32)<25,RANK(BQ3,$BQ$2:$BQ$32),\"\"))","v":3},{"$f":"IF($BA3=\"\",\"\",IF(ISNA(VLOOKUP(BR3,Tables!K$5:L$100,2,FALSE)),\"0\",VLOOKUP(BR3,Tables!K$5:L$100,2,FALSE)))","v":4},{"$f":"IF($BA3=\"\",\"\",Form!I6)","v":41.9},{"$f":"IF(BA3=\"\",\"\",IF(RANK(BT3,$BT$2:$BT$32)<25,RANK(BT3,$BT$2:$BT$32),\"\"))","v":3},{"$f":"IF($BA3=\"\",\"\",IF(ISNA(VLOOKUP(BU3,Tables!M$5:N$100,2,FALSE)),\"0\",VLOOKUP(BU3,Tables!M$5:N$100,2,FALSE)))","v":4},{"$f":"IF($BA3=\"\",\"\",INDEX(Race!$D$1:$P$100,MATCH($BA3,Race!$C$1:$C$100,0)+0,9))","v":"T"},{"$f":"IF($BA3=\"\",\"\",IF(ISERROR(FIND(BX$1,$BW3,1)),\"\",BX$1))","v":""},{"$f":"IF(BX3<>\"\",\"Y\",\"N\")","v":"N"},{"$f":"IF($BA3=\"\",\"\",IF(ISNA(VLOOKUP(BY3,Tables!O$5:P$100,2,FALSE)),0,VLOOKUP(BY3,Tables!O$5:P$100,2,FALSE)))","v":0},{"$f":"IF($BA3=\"\",\"\",IF(ISERROR(FIND(CA$1,$BW3,1)),\"\",CA$1))","v":"T"},{"$f":"IF(CA3<>\"\",\"Y\",\"N\")","v":"Y"},{"$f":"IF($BA3=\"\",\"\",IF(ISNA(VLOOKUP(CB3,Tables!Q$5:R$100,2,FALSE)),0,VLOOKUP(CB3,Tables!Q$5:R$100,2,FALSE)))","v":5},{"$f":"IF($BA3=\"\",\"\",IF(ISERROR(FIND(CD$1,$BW3,1)),\"\",CD$1))","v":""},{"$f":"IF(CD3<>\"\",\"Y\",\"N\")","v":"N"},{"$f":"IF($BA3=\"\",\"\",IF(ISNA(VLOOKUP(CE3,Tables!S$5:T$100,2,FALSE)),0,VLOOKUP(CE3,Tables!S$5:T$100,2,FALSE)))","v":0},{"$f":"IF($BA3=\"\",\"\",IF(ISERROR(FIND(CG$1,$BW3,1)),\"\",CG$1))","v":""},{"$f":"IF(CG3<>\"\",\"Y\",\"N\")","v":"N"},{"$f":"IF($BA3=\"\",\"\",IF(ISNA(VLOOKUP(CH3,Tables!U$5:V$100,2,FALSE)),0,VLOOKUP(CH3,Tables!U$5:V$100,2,FALSE)))","v":0},{"$f":"IF($BA3=\"\",\"\",INDEX($AA$1:$AT$499,MATCH($BA3,$Z$1:$Z$499,0)+7,3))","v":"2010-11-04"},{"$f":"IF(CJ3=\"\",\"\",$M$2-CJ3)","v":28},{"$f":"IF(CK3>90,0,CK3)","v":28},{"$f":"IF($BA3=\"\",\"\",IF(ISERROR(CL3),0,IF(ISNA(VLOOKUP(CL3,Tables!W$5:X$100,2,FALSE)),\"0\",VLOOKUP(CL3,Tables!W$5:X$100,2,FALSE))))","v":0},{"$f":"IF($BA3=\"\",\"\",INDEX($AA$1:$AT$499,MATCH($BA3,$Z$1:$Z$499,0)+8,3))","v":"2010-10-19"},{"$f":"IF(CN3=\"\",\"\",$M$2-CN3)","v":44},{"$f":"IF(CO3>90,0,CO3)","v":44},{"$f":"IF($BA3=\"\",\"\",IF(ISERROR(CP3),0,IF(ISNA(VLOOKUP(CP3,Tables!Y$5:Z$100,2,FALSE)),\"0\",VLOOKUP(CP3,Tables!Y$5:Z$100,2,FALSE))))","v":0},{"$f":"IF($BA3=\"\",\"\",INDEX($AA$1:$AT$499,MATCH($BA3,$Z$1:$Z$499,0)+9,3))","v":"2010-10-09"},{"$f":"IF(CR3=\"\",\"\",$M$2-CR3)","v":54},{"$f":"IF(CS3>90,0,CS3)","v":54},{"$f":"IF($BA3=\"\",\"\",IF(ISERROR(CT3),0,IF(ISNA(VLOOKUP(CT3,Tables!AA$5:AB$100,2,FALSE)),\"0\",VLOOKUP(CT3,Tables!AA$5:AB$100,2,FALSE))))","v":0},{"$f":"IF($BA3=\"\",\"\",INDEX($AA$1:$AT$499,MATCH($BA3,$Z$1:$Z$499,0)+7,9))","v":12000},{"$f":"IF(CV3=\"\",\"\",(Form!$H$3-CV3)/CV3*100)","v":-16.666666666666664},{"$f":"IF(CW3=\"\",\"\",IF(CW3>10,1,IF(CW3<-10,2,3)))","v":2},{"$f":"IF($BA3=\"\",\"\",IF(ISERROR(CX3),0,IF(ISNA(VLOOKUP(CX3,Tables!AC$5:AD$100,2,FALSE)),\"0\",VLOOKUP(CX3,Tables!AC$5:AD$100,2,FALSE))))","v":10},{"$f":"IF($BA3=\"\",\"\",INDEX($AA$1:$AT$499,MATCH($BA3,$Z$1:$Z$499,0)+7,1))","v":"7-8 4.2L"},{"$f":"IF($CZ3=\"\",\"\",CLEAN(LEFT(CZ3,FIND(\"-\",CZ3)-1)))","v":"7"},{"$f":"IF($DA3=\"\",\"\",IF(0+DA3>10,0,0+DA3))","v":7},{"$f":"IF($BA3=\"\",\"\",IF(ISERROR(DB3),0,IF(ISNA(VLOOKUP(DB3,Tables!AE$5:AF$100,2,FALSE)),\"0\",VLOOKUP(DB3,Tables!AE$5:AF$100,2,FALSE))))","v":0},"4.2L",{"$f":"IF($BI3=\"\",\"\",LEFT(DD3,FIND(\"L\",DD3)-1))","v":"4.2"},{"$f":"IF($BI3=\"\",\"\",ROUND(0+DE3/0.5,0)*0.5)","v":4},{"$f":"IF(DF3=\"\",\"\",IF(DB3=1,0,DF3))","v":4},{"$f":"IF(DG3=\"\",\"\",DG3)","v":4},{"$f":"IF($BA3=\"\",\"\",IF(ISERROR(DH3),0,IF(ISNA(VLOOKUP(DG3,Tables!AG$5:AH$100,2,FALSE)),\"0\",VLOOKUP(DG3,Tables!AG$5:AH$100,2,FALSE))))","v":2},{"$f":"IF($BA3=\"\",\"\",INDEX($AA$1:$AT$499,MATCH($BA3,$Z$1:$Z$499,0)+8,1))","v":"3-7 2.4L"},{"$f":"IF($DJ3=\"\",\"\",CLEAN(LEFT(DJ3,FIND(\"-\",DJ3)-1)))","v":"3"},{"$f":"IF($DK3=\"\",\"\",IF(0+DK3>10,0,0+DK3))","v":3},{"$f":"IF($BA3=\"\",\"\",IF(ISERROR(DL3),0,IF(ISNA(VLOOKUP(DL3,Tables!AI$5:AJ$100,2,FALSE)),\"0\",VLOOKUP(DL3,Tables!AI$5:AJ$100,2,FALSE))))","v":3},"2.4L","2.4",2.5,{"$f":"IF(DP3=\"\",\"\",IF(DL3=1,0,DP3))","v":2.5},{"$f":"IF(DQ3=\"\",\"\",DQ3)","v":2.5},{"$f":"IF($BA3=\"\",\"\",IF(ISERROR(DR3),0,IF(ISNA(VLOOKUP(DQ3,Tables!AK$5:AL$100,2,FALSE)),\"0\",VLOOKUP(DQ3,Tables!AK$5:AL$100,2,FALSE))))","v":5},{"$f":"IF($BA3=\"\",\"\",INDEX($AA$1:$AT$499,MATCH($BA3,$Z$1:$Z$499,0)+9,1))","v":"1-6 0.2L"},{"$f":"IF($DJ3=\"\",\"\",CLEAN(LEFT(DT3,FIND(\"-\",DT3)-1)))","v":"1"},{"$f":"IF($DU3=\"\",\"\",IF(ISERROR(IF(0+DU3>10,0,0+DU3)),0,IF(0+DU3>10,0,0+DU3)))","v":1},{"$f":"IF($BA3=\"\",\"\",IF(ISERROR(DV3),0,IF(ISNA(VLOOKUP(DV3,Tables!AM$5:AN$100,2,FALSE)),\"0\",VLOOKUP(DV3,Tables!AM$5:AN$100,2,FALSE))))","v":7},"0.2L",{"$f":"IF($BI3=\"\",\"\",LEFT(DX3,FIND(\"L\",DX3)-1))","v":"0.2"},0,{"$f":"IF(DZ3=\"\",\"\",IF(DV3=1,0,DZ3))","v":0},{"$f":"IF(EA3=\"\",\"\",EA3)","v":0},{"$f":"IF($BC3=\"\",\"\",IF(ISERROR(EB3),0,IF(ISNA(VLOOKUP(EA3,Tables!AO$5:AP$100,2,FALSE)),\"0\",VLOOKUP(EA3,Tables!AO$5:AP$100,2,FALSE))))","v":7},{"$f":"IF(BA3=\"\",\"\",IF(ISNA(VLOOKUP(BA3,$AX$1:$AY$100,2,FALSE)),\"\",VLOOKUP(BA3,$AX$1:$AY$100,2,FALSE)))","v":99},{"$f":"IF($BA3=\"\",\"\",CLEAN(TRIM(ED3)))","v":"99"},{"$f":"IF(EE3=\"\",\"\",0+EE3)","v":99},{"$f":"IF($EE3=\"\",\"0\",IF(ISNA(VLOOKUP(EF3,Tables!AQ$5:AR$100,2,FALSE)),\"0\",VLOOKUP(EF3,Tables!AQ$5:AR$100,2,FALSE)))","v":5},{"$f":"IF(BA3=\"\",\"\",IF(MainSheet!D10=\"Scratched\",\"\",BD3+BF3+BH3+BM3+BP3+BS3+BV3+BZ3+CC3+CF3+CI3+CM3+CQ3+CU3+CY3+DC3+DI3+DM3+DS3+DW3+EC3+EG3))","v":73}]
[{"$f":"IF(Meetings1!A4=\"\",\"\",IF(Meetings1!A4=\"END\",\"END\",IF(Meetings1!E4=\"\",\"\",getAddress(Meetings1!E4))))","v":"http://formguide.cyberhorse.com.au/index.php/Form/form.html?formdate=2010-12-02&track=G'long&raceno=2"},{"$nulls":11},{"$f":"IF(ISNA(VLOOKUP(N4,RaceList!$J$3:$L$19,3,FALSE)),\"\",VLOOKUP(N4,RaceList!$J$3:$L$19,3,FALSE))","v":""},{"$f":"IF(Meetings2!$B4=\"\",\"\",Meetings2!$B4)","v":"ALBION PARK (BG) race 07 ($1,064)"},{"$f":"IF(Meetings2!D4=\"\",\"\",getAddress(Meetings2!D4))","v":""},{"$f":"IF(Meetings2!E4=\"\",\"\",getAddress(Meetings2!E4))","v":""},{"$f":"IF(Meetings2!F4=\"\",\"\",getAddress(Meetings2!F4))","v":""},{"$f":"IF(Meetings2!G4=\"\",\"\",getAddress(Meetings2!G4))","v":""},{"$f":"IF(Meetings2!H4=\"\",\"\",getAddress(Meetings2!H4))","v":""},{"$f":"IF(Meetings2!I4=\"\",\"\",getAddress(Meetings2!I4))","v":""},{"$f":"IF(Meetings2!J4=\"\",\"\",getAddress(Meetings2!J4))","v":""},{"$f":"IF(Meetings2!K4=\"\",\"\",getAddress(Meetings2!K4))","v":""},{"$f":"IF(Meetings2!L4=\"\",\"\",getAddress(Meetings2!L4))","v":""},{"$f":"IF(Meetings2!M4=\"\",\"\",getAddress(Meetings2!M4))","v":""},{"$f":"IF(Meetings2!N4=\"\",\"\",getAddress(Meetings2!N4))","v":""},"","#",{"$nulls":20},"Launceston","Launceston",{"$f":"IF(Race!N4<>\"\",Race!C4,\"\")","v":""},{"$f":"IF(AX4<>\"\",Race!N4,\"\")","v":""},{"$f":"IF(AX4<>\"\",Race!I4,\"\")","v":""},{"$f":"IF(Form!I7<>\"\",LEFT(Form!C7,FIND(\"(\",Form!C7)-2),\"\")","v":"Noble Lustre"},null,{"$f":"IF(BA4=\"\",\"\",Form!A7)","v":3},{"$f":"IF($BA4=\"\",\"\",IF(ISNA(VLOOKUP(BC4,Tables!A$5:B$100,2,FALSE)),\"0\",VLOOKUP(BC4,Tables!A$5:B$100,2,FALSE)))","v":5},5,{"$f":"IF($BE4=\"\",\"0\",IF(ISNA(VLOOKUP(BE4,Tables!C$5:D$100,2,FALSE)),\"0\",VLOOKUP(BE4,Tables!C$5:D$100,2,FALSE)))","v":3},{"$f":"IF(BA4=\"\",\"\",Form!F7)","v":55.5},{"$f":"IF($BA4=\"\",\"\",IF(ISNA(VLOOKUP(BG4,Tables!E$5:F$100,2,FALSE)),\"0\",VLOOKUP(BG4,Tables!E$5:F$100,2,FALSE)))","v":3},{"$f":"IF($BA4=\"\",\"\",INDEX($AA$1:$AT$499,MATCH($BA4,$Z$1:$Z$499,0)+7,13))","v":" Cd 57.0-0.0"}," Cd 57.0",-1.5,"57.0",{"$f":"IF($BA4=\"\",\"\",IF(ISERROR(BL4),0,IF(ISNA(VLOOKUP(BK4,Tables!G$5:H$100,2,FALSE)),\"0\",VLOOKUP(BK4,Tables!G7:H$100,2,FALSE))))","v":3},{"$f":"IF($BA4=\"\",\"\",Form!G7)","v":2.1},3,{"$f":"IF($BA4=\"\",\"\",IF(ISNA(VLOOKUP(BO4,Tables!I$5:J$100,2,FALSE)),\"0\",VLOOKUP(BO4,Tables!I$5:J$100,2,FALSE)))","v":4},{"$f":"IF($BA4=\"\",\"\",Form!H7)","v":11.1},6,{"$f":"IF($BA4=\"\",\"\",IF(ISNA(VLOOKUP(BR4,Tables!K$5:L$100,2,FALSE)),\"0\",VLOOKUP(BR4,Tables!K$5:L$100,2,FALSE)))","v":2},{"$f":"IF($BA4=\"\",\"\",Form!I7)","v":33.299999999999997},6,{"$f":"IF($BA4=\"\",\"\",IF(ISNA(VLOOKUP(BU4,Tables!M$5:N$100,2,FALSE)),\"0\",VLOOKUP(BU4,Tables!M$5:N$100,2,FALSE)))","v":2},{"$f":"IF($BA4=\"\",\"\",INDEX(Race!$D$1:$P$100,MATCH($BA4,Race!$C$1:$C$100,0)+0,9))","v":0},"","N",{"$f":"IF($BA4=\"\",\"\",IF(ISNA(VLOOKUP(BY4,Tables!O$5:P$100,2,FALSE)),0,VLOOKUP(BY4,Tables!O$5:P$100,2,FALSE)))","v":0},"","N",{"$f":"IF($BA4=\"\",\"\",IF(ISNA(VLOOKUP(CB4,Tables!Q$5:R$100,2,FALSE)),0,VLOOKUP(CB4,Tables!Q$5:R$100,2,FALSE)))","v":0},"","N",{"$f":"IF($BA4=\"\",\"\",IF(ISNA(VLOOKUP(CE4,Tables!S$5:T$100,2,FALSE)),0,VLOOKUP(CE4,Tables!S$5:T$100,2,FALSE)))","v":0},"","N",{"$f":"IF($BA4=\"\",\"\",IF(ISNA(VLOOKUP(CH4,Tables!U$5:V$100,2,FALSE)),0,VLOOKUP(CH4,Tables!U$5:V$100,2,FALSE)))","v":0},"2010-11-11",21,21,{"$f":"IF($BA4=\"\",\"\",IF(ISERROR(CL4),0,IF(ISNA(VLOOKUP(CL4,Tables!W$5:X$100,2,FALSE)),\"0\",VLOOKUP(CL4,Tables!W$5:X$100,2,FALSE))))","v":2},"2010-11-02",30,30,{"$f":"IF($BA4=\"\",\"\",IF(ISERROR(CP4),0,IF(ISNA(VLOOKUP(CP4,Tables!Y$5:Z$100,2,FALSE)),\"0\",VLOOKUP(CP4,Tables!Y$5:Z$100,2,FALSE))))","v":0},"2010-10-07",56,56,{"$f":"IF($BA4=\"\",\"\",IF(ISERROR(CT4),0,IF(ISNA(VLOOKUP(CT4,Tables!AA$5:AB$100,2,FALSE)),\"0\",VLOOKUP(CT4,Tables!AA$5:AB$100,2,FALSE))))","v":0},10000,{"$f":"IF(CV4=\"\",\"\",(Form!$H$3-CV4)/CV4*100)","v":0},3,{"$f":"IF($BA4=\"\",\"\",IF(ISERROR(CX4),0,IF(ISNA(VLOOKUP(CX4,Tables!AC$5:AD$100,2,FALSE)),\"0\",VLOOKUP(CX4,Tables!AC$5:AD$100,2,FALSE))))","v":0},"8-13 4.5L","8",8,{"$f":"IF($BA4=\"\",\"\",IF(ISERROR(DB4),0,IF(ISNA(VLOOKUP(DB4,Tables!AE$5:AF$100,2,FALSE)),\"0\",VLOOKUP(DB4,Tables!AE$5:AF$100,2,FALSE))))","v":0},"4.5L","4.5",4.5,4.5,4.5,{"$f":"IF($BA4=\"\",\"\",IF(ISERROR(DH4),0,IF(ISNA(VLOOKUP(DG4,Tables!AG$5:AH$100,2,FALSE)),\"0\",VLOOKUP(DG4,Tables!AG$5:AH$100,2,FALSE))))","v":2},"1-6 2.0L","1",1,{"$f":"IF($BA4=\"\",\"\",IF(ISERROR(DL4),0,IF(ISNA(VLOOKUP(DL4,Tables!AI$5:AJ$100,2,FALSE)),\"0\",VLOOKUP(DL4,Tables!AI$5:AJ$100,2,FALSE))))","v":7},"2.0L","2.0",2,0,0,{"$f":"IF($BA4=\"\",\"\",IF(ISERROR(DR4),0,IF(ISNA(VLOOKUP(DQ4,Tables!AK$5:AL$100,2,FALSE)),\"0\",VLOOKUP(DQ4,Tables!AK$5:AL$100,2,FALSE))))","v":7},"9-15 7.2L","9",9,{"$f":"IF($BA4=\"\",\"\",IF(ISERROR(DV4),0,IF(ISNA(VLOOKUP(DV4,Tables!AM$5:AN$100,2,FALSE)),\"0\",VLOOKUP(DV4,Tables!AM$5:AN$100,2,FALSE))))","v":0},"7.2L","7.2",7,7,7,{"$f":"IF($BC4=\"\",\"\",IF(ISERROR(EB4),0,IF(ISNA(VLOOKUP(EA4,Tables!AO$5:AP$100,2,FALSE)),\"0\",VLOOKUP(EA4,Tables!AO$5:AP$100,2,FALSE))))","v":0},100,"100",100,{"$f":"IF($EE4=\"\",\"0\",IF(ISNA(VLOOKUP(EF4,Tables!AQ$5:AR$100,2,FALSE)),\"0\",VLOOKUP(EF4,Tables!AQ$5:AR$100,2,FALSE)))","v":7},{"$f":"IF(BA4=\"\",\"\",IF(MainSheet!D11=\"Scratched\",\"\",BD4+BF4+BH4+BM4+BP4+BS4+BV4+BZ4+CC4+CF4+CI4+CM4+CQ4+CU4+CY4+DC4+DI4+DM4+DS4+DW4+EC4+EG4))","v":47}]
[{"$f":"IF(Meetings1!A5=\"\",\"\",IF(Meetings1!A5=\"END\",\"END\",IF(Meetings1!E5=\"\",\"\",getAddress(Meetings1!E5))))","v":"http://formguide.cyberhorse.com.au/index.php/Form/form.html?formdate=2010-12-02&track=G'long&raceno=3"},{"$nulls":11},{"$f":"IF(ISNA(VLOOKUP(N5,RaceList!$J$3:$L$19,3,FALSE)),\"\",VLOOKUP(N5,RaceList!$J$3:$L$19,3,FALSE))","v":""},{"$f":"IF(Meetings2!$B5=\"\",\"\",Meetings2!$B5)","v":"ALBION PARK (BG) race 08 ($9,161)"},{"$f":"IF(Meetings2!D5=\"\",\"\",getAddress(Meetings2!D5))","v":""},{"$f":"IF(Meetings2!E5=\"\",\"\",getAddress(Meetings2!E5))","v":""},{"$f":"IF(Meetings2!F5=\"\",\"\",getAddress(Meetings2!F5))","v":""},{"$f":"IF(Meetings2!G5=\"\",\"\",getAddress(Meetings2!G5))","v":""},{"$f":"IF(Meetings2!H5=\"\",\"\",getAddress(Meetings2!H5))","v":""},{"$f":"IF(Meetings2!I5=\"\",\"\",getAddress(Meetings2!I5))","v":""},{"$f":"IF(Meetings2!J5=\"\",\"\",getAddress(Meetings2!J5))","v":""},{"$f":"IF(Meetings2!K5=\"\",\"\",getAddress(Meetings2!K5))","v":""},{"$f":"IF(Meetings2!L5=\"\",\"\",getAddress(Meetings2!L5))","v":""},{"$f":"IF(Meetings2!M5=\"\",\"\",getAddress(Meetings2!M5))","v":""},{"$f":"IF(Meetings2!N5=\"\",\"\",getAddress(Meetings2!N5))","v":""},"",1,{"$nulls":20},"Hawkesbury","Hawkesbury",{"$f":"IF(Race!N5<>\"\",Race!C5,\"\")","v":""},{"$f":"IF(AX5<>\"\",Race!N5,\"\")","v":""},{"$f":"IF(AX5<>\"\",Race!I5,\"\")","v":""},{"$f":"IF(Form!I8<>\"\",LEFT(Form!C8,FIND(\"(\",Form!C8)-2),\"\")","v":"Chabal"},null,{"$f":"IF(BA5=\"\",\"\",Form!A8)","v":4},{"$f":"IF($BA5=\"\",\"\",IF(ISNA(VLOOKUP(BC5,Tables!A$5:B$100,2,FALSE)),\"0\",VLOOKUP(BC5,Tables!A$5:B$100,2,FALSE)))","v":3},4,{"$f":"IF($BE5=\"\",\"0\",IF(ISNA(VLOOKUP(BE5,Tables!C$5:D$100,2,FALSE)),\"0\",VLOOKUP(BE5,Tables!C$5:D$100,2,FALSE)))","v":3},{"$f":"IF(BA5=\"\",\"\",Form!F8)","v":55},{"$f":"IF($BA5=\"\",\"\",IF(ISNA(VLOOKUP(BG5,Tables!E$5:F$100,2,FALSE)),\"0\",VLOOKUP(BG5,Tables!E$5:F$100,2,FALSE)))","v":3}," Cd 56.5-0.0"," Cd 56.5",-1.5,"56.5",{"$f":"IF($BA5=\"\",\"\",IF(ISERROR(BL5),0,IF(ISNA(VLOOKUP(BK5,Tables!G$5:H$100,2,FALSE)),\"0\",VLOOKUP(BK5,Tables!G8:H$100,2,FALSE))))","v":3},{"$f":"IF($BA5=\"\",\"\",Form!G8)","v":1.1000000000000001},6,{"$f":"IF($BA5=\"\",\"\",IF(ISNA(VLOOKUP(BO5,Tables!I$5:J$100,2,FALSE)),\"0\",VLOOKUP(BO5,Tables!I$5:J$100,2,FALSE)))","v":2},{"$f":"IF($BA5=\"\",\"\",Form!H8)","v":12.5},4,{"$f":"IF($BA5=\"\",\"\",IF(ISNA(VLOOKUP(BR5,Tables!K$5:L$100,2,FALSE)),\"0\",VLOOKUP(BR5,Tables!K$5:L$100,2,FALSE)))","v":3},{"$f":"IF($BA5=\"\",\"\",Form!I8)","v":41.7},4,{"$f":"IF($BA5=\"\",\"\",IF(ISNA(VLOOKUP(BU5,Tables!M$5:N$100,2,FALSE)),\"0\",VLOOKUP(BU5,Tables!M$5:N$100,2,FALSE)))","v":3},{"$f":"IF($BA5=\"\",\"\",INDEX(Race!$D$1:$P$100,MATCH($BA5,Race!$C$1:$C$100,0)+0,9))","v":"D"},"D","Y",{"$f":"IF($BA5=\"\",\"\",IF(ISNA(VLOOKUP(BY5,Tables!O$5:P$100,2,FALSE)),0,VLOOKUP(BY5,Tables!O$5:P$100,2,FALSE)))","v":5},"","N",{"$f":"IF($BA5=\"\",\"\",IF(ISNA(VLOOKUP(CB5,Tables!Q$5:R$100,2,FALSE)),0,VLOOKUP(CB5,Tables!Q$5:R$100,2,FALSE)))","v":0},"","N",{"$f":"IF($BA5=\"\",\"\",IF(ISNA(VLOOKUP(CE5,Tables!S$5:T$100,2,FALSE)),0,VLOOKUP(CE5,Tables!S$5:T$100,2,FALSE)))","v":0},"","N",{"$f":"IF($BA5=\"\",\"\",IF(ISNA(VLOOKUP(CH5,Tables!U$5:V$100,2,FALSE)),0,VLOOKUP(CH5,Tables!U$5:V$100,2,FALSE)))","v":0},"2010-11-11",21,21,{"$f":"IF($BA5=\"\",\"\",IF(ISERROR(CL5),0,IF(ISNA(VLOOKUP(CL5,Tables!W$5:X$100,2,FALSE)),\"0\",VLOOKUP(CL5,Tables!W$5:X$100,2,FALSE))))","v":2},"2010-08-26",98,0,{"$f":"IF($BA5=\"\",\"\",IF(ISERROR(CP5),0,IF(ISNA(VLOOKUP(CP5,Tables!Y$5:Z$100,2,FALSE)),\"0\",VLOOKUP(CP5,Tables!Y$5:Z$100,2,FALSE))))","v":0},"2010-08-21",103,0,{"$f":"IF($BA5=\"\",\"\",IF(ISERROR(CT5),0,IF(ISNA(VLOOKUP(CT5,Tables!AA$5:AB$100,2,FALSE)),\"0\",VLOOKUP(CT5,Tables!AA$5:AB$100,2,FALSE))))","v":0},10000,{"$f":"IF(CV5=\"\",\"\",(Form!$H$3-CV5)/CV5*100)","v":0},3,{"$f":"IF($BA5=\"\",\"\",IF(ISERROR(CX5),0,IF(ISNA(VLOOKUP(CX5,Tables!AC$5:AD$100,2,FALSE)),\"0\",VLOOKUP(CX5,Tables!AC$5:AD$100,2,FALSE))))","v":0},"6-13 3.1L","6",6,{"$f":"IF($BA5=\"\",\"\",IF(ISERROR(DB5),0,IF(ISNA(VLOOKUP(DB5,Tables!AE$5:AF$100,2,FALSE)),\"0\",VLOOKUP(DB5,Tables!AE$5:AF$100,2,FALSE))))","v":0},"3.1L","3.1",3,3,3,{"$f":"IF($BA5=\"\",\"\",IF(ISERROR(DH5),0,IF(ISNA(VLOOKUP(DG5,Tables!AG$5:AH$100,2,FALSE)),\"0\",VLOOKUP(DG5,Tables!AG$5:AH$100,2,FALSE))))","v":3},"4-11 2.8L","4",4,{"$f":"IF($BA5=\"\",\"\",IF(ISERROR(DL5),0,IF(ISNA(VLOOKUP(DL5,Tables!AI$5:AJ$100,2,FALSE)),\"0\",VLOOKUP(DL5,Tables!AI$5:AJ$100,2,FALSE))))","v":2},"2.8L","2.8",3,3,3,{"$f":"IF($BA5=\"\",\"\",IF(ISERROR(DR5),0,IF(ISNA(VLOOKUP(DQ5,Tables!AK$5:AL$100,2,FALSE)),\"0\",VLOOKUP(DQ5,Tables!AK$5:AL$100,2,FALSE))))","v":3},"5-11 2.2L","5",5,{"$f":"IF($BA5=\"\",\"\",IF(ISERROR(DV5),0,IF(ISNA(VLOOKUP(DV5,Tables!AM$5:AN$100,2,FALSE)),\"0\",VLOOKUP(DV5,Tables!AM$5:AN$100,2,FALSE))))","v":2},"2.2L","2.2",2,2,2,{"$f":"IF($BC5=\"\",\"\",IF(ISERROR(EB5),0,IF(ISNA(VLOOKUP(EA5,Tables!AO$5:AP$100,2,FALSE)),\"0\",VLOOKUP(EA5,Tables!AO$5:AP$100,2,FALSE))))","v":5},98,"98",98,{"$f":"IF($EE5=\"\",\"0\",IF(ISNA(VLOOKUP(EF5,Tables!AQ$5:AR$100,2,FALSE)),\"0\",VLOOKUP(EF5,Tables!AQ$5:AR$100,2,FALSE)))","v":3},{"$f":"IF(BA5=\"\",\"\",IF(MainSheet!D12=\"Scratched\",\"\",BD5+BF5+BH5+BM5+BP5+BS5+BV5+BZ5+CC5+CF5+CI5+CM5+CQ5+CU5+CY5+DC5+DI5+DM5+DS5+DW5+EC5+EG5))","v":45}]
[{"$f":"IF(Meetings1!A6=\"\",\"\",IF(Meetings1!A6=\"END\",\"END\",IF(Meetings1!E6=\"\",\"\",getAddress(Meetings1!E6))))","v":"http://formguide.cyberhorse.com.au/index.php/Form/form.html?formdate=2010-12-02&track=G'long&raceno=4"},{"$nulls":11},{"$f":"IF(ISNA(VLOOKUP(N6,RaceList!$J$3:$L$19,3,FALSE)),\"\",VLOOKUP(N6,RaceList!$J$3:$L$19,3,FALSE))","v":""},{"$f":"IF(Meetings2!$B6=\"\",\"\",Meetings2!$B6)","v":"ANGLE PARK (AG) race 08 ($8,636)"},{"$f":"IF(Meetings2!D6=\"\",\"\",getAddress(Meetings2!D6))","v":""},{"$f":"IF(Meetings2!E6=\"\",\"\",getAddress(Meetings2!E6))","v":""},{"$f":"IF(Meetings2!F6=\"\",\"\",getAddress(Meetings2!F6))","v":""},{"$f":"IF(Meetings2!G6=\"\",\"\",getAddress(Meetings2!G6))","v":""},{"$f":"IF(Meetings2!H6=\"\",\"\",getAddress(Meetings2!H6))","v":""},{"$f":"IF(Meetings2!I6=\"\",\"\",getAddress(Meetings2!I6))","v":""},{"$f":"IF(Meetings2!J6=\"\",\"\",getAddress(Meetings2!J6))","v":""},{"$f":"IF(Meetings2!K6=\"\",\"\",getAddress(Meetings2!K6))","v":""},{"$f":"IF(Meetings2!L6=\"\",\"\",getAddress(Meetings2!L6))","v":""},{"$f":"IF(Meetings2!M6=\"\",\"\",getAddress(Meetings2!M6))","v":""},{"$f":"IF(Meetings2!N6=\"\",\"\",getAddress(Meetings2!N6))","v":""},"",2,{"$nulls":20},"Geelong","Geelong",{"$f":"IF(Race!N6<>\"\",Race!C6,\"\")","v":""},{"$f":"IF(AX6<>\"\",Race!N6,\"\")","v":""},{"$f":"IF(AX6<>\"\",Race!I6,\"\")","v":""},{"$f":"IF(Form!I9<>\"\",LEFT(Form!C9,FIND(\"(\",Form!C9)-2),\"\")","v":"Craiglea Tina"},null,{"$f":"IF(BA6=\"\",\"\",Form!A9)","v":5},{"$f":"IF($BA6=\"\",\"\",IF(ISNA(VLOOKUP(BC6,Tables!A$5:B$100,2,FALSE)),\"0\",VLOOKUP(BC6,Tables!A$5:B$100,2,FALSE)))","v":3},"",{"$f":"IF($BE6=\"\",\"0\",IF(ISNA(VLOOKUP(BE6,Tables!C$5:D$100,2,FALSE)),\"0\",VLOOKUP(BE6,Tables!C$5:D$100,2,FALSE)))","v":"0"},{"$f":"IF(BA6=\"\",\"\",Form!F9)","v":54},{"$f":"IF($BA6=\"\",\"\",IF(ISNA(VLOOKUP(BG6,Tables!E$5:F$100,2,FALSE)),\"0\",VLOOKUP(BG6,Tables!E$5:F$100,2,FALSE)))","v":2}," Cd 53.0--3.0"," Cd 53.0",1,"53.0",{"$f":"IF($BA6=\"\",\"\",IF(ISERROR(BL6),0,IF(ISNA(VLOOKUP(BK6,Tables!G$5:H$100,2,FALSE)),\"0\",VLOOKUP(BK6,Tables!G9:H$100,2,FALSE))))","v":3},{"$f":"IF($BA6=\"\",\"\",Form!G9)","v":2.2999999999999998},2,{"$f":"IF($BA6=\"\",\"\",IF(ISNA(VLOOKUP(BO6,Tables!I$5:J$100,2,FALSE)),\"0\",VLOOKUP(BO6,Tables!I$5:J$100,2,FALSE)))","v":6},{"$f":"IF($BA6=\"\",\"\",Form!H9)","v":17.600000000000001},2,{"$f":"IF($BA6=\"\",\"\",IF(ISNA(VLOOKUP(BR6,Tables!K$5:L$100,2,FALSE)),\"0\",VLOOKUP(BR6,Tables!K$5:L$100,2,FALSE)))","v":6},{"$f":"IF($BA6=\"\",\"\",Form!I9)","v":41.2},5,{"$f":"IF($BA6=\"\",\"\",IF(ISNA(VLOOKUP(BU6,Tables!M$5:N$100,2,FALSE)),\"0\",VLOOKUP(BU6,Tables!M$5:N$100,2,FALSE)))","v":3},{"$f":"IF($BA6=\"\",\"\",INDEX(Race!$D$1:$P$100,MATCH($BA6,Race!$C$1:$C$100,0)+0,9))","v":0},"","N",{"$f":"IF($BA6=\"\",\"\",IF(ISNA(VLOOKUP(BY6,Tables!O$5:P$100,2,FALSE)),0,VLOOKUP(BY6,Tables!O$5:P$100,2,FALSE)))","v":0},"","N",{"$f":"IF($BA6=\"\",\"\",IF(ISNA(VLOOKUP(CB6,Tables!Q$5:R$100,2,FALSE)),0,VLOOKUP(CB6,Tables!Q$5:R$100,2,FALSE)))","v":0},"","N",{"$f":"IF($BA6=\"\",\"\",IF(ISNA(VLOOKUP(CE6,Tables!S$5:T$100,2,FALSE)),0,VLOOKUP(CE6,Tables!S$5:T$100,2,FALSE)))","v":0},"","N",{"$f":"IF($BA6=\"\",\"\",IF(ISNA(VLOOKUP(CH6,Tables!U$5:V$100,2,FALSE)),0,VLOOKUP(CH6,Tables!U$5:V$100,2,FALSE)))","v":0},"2010-11-27",5,5,{"$f":"IF($BA6=\"\",\"\",IF(ISERROR(CL6),0,IF(ISNA(VLOOKUP(CL6,Tables!W$5:X$100,2,FALSE)),\"0\",VLOOKUP(CL6,Tables!W$5:X$100,2,FALSE))))","v":5},"2010-11-20",12,12,{"$f":"IF($BA6=\"\",\"\",IF(ISERROR(CP6),0,IF(ISNA(VLOOKUP(CP6,Tables!Y$5:Z$100,2,FALSE)),\"0\",VLOOKUP(CP6,Tables!Y$5:Z$100,2,FALSE))))","v":5},"2010-11-14",18,18,{"$f":"IF($BA6=\"\",\"\",IF(ISERROR(CT6),0,IF(ISNA(VLOOKUP(CT6,Tables!AA$5:AB$100,2,FALSE)),\"0\",VLOOKUP(CT6,Tables!AA$5:AB$100,2,FALSE))))","v":3},6000,{"$f":"IF(CV6=\"\",\"\",(Form!$H$3-CV6)/CV6*100)","v":66.666666666666657},1,{"$f":"IF($BA6=\"\",\"\",IF(ISERROR(CX6),0,IF(ISNA(VLOOKUP(CX6,Tables!AC$5:AD$100,2,FALSE)),\"0\",VLOOKUP(CX6,Tables!AC$5:AD$100,2,FALSE))))","v":-5},"1-9 2.0L","1",1,{"$f":"IF($BA6=\"\",\"\",IF(ISERROR(DB6),0,IF(ISNA(VLOOKUP(DB6,Tables!AE$5:AF$100,2,FALSE)),\"0\",VLOOKUP(DB6,Tables!AE$5:AF$100,2,FALSE))))","v":7},"2.0L","2.0",2,0,0,{"$f":"IF($BA6=\"\",\"\",IF(ISERROR(DH6),0,IF(ISNA(VLOOKUP(DG6,Tables!AG$5:AH$100,2,FALSE)),\"0\",VLOOKUP(DG6,Tables!AG$5:AH$100,2,FALSE))))","v":7},"7-12 6.4L","7",7,{"$f":"IF($BA6=\"\",\"\",IF(ISERROR(DL6),0,IF(ISNA(VLOOKUP(DL6,Tables!AI$5:AJ$100,2,FALSE)),\"0\",VLOOKUP(DL6,Tables!AI$5:AJ$100,2,FALSE))))","v":0},"6.4L","6.4",6.5,6.5,6.5,{"$f":"IF($BA6=\"\",\"\",IF(ISERROR(DR6),0,IF(ISNA(VLOOKUP(DQ6,Tables!AK$5:AL$100,2,FALSE)),\"0\",VLOOKUP(DQ6,Tables!AK$5:AL$100,2,FALSE))))","v":0},"3-6 2.2L","3",3,{"$f":"IF($BA6=\"\",\"\",IF(ISERROR(DV6),0,IF(ISNA(VLOOKUP(DV6,Tables!AM$5:AN$100,2,FALSE)),\"0\",VLOOKUP(DV6,Tables!AM$5:AN$100,2,FALSE))))","v":3},"2.2L","2.2",2,2,2,{"$f":"IF($BC6=\"\",\"\",IF(ISERROR(EB6),0,IF(ISNA(VLOOKUP(EA6,Tables!AO$5:AP$100,2,FALSE)),\"0\",VLOOKUP(EA6,Tables!AO$5:AP$100,2,FALSE))))","v":5},"","","",{"$f":"IF($EE6=\"\",\"0\",IF(ISNA(VLOOKUP(EF6,Tables!AQ$5:AR$100,2,FALSE)),\"0\",VLOOKUP(EF6,Tables!AQ$5:AR$100,2,FALSE)))","v":"0"},{"$f":"IF(BA6=\"\",\"\",IF(MainSheet!D13=\"Scratched\",\"\",BD6+BF6+BH6+BM6+BP6+BS6+BV6+BZ6+CC6+CF6+CI6+CM6+CQ6+CU6+CY6+DC6+DI6+DM6+DS6+DW6+EC6+EG6))","v":""}]
[{"$f":"IF(Meetings1!A7=\"\",\"\",IF(Meetings1!A7=\"END\",\"END\",IF(Meetings1!E7=\"\",\"\",getAddress(Meetings1!E7))))","v":"http://formguide.cyberhorse.com.au/index.php/Form/form.html?formdate=2010-12-02&track=G'long&raceno=5"},{"$nulls":11},{"$f":"IF(ISNA(VLOOKUP(N7,RaceList!$J$3:$L$19,3,FALSE)),\"\",VLOOKUP(N7,RaceList!$J$3:$L$19,3,FALSE))","v":""},{"$f":"IF(Meetings2!$B7=\"\",\"\",Meetings2!$B7)","v":""},{"$f":"IF(Meetings2!D7=\"\",\"\",getAddress(Meetings2!D7))","v":{"$error":"#VALUE!"}},{"$f":"IF(Meetings2!E7=\"\",\"\",getAddress(Meetings2!E7))","v":{"$error":"#VALUE!"}},{"$f":"IF(Meetings2!F7=\"\",\"\",getAddress(Meetings2!F7))","v":{"$error":"#VALUE!"}},{"$f":"IF(Meetings2!G7=\"\",\"\",getAddress(Meetings2!G7))","v":{"$error":"#VALUE!"}},{"$f":"IF(Meetings2!H7=\"\",\"\",getAddress(Meetings2!H7))","v":{"$error":"#VALUE!"}},{"$f":"IF(Meetings2!I7=\"\",\"\",getAddress(Meetings2!I7))","v":{"$error":"#VALUE!"}},{"$f":"IF(Meetings2!J7=\"\",\"\",getAddress(Meetings2!J7))","v":{"$error":"#VALUE!"}},{"$f":"IF(Meetings2!K7=\"\",\"\",getAddress(Meetings2!K7))","v":{"$error":"#VALUE!"}},{"$f":"IF(Meetings2!L7=\"\",\"\",getAddress(Meetings2!L7))","v":{"$error":"#VALUE!"}},{"$f":"IF(Meetings2!M7=\"\",\"\",getAddress(Meetings2!M7))","v":{"$error":"#VALUE!"}},{"$f":"IF(Meetings2!N7=\"\",\"\",getAddress(Meetings2!N7))","v":{"$error":"#VALUE!"}},"",3,{"$nulls":20},8,"",{"$f":"IF(Race!N7<>\"\",Race!C7,\"\")","v":""},{"$f":"IF(AX7<>\"\",Race!N7,\"\")","v":""},{"$f":"IF(AX7<>\"\",Race!I7,\"\")","v":""},{"$f":"IF(Form!I10<>\"\",LEFT(Form!C10,FIND(\"(\",Form!C10)-2),\"\")","v":"Lola Brigida"},null,{"$f":"IF(BA7=\"\",\"\",Form!A10)","v":6},{"$f":"IF($BA7=\"\",\"\",IF(ISNA(VLOOKUP(BC7,Tables!A$5:B$100,2,FALSE)),\"0\",VLOOKUP(BC7,Tables!A$5:B$100,2,FALSE)))","v":3},7,{"$f":"IF($BE7=\"\",\"0\",IF(ISNA(VLOOKUP(BE7,Tables!C$5:D$100,2,FALSE)),\"0\",VLOOKUP(BE7,Tables!C$5:D$100,2,FALSE)))","v":2},{"$f":"IF(BA7=\"\",\"\",Form!F10)","v":54},{"$f":"IF($BA7=\"\",\"\",IF(ISNA(VLOOKUP(BG7,Tables!E$5:F$100,2,FALSE)),\"0\",VLOOKUP(BG7,Tables!E$5:F$100,2,FALSE)))","v":2}," Cd 56.0-0.0"," Cd 56.0",-2,"56.0",{"$f":"IF($BA7=\"\",\"\",IF(ISERROR(BL7),0,IF(ISNA(VLOOKUP(BK7,Tables!G$5:H$100,2,FALSE)),\"0\",VLOOKUP(BK7,Tables!G10:H$100,2,FALSE))))","v":3},{"$f":"IF($BA7=\"\",\"\",Form!G10)","v":1.1000000000000001},6,{"$f":"IF($BA7=\"\",\"\",IF(ISNA(VLOOKUP(BO7,Tables!I$5:J$100,2,FALSE)),\"0\",VLOOKUP(BO7,Tables!I$5:J$100,2,FALSE)))","v":2},{"$f":"IF($BA7=\"\",\"\",Form!H10)","v":9.1},7,{"$f":"IF($BA7=\"\",\"\",IF(ISNA(VLOOKUP(BR7,Tables!K$5:L$100,2,FALSE)),\"0\",VLOOKUP(BR7,Tables!K$5:L$100,2,FALSE)))","v":2},{"$f":"IF($BA7=\"\",\"\",Form!I10)","v":30.3},7,{"$f":"IF($BA7=\"\",\"\",IF(ISNA(VLOOKUP(BU7,Tables!M$5:N$100,2,FALSE)),\"0\",VLOOKUP(BU7,Tables!M$5:N$100,2,FALSE)))","v":2},{"$f":"IF($BA7=\"\",\"\",INDEX(Race!$D$1:$P$100,MATCH($BA7,Race!$C$1:$C$100,0)+0,9))","v":"DWT"},"D","Y",{"$f":"IF($BA7=\"\",\"\",IF(ISNA(VLOOKUP(BY7,Tables!O$5:P$100,2,FALSE)),0,VLOOKUP(BY7,Tables!O$5:P$100,2,FALSE)))","v":5},"T","Y",{"$f":"IF($BA7=\"\",\"\",IF(ISNA(VLOOKUP(CB7,Tables!Q$5:R$100,2,FALSE)),0,VLOOKUP(CB7,Tables!Q$5:R$100,2,FALSE)))","v":5},"","N",{"$f":"IF($BA7=\"\",\"\",IF(ISNA(VLOOKUP(CE7,Tables!S$5:T$100,2,FALSE)),0,VLOOKUP(CE7,Tables!S$5:T$100,2,FALSE)))","v":0},"","N",{"$f":"IF($BA7=\"\",\"\",IF(ISNA(VLOOKUP(CH7,Tables!U$5:V$100,2,FALSE)),0,VLOOKUP(CH7,Tables!U$5:V$100,2,FALSE)))","v":0},"2010-11-27",5,5,{"$f":"IF($BA7=\"\",\"\",IF(ISERROR(CL7),0,IF(ISNA(VLOOKUP(CL7,Tables!W$5:X$100,2,FALSE)),\"0\",VLOOKUP(CL7,Tables!W$5:X$100,2,FALSE))))","v":5},"2010-11-18",14,14,{"$f":"IF($BA7=\"\",\"\",IF(ISERROR(CP7),0,IF(ISNA(VLOOKUP(CP7,Tables!Y$5:Z$100,2,FALSE)),\"0\",VLOOKUP(CP7,Tables!Y$5:Z$100,2,FALSE))))","v":5},"2010-11-04",28,28,{"$f":"IF($BA7=\"\",\"\",IF(ISERROR(CT7),0,IF(ISNA(VLOOKUP(CT7,Tables!AA$5:AB$100,2,FALSE)),\"0\",VLOOKUP(CT7,Tables!AA$5:AB$100,2,FALSE))))","v":3},6000,{"$f":"IF(CV7=\"\",\"\",(Form!$H$3-CV7)/CV7*100)","v":66.666666666666657},1,{"$f":"IF($BA7=\"\",\"\",IF(ISERROR(CX7),0,IF(ISNA(VLOOKUP(CX7,Tables!AC$5:AD$100,2,FALSE)),\"0\",VLOOKUP(CX7,Tables!AC$5:AD$100,2,FALSE))))","v":-5},"1-11 4.5L","1",1,{"$f":"IF($BA7=\"\",\"\",IF(ISERROR(DB7),0,IF(ISNA(VLOOKUP(DB7,Tables!AE$5:AF$100,2,FALSE)),\"0\",VLOOKUP(DB7,Tables!AE$5:AF$100,2,FALSE))))","v":7},"4.5L","4.5",4.5,0,0,{"$f":"IF($BA7=\"\",\"\",IF(ISERROR(DH7),0,IF(ISNA(VLOOKUP(DG7,Tables!AG$5:AH$100,2,FALSE)),\"0\",VLOOKUP(DG7,Tables!AG$5:AH$100,2,FALSE))))","v":7},"6-11 4.4L","6",6,{"$f":"IF($BA7=\"\",\"\",IF(ISERROR(DL7),0,IF(ISNA(VLOOKUP(DL7,Tables!AI$5:AJ$100,2,FALSE)),\"0\",VLOOKUP(DL7,Tables!AI$5:AJ$100,2,FALSE))))","v":0},"4.4L","4.4",4.5,4.5,4.5,{"$f":"IF($BA7=\"\",\"\",IF(ISERROR(DR7),0,IF(ISNA(VLOOKUP(DQ7,Tables!AK$5:AL$100,2,FALSE)),\"0\",VLOOKUP(DQ7,Tables!AK$5:AL$100,2,FALSE))))","v":2},"1-9 0.5L","1",1,{"$f":"IF($BA7=\"\",\"\",IF(ISERROR(DV7),0,IF(ISNA(VLOOKUP(DV7,Tables!AM$5:AN$100,2,FALSE)),\"0\",VLOOKUP(DV7,Tables!AM$5:AN$100,2,FALSE))))","v":7},"0.5L","0.5",0.5,0,0,{"$f":"IF($BC7=\"\",\"\",IF(ISERROR(EB7),0,IF(ISNA(VLOOKUP(EA7,Tables!AO$5:AP$100,2,FALSE)),\"0\",VLOOKUP(EA7,Tables!AO$5:AP$100,2,FALSE))))","v":7},96,"96",96,{"$f":"IF($EE7=\"\",\"0\",IF(ISNA(VLOOKUP(EF7,Tables!AQ$5:AR$100,2,FALSE)),\"0\",VLOOKUP(EF7,Tables!AQ$5:AR$100,2,FALSE)))","v":3},{"$f":"IF(BA7=\"\",\"\",IF(MainSheet!D14=\"Scratched\",\"\",BD7+BF7+BH7+BM7+BP7+BS7+BV7+BZ7+CC7+CF7+CI7+CM7+CQ7+CU7+CY7+DC7+DI7+DM7+DS7+DW7+EC7+EG7))","v":67}]
[{"$f":"IF(Meetings1!A8=\"\",\"\",IF(Meetings1!A8=\"END\",\"END\",IF(Meetings1!E8=\"\",\"\",getAddress(Meetings1!E8))))","v":"http://formguide.cyberhorse.com.au/index.php/Form/form.html?formdate=2010-12-02&track=G'long&raceno=6"},{"$nulls":11},{"$f":"IF(ISNA(VLOOKUP(N8,RaceList!$J$3:$L$19,3,FALSE)),\"\",VLOOKUP(N8,RaceList!$J$3:$L$19,3,FALSE))","v":"Rockhampton"},{"$f":"IF(Meetings2!$B8=\"\",\"\",Meetings2!$B8)","v":"ROCKHAMPTON (QR)"},{"$f":"IF(Meetings2!D8=\"\",\"\",getAddress(Meetings2!D8))","v":"http://www.tabonline.com.au/2010/12/02/QR01.html"},{"$f":"IF(Meetings2!E8=\"\",\"\",getAddress(Meetings2!E8))","v":"http://www.tabonline.com.au/2010/12/02/QR02.html"},{"$f":"IF(Meetings2!F8=\"\",\"\",getAddress(Meetings2!F8))","v":"http://www.tabonline.com.au/2010/12/02/QR03.html"},{"$f":"IF(Meetings2!G8=\"\",\"\",getAddress(Meetings2!G8))","v":"http://www.tabonline.com.au/2010/12/02/QR04.html"},{"$f":"IF(Meetings2!H8=\"\",\"\",getAddress(Meetings2!H8))","v":"http://www.tabonline.com.au/2010/12/02/QR05.html"},{"$f":"IF(Meetings2!I8=\"\",\"\",getAddress(Meetings2!I8))","v":"http://www.tabonline.com.au/2010/12/02/QR06.html"},{"$f":"IF(Meetings2!J8=\"\",\"\",getAddress(Meetings2!J8))","v":""},{"$f":"IF(Meetings2!K8=\"\",\"\",getAddress(Meetings2!K8))","v":""},{"$f":"IF(Meetings2!L8=\"\",\"\",getAddress(Meetings2!L8))","v":""},{"$f":"IF(Meetings2!M8=\"\",\"\",getAddress(Meetings2!M8))","v":""},{"$f":"IF(Meetings2!N8=\"\",\"\",getAddress(Meetings2!N8))","v":""},"",4,{"$nulls":20},8,"",{"$f":"IF(Race!N8<>\"\",Race!C8,\"\")","v":""},{"$f":"IF(AX8<>\"\",Race!N8,\"\")","v":""},{"$f":"IF(AX8<>\"\",Race!I8,\"\")","v":""},{"$f":"IF(Form!I11<>\"\",LEFT(Form!C11,FIND(\"(\",Form!C11)-2),\"\")","v":"Zenacity"},null,{"$f":"IF(BA8=\"\",\"\",Form!A11)","v":7},{"$f":"IF($BA8=\"\",\"\",IF(ISNA(VLOOKUP(BC8,Tables!A$5:B$100,2,FALSE)),\"0\",VLOOKUP(BC8,Tables!A$5:B$100,2,FALSE)))","v":2},1,{"$f":"IF($BE8=\"\",\"0\",IF(ISNA(VLOOKUP(BE8,Tables!C$5:D$100,2,FALSE)),\"0\",VLOOKUP(BE8,Tables!C$5:D$100,2,FALSE)))","v":5},{"$f":"IF(BA8=\"\",\"\",Form!F11)","v":54},{"$f":"IF($BA8=\"\",\"\",IF(ISNA(VLOOKUP(BG8,Tables!E$5:F$100,2,FALSE)),\"0\",VLOOKUP(BG8,Tables!E$5:F$100,2,FALSE)))","v":2}," Cd 54.0-0.0"," Cd 54.0",0,"54.0",{"$f":"IF($BA8=\"\",\"\",IF(ISERROR(BL8),0,IF(ISNA(VLOOKUP(BK8,Tables!G$5:H$100,2,FALSE)),\"0\",VLOOKUP(BK8,Tables!G11:H$100,2,FALSE))))","v":3},{"$f":"IF($BA8=\"\",\"\",Form!G11)","v":0.9},8,{"$f":"IF($BA8=\"\",\"\",IF(ISNA(VLOOKUP(BO8,Tables!I$5:J$100,2,FALSE)),\"0\",VLOOKUP(BO8,Tables!I$5:J$100,2,FALSE)))","v":2},{"$f":"IF($BA8=\"\",\"\",Form!H11)","v":8.6},8,{"$f":"IF($BA8=\"\",\"\",IF(ISNA(VLOOKUP(BR8,Tables!K$5:L$100,2,FALSE)),\"0\",VLOOKUP(BR8,Tables!K$5:L$100,2,FALSE)))","v":2},{"$f":"IF($BA8=\"\",\"\",Form!I11)","v":28.6},8,{"$f":"IF($BA8=\"\",\"\",IF(ISNA(VLOOKUP(BU8,Tables!M$5:N$100,2,FALSE)),\"0\",VLOOKUP(BU8,Tables!M$5:N$100,2,FALSE)))","v":2},{"$f":"IF($BA8=\"\",\"\",INDEX(Race!$D$1:$P$100,MATCH($BA8,Race!$C$1:$C$100,0)+0,9))","v":0},"","N",{"$f":"IF($BA8=\"\",\"\",IF(ISNA(VLOOKUP(BY8,Tables!O$5:P$100,2,FALSE)),0,VLOOKUP(BY8,Tables!O$5:P$100,2,FALSE)))","v":0},"","N",{"$f":"IF($BA8=\"\",\"\",IF(ISNA(VLOOKUP(CB8,Tables!Q$5:R$100,2,FALSE)),0,VLOOKUP(CB8,Tables!Q$5:R$100,2,FALSE)))","v":0},"","N",{"$f":"IF($BA8=\"\",\"\",IF(ISNA(VLOOKUP(CE8,Tables!S$5:T$100,2,FALSE)),0,VLOOKUP(CE8,Tables!S$5:T$100,2,FALSE)))","v":0},"","N",{"$f":"IF($BA8=\"\",\"\",IF(ISNA(VLOOKUP(CH8,Tables!U$5:V$100,2,FALSE)),0,VLOOKUP(CH8,Tables!U$5:V$100,2,FALSE)))","v":0},"2010-11-18",14,14,{"$f":"IF($BA8=\"\",\"\",IF(ISERROR(CL8),0,IF(ISNA(VLOOKUP(CL8,Tables!W$5:X$100,2,FALSE)),\"0\",VLOOKUP(CL8,Tables!W$5:X$100,2,FALSE))))","v":3},"2010-11-02",30,30,{"$f":"IF($BA8=\"\",\"\",IF(ISERROR(CP8),0,IF(ISNA(VLOOKUP(CP8,Tables!Y$5:Z$100,2,FALSE)),\"0\",VLOOKUP(CP8,Tables!Y$5:Z$100,2,FALSE))))","v":0},"2010-06-01",184,0,{"$f":"IF($BA8=\"\",\"\",IF(ISERROR(CT8),0,IF(ISNA(VLOOKUP(CT8,Tables!AA$5:AB$100,2,FALSE)),\"0\",VLOOKUP(CT8,Tables!AA$5:AB$100,2,FALSE))))","v":0},12000,{"$f":"IF(CV8=\"\",\"\",(Form!$H$3-CV8)/CV8*100)","v":-16.666666666666664},2,{"$f":"IF($BA8=\"\",\"\",IF(ISERROR(CX8),0,IF(ISNA(VLOOKUP(CX8,Tables!AC$5:AD$100,2,FALSE)),\"0\",VLOOKUP(CX8,Tables!AC$5:AD$100,2,FALSE))))","v":10},"11-11 7.5L","11",0,{"$f":"IF($BA8=\"\",\"\",IF(ISERROR(DB8),0,IF(ISNA(VLOOKUP(DB8,Tables!AE$5:AF$100,2,FALSE)),\"0\",VLOOKUP(DB8,Tables!AE$5:AF$100,2,FALSE))))","v":0},"7.5L","7.5",7.5,7.5,7.5,{"$f":"IF($BA8=\"\",\"\",IF(ISERROR(DH8),0,IF(ISNA(VLOOKUP(DG8,Tables!AG$5:AH$100,2,FALSE)),\"0\",VLOOKUP(DG8,Tables!AG$5:AH$100,2,FALSE))))","v":0},"3-5 3.7L","3",3,{"$f":"IF($BA8=\"\",\"\",IF(ISERROR(DL8),0,IF(ISNA(VLOOKUP(DL8,Tables!AI$5:AJ$100,2,FALSE)),\"0\",VLOOKUP(DL8,Tables!AI$5:AJ$100,2,FALSE))))","v":3},"3.7L","3.7",3.5,3.5,3.5,{"$f":"IF($BA8=\"\",\"\",IF(ISERROR(DR8),0,IF(ISNA(VLOOKUP(DQ8,Tables!AK$5:AL$100,2,FALSE)),\"0\",VLOOKUP(DQ8,Tables!AK$5:AL$100,2,FALSE))))","v":2},"9-13 8.4L","9",9,{"$f":"IF($BA8=\"\",\"\",IF(ISERROR(DV8),0,IF(ISNA(VLOOKUP(DV8,Tables!AM$5:AN$100,2,FALSE)),\"0\",VLOOKUP(DV8,Tables!AM$5:AN$100,2,FALSE))))","v":0},"8.4L","8.4",8.5,8.5,8.5,{"$f":"IF($BC8=\"\",\"\",IF(ISERROR(EB8),0,IF(ISNA(VLOOKUP(EA8,Tables!AO$5:AP$100,2,FALSE)),\"0\",VLOOKUP(EA8,Tables!AO$5:AP$100,2,FALSE))))","v":0},92,"92",92,{"$f":"IF($EE8=\"\",\"0\",IF(ISNA(VLOOKUP(EF8,Tables!AQ$5:AR$100,2,FALSE)),\"0\",VLOOKUP(EF8,Tables!AQ$5:AR$100,2,FALSE)))","v":0},{"$f":"IF(BA8=\"\",\"\",IF(MainSheet!D15=\"Scratched\",\"\",BD8+BF8+BH8+BM8+BP8+BS8+BV8+BZ8+CC8+CF8+CI8+CM8+CQ8+CU8+CY8+DC8+DI8+DM8+DS8+DW8+EC8+EG8))","v":36}]
[{"$f":"IF(Meetings1!A9=\"\",\"\",IF(Meetings1!A9=\"END\",\"END\",IF(Meetings1!E9=\"\",\"\",getAddress(Meetings1!E9))))","v":"http://formguide.cyberhorse.com.au/index.php/Form/form.html?formdate=2010-12-02&track=G'long&raceno=7"},{"$nulls":11},{"$f":"IF(ISNA(VLOOKUP(N9,RaceList!$J$3:$L$19,3,FALSE)),\"\",VLOOKUP(N9,RaceList!$J$3:$L$19,3,FALSE))","v":""},{"$f":"IF(Meetings2!$B9=\"\",\"\",Meetings2!$B9)","v":"HAWKESBURY (NR)"},{"$f":"IF(Meetings2!D9=\"\",\"\",getAddress(Meetings2!D9))","v":"http://www.tabonline.com.au/2010/12/02/NR01.html"},{"$f":"IF(Meetings2!E9=\"\",\"\",getAddress(Meetings2!E9))","v":"http://www.tabonline.com.au/2010/12/02/NR02.html"},{"$f":"IF(Meetings2!F9=\"\",\"\",getAddress(Meetings2!F9))","v":"http://www.tabonline.com.au/2010/12/02/NR03.html"},{"$f":"IF(Meetings2!G9=\"\",\"\",getAddress(Meetings2!G9))","v":"http://www.tabonline.com.au/2010/12/02/NR04.html"},{"$f":"IF(Meetings2!H9=\"\",\"\",getAddress(Meetings2!H9))","v":"http://www.tabonline.com.au/2010/12/02/NR05.html"},{"$f":"IF(Meetings2!I9=\"\",\"\",getAddress(Meetings2!I9))","v":"http://www.tabonline.com.au/2010/12/02/NR06.html"},{"$f":"IF(Meetings2!J9=\"\",\"\",getAddress(Meetings2!J9))","v":"http://www.tabonline.com.au/2010/12/02/NR07.html"},{"$f":"IF(Meetings2!K9=\"\",\"\",getAddress(Meetings2!K9))","v":"http://www.tabonline.com.au/2010/12/02/NR08.html"},{"$f":"IF(Meetings2!L9=\"\",\"\",getAddress(Meetings2!L9))","v":""},{"$f":"IF(Meetings2!M9=\"\",\"\",getAddress(Meetings2!M9))","v":""},{"$f":"IF(Meetings2!N9=\"\",\"\",getAddress(Meetings2!N9))","v":""},"",5,{"$nulls":20},8,"",{"$f":"IF(Race!N9<>\"\",Race!C9,\"\")","v":""},{"$f":"IF(AX9<>\"\",Race!N9,\"\")","v":""},{"$f":"IF(AX9<>\"\",Race!I9,\"\")","v":""},{"$f":"IF(Form!I12<>\"\",LEFT(Form!C12,FIND(\"(\",Form!C12)-2),\"\")","v":"Dandy Kat"},null,{"$f":"IF(BA9=\"\",\"\",Form!A12)","v":8},{"$f":"IF($BA9=\"\",\"\",IF(ISNA(VLOOKUP(BC9,Tables!A$5:B$100,2,FALSE)),\"0\",VLOOKUP(BC9,Tables!A$5:B$100,2,FALSE)))","v":2},6,{"$f":"IF($BE9=\"\",\"0\",IF(ISNA(VLOOKUP(BE9,Tables!C$5:D$100,2,FALSE)),\"0\",VLOOKUP(BE9,Tables!C$5:D$100,2,FALSE)))","v":3},{"$f":"IF(BA9=\"\",\"\",Form!F12)","v":54},{"$f":"IF($BA9=\"\",\"\",IF(ISNA(VLOOKUP(BG9,Tables!E$5:F$100,2,FALSE)),\"0\",VLOOKUP(BG9,Tables!E$5:F$100,2,FALSE)))","v":2}," Cd 58.5-0.0"," Cd 58.5",-4.5,"58.5",{"$f":"IF($BA9=\"\",\"\",IF(ISERROR(BL9),0,IF(ISNA(VLOOKUP(BK9,Tables!G$5:H$100,2,FALSE)),\"0\",VLOOKUP(BK9,Tables!G12:H$100,2,FALSE))))","v":5},{"$f":"IF($BA9=\"\",\"\",Form!G12)","v":1.3},4,{"$f":"IF($BA9=\"\",\"\",IF(ISNA(VLOOKUP(BO9,Tables!I$5:J$100,2,FALSE)),\"0\",VLOOKUP(BO9,Tables!I$5:J$100,2,FALSE)))","v":3},{"$f":"IF($BA9=\"\",\"\",Form!H12)","v":11.8},5,{"$f":"IF($BA9=\"\",\"\",IF(ISNA(VLOOKUP(BR9,Tables!K$5:L$100,2,FALSE)),\"0\",VLOOKUP(BR9,Tables!K$5:L$100,2,FALSE)))","v":3},{"$f":"IF($BA9=\"\",\"\",Form!I12)","v":47.1},2,{"$f":"IF($BA9=\"\",\"\",IF(ISNA(VLOOKUP(BU9,Tables!M$5:N$100,2,FALSE)),\"0\",VLOOKUP(BU9,Tables!M$5:N$100,2,FALSE)))","v":6},{"$f":"IF($BA9=\"\",\"\",INDEX(Race!$D$1:$P$100,MATCH($BA9,Race!$C$1:$C$100,0)+0,9))","v":"TC"},"","N",{"$f":"IF($BA9=\"\",\"\",IF(ISNA(VLOOKUP(BY9,Tables!O$5:P$100,2,FALSE)),0,VLOOKUP(BY9,Tables!O$5:P$100,2,FALSE)))","v":0},"T","Y",{"$f":"IF($BA9=\"\",\"\",IF(ISNA(VLOOKUP(CB9,Tables!Q$5:R$100,2,FALSE)),0,VLOOKUP(CB9,Tables!Q$5:R$100,2,FALSE)))","v":5},"C","Y",{"$f":"IF($BA9=\"\",\"\",IF(ISNA(VLOOKUP(CE9,Tables!S$5:T$100,2,FALSE)),0,VLOOKUP(CE9,Tables!S$5:T$100,2,FALSE)))","v":8},"","N",{"$f":"IF($BA9=\"\",\"\",IF(ISNA(VLOOKUP(CH9,Tables!U$5:V$100,2,FALSE)),0,VLOOKUP(CH9,Tables!U$5:V$100,2,FALSE)))","v":0},"2010-11-06",26,26,{"$f":"IF($BA9=\"\",\"\",IF(ISERROR(CL9),0,IF(ISNA(VLOOKUP(CL9,Tables!W$5:X$100,2,FALSE)),\"0\",VLOOKUP(CL9,Tables!W$5:X$100,2,FALSE))))","v":0},"2010-10-21",42,42,{"$f":"IF($BA9=\"\",\"\",IF(ISERROR(CP9),0,IF(ISNA(VLOOKUP(CP9,Tables!Y$5:Z$100,2,FALSE)),\"0\",VLOOKUP(CP9,Tables!Y$5:Z$100,2,FALSE))))","v":0},"2010-10-14",49,49,{"$f":"IF($BA9=\"\",\"\",IF(ISERROR(CT9),0,IF(ISNA(VLOOKUP(CT9,Tables!AA$5:AB$100,2,FALSE)),\"0\",VLOOKUP(CT9,Tables!AA$5:AB$100,2,FALSE))))","v":0},12000,{"$f":"IF(CV9=\"\",\"\",(Form!$H$3-CV9)/CV9*100)","v":-16.666666666666664},2,{"$f":"IF($BA9=\"\",\"\",IF(ISERROR(CX9),0,IF(ISNA(VLOOKUP(CX9,Tables!AC$5:AD$100,2,FALSE)),\"0\",VLOOKUP(CX9,Tables!AC$5:AD$100,2,FALSE))))","v":10},"7-8 9.9L","7",7,{"$f":"IF($BA9=\"\",\"\",IF(ISERROR(DB9),0,IF(ISNA(VLOOKUP(DB9,Tables!AE$5:AF$100,2,FALSE)),\"0\",VLOOKUP(DB9,Tables!AE$5:AF$100,2,FALSE))))","v":0},"9.9L","9.9",10,10,10,{"$f":"IF($BA9=\"\",\"\",IF(ISERROR(DH9),0,IF(ISNA(VLOOKUP(DG9,Tables!AG$5:AH$100,2,FALSE)),\"0\",VLOOKUP(DG9,Tables!AG$5:AH$100,2,FALSE))))","v":0},"5-7 6.4L","5",5,{"$f":"IF($BA9=\"\",\"\",IF(ISERROR(DL9),0,IF(ISNA(VLOOKUP(DL9,Tables!AI$5:AJ$100,2,FALSE)),\"0\",VLOOKUP(DL9,Tables!AI$5:AJ$100,2,FALSE))))","v":2},"6.4L","6.4",6.5,6.5,6.5,{"$f":"IF($BA9=\"\",\"\",IF(ISERROR(DR9),0,IF(ISNA(VLOOKUP(DQ9,Tables!AK$5:AL$100,2,FALSE)),\"0\",VLOOKUP(DQ9,Tables!AK$5:AL$100,2,FALSE))))","v":0},"4-10 3.0L","4",4,{"$f":"IF($BA9=\"\",\"\",IF(ISERROR(DV9),0,IF(ISNA(VLOOKUP(DV9,Tables!AM$5:AN$100,2,FALSE)),\"0\",VLOOKUP(DV9,Tables!AM$5:AN$100,2,FALSE))))","v":2},"3.0L","3.0",3,3,3,{"$f":"IF($BC9=\"\",\"\",IF(ISERROR(EB9),0,IF(ISNA(VLOOKUP(EA9,Tables!AO$5:AP$100,2,FALSE)),\"0\",VLOOKUP(EA9,Tables!AO$5:AP$100,2,FALSE))))","v":3},94,"94",94,{"$f":"IF($EE9=\"\",\"0\",IF(ISNA(VLOOKUP(EF9,Tables!AQ$5:AR$100,2,FALSE)),\"0\",VLOOKUP(EF9,Tables!AQ$5:AR$100,2,FALSE)))","v":2},{"$f":"IF(BA9=\"\",\"\",IF(MainSheet!D16=\"Scratched\",\"\",BD9+BF9+BH9+BM9+BP9+BS9+BV9+BZ9+CC9+CF9+CI9+CM9+CQ9+CU9+CY9+DC9+DI9+DM9+DS9+DW9+EC9+EG9))","v":56}]
[{"$f":"IF(Meetings1!A10=\"\",\"\",IF(Meetings1!A10=\"END\",\"END\",IF(Meetings1!E10=\"\",\"\",getAddress(Meetings1!E10))))","v":"http://formguide.cyberhorse.com.au/index.php/Form/form.html?formdate=2010-12-02&track=G'long&raceno=8"},{"$nulls":11},{"$f":"IF(ISNA(VLOOKUP(N10,RaceList!$J$3:$L$19,3,FALSE)),\"\",VLOOKUP(N10,RaceList!$J$3:$L$19,3,FALSE))","v":""},{"$f":"IF(Meetings2!$B10=\"\",\"\",Meetings2!$B10)","v":"GEELONG (VR)"},{"$f":"IF(Meetings2!D10=\"\",\"\",getAddress(Meetings2!D10))","v":"http://www.tabonline.com.au/2010/12/02/VR01.html"},{"$f":"IF(Meetings2!E10=\"\",\"\",getAddress(Meetings2!E10))","v":"http://www.tabonline.com.au/2010/12/02/VR02.html"},{"$f":"IF(Meetings2!F10=\"\",\"\",getAddress(Meetings2!F10))","v":"http://www.tabonline.com.au/2010/12/02/VR03.html"},{"$f":"IF(Meetings2!G10=\"\",\"\",getAddress(Meetings2!G10))","v":"http://www.tabonline.com.au/2010/12/02/VR04.html"},{"$f":"IF(Meetings2!H10=\"\",\"\",getAddress(Meetings2!H10))","v":"http://www.tabonline.com.au/2010/12/02/VR05.html"},{"$f":"IF(Meetings2!I10=\"\",\"\",getAddress(Meetings2!I10))","v":"http://www.tabonline.com.au/2010/12/02/VR06.html"},{"$f":"IF(Meetings2!J10=\"\",\"\",getAddress(Meetings2!J10))","v":"http://www.tabonline.com.au/2010/12/02/VR07.html"},{"$f":"IF(Meetings2!K10=\"\",\"\",getAddress(Meetings2!K10))","v":"http://www.tabonline.com.au/2010/12/02/VR08.html"},{"$f":"IF(Meetings2!L10=\"\",\"\",getAddress(Meetings2!L10))","v":""},{"$f":"IF(Meetings2!M10=\"\",\"\",getAddress(Meetings2!M10))","v":""},{"$f":"IF(Meetings2!N10=\"\",\"\",getAddress(Meetings2!N10))","v":""},"",6,{"$nulls":20},8,"",{"$f":"IF(Race!N10<>\"\",Race!C10,\"\")","v":""},{"$f":"IF(AX10<>\"\",Race!N10,\"\")","v":""},{"$f":"IF(AX10<>\"\",Race!I10,\"\")","v":""},{"$f":"IF(Form!I13<>\"\",LEFT(Form!C13,FIND(\"(\",Form!C13)-2),\"\")","v":"Fu Min Bu"},null,{"$f":"IF(BA10=\"\",\"\",Form!A13)","v":9},{"$f":"IF($BA10=\"\",\"\",IF(ISNA(VLOOKUP(BC10,Tables!A$5:B$100,2,FALSE)),\"0\",VLOOKUP(BC10,Tables!A$5:B$100,2,FALSE)))","v":2},9,{"$f":"IF($BE10=\"\",\"0\",IF(ISNA(VLOOKUP(BE10,Tables!C$5:D$100,2,FALSE)),\"0\",VLOOKUP(BE10,Tables!C$5:D$100,2,FALSE)))","v":2},{"$f":"IF(BA10=\"\",\"\",Form!F13)","v":54},{"$f":"IF($BA10=\"\",\"\",IF(ISNA(VLOOKUP(BG10,Tables!E$5:F$100,2,FALSE)),\"0\",VLOOKUP(BG10,Tables!E$5:F$100,2,FALSE)))","v":2}," Cd 53.5--2.0"," Cd 53.5",0.5,"53.5",{"$f":"IF($BA10=\"\",\"\",IF(ISERROR(BL10),0,IF(ISNA(VLOOKUP(BK10,Tables!G$5:H$100,2,FALSE)),\"0\",VLOOKUP(BK10,Tables!G13:H$100,2,FALSE))))","v":3},{"$f":"IF($BA10=\"\",\"\",Form!G13)","v":0.5},9,{"$f":"IF($BA10=\"\",\"\",IF(ISNA(VLOOKUP(BO10,Tables!I$5:J$100,2,FALSE)),\"0\",VLOOKUP(BO10,Tables!I$5:J$100,2,FALSE)))","v":2},{"$f":"IF($BA10=\"\",\"\",Form!H13)","v":5.4},9,{"$f":"IF($BA10=\"\",\"\",IF(ISNA(VLOOKUP(BR10,Tables!K$5:L$100,2,FALSE)),\"0\",VLOOKUP(BR10,Tables!K$5:L$100,2,FALSE)))","v":2},{"$f":"IF($BA10=\"\",\"\",Form!I13)","v":21.6},9,{"$f":"IF($BA10=\"\",\"\",IF(ISNA(VLOOKUP(BU10,Tables!M$5:N$100,2,FALSE)),\"0\",VLOOKUP(BU10,Tables!M$5:N$100,2,FALSE)))","v":2},{"$f":"IF($BA10=\"\",\"\",INDEX(Race!$D$1:$P$100,MATCH($BA10,Race!$C$1:$C$100,0)+0,9))","v":0},"","N",{"$f":"IF($BA10=\"\",\"\",IF(ISNA(VLOOKUP(BY10,Tables!O$5:P$100,2,FALSE)),0,VLOOKUP(BY10,Tables!O$5:P$100,2,FALSE)))","v":0},"","N",{"$f":"IF($BA10=\"\",\"\",IF(ISNA(VLOOKUP(CB10,Tables!Q$5:R$100,2,FALSE)),0,VLOOKUP(CB10,Tables!Q$5:R$100,2,FALSE)))","v":0},"","N",{"$f":"IF($BA10=\"\",\"\",IF(ISNA(VLOOKUP(CE10,Tables!S$5:T$100,2,FALSE)),0,VLOOKUP(CE10,Tables!S$5:T$100,2,FALSE)))","v":0},"","N",{"$f":"IF($BA10=\"\",\"\",IF(ISNA(VLOOKUP(CH10,Tables!U$5:V$100,2,FALSE)),0,VLOOKUP(CH10,Tables!U$5:V$100,2,FALSE)))","v":0},"2010-11-02",30,30,{"$f":"IF($BA10=\"\",\"\",IF(ISERROR(CL10),0,IF(ISNA(VLOOKUP(CL10,Tables!W$5:X$100,2,FALSE)),\"0\",VLOOKUP(CL10,Tables!W$5:X$100,2,FALSE))))","v":0},"2010-10-02",61,61,{"$f":"IF($BA10=\"\",\"\",IF(ISERROR(CP10),0,IF(ISNA(VLOOKUP(CP10,Tables!Y$5:Z$100,2,FALSE)),\"0\",VLOOKUP(CP10,Tables!Y$5:Z$100,2,FALSE))))","v":0},"2010-09-25",68,68,{"$f":"IF($BA10=\"\",\"\",IF(ISERROR(CT10),0,IF(ISNA(VLOOKUP(CT10,Tables!AA$5:AB$100,2,FALSE)),\"0\",VLOOKUP(CT10,Tables!AA$5:AB$100,2,FALSE))))","v":0},4000,{"$f":"IF(CV10=\"\",\"\",(Form!$H$3-CV10)/CV10*100)","v":150},1,{"$f":"IF($BA10=\"\",\"\",IF(ISERROR(CX10),0,IF(ISNA(VLOOKUP(CX10,Tables!AC$5:AD$100,2,FALSE)),\"0\",VLOOKUP(CX10,Tables!AC$5:AD$100,2,FALSE))))","v":-5},"6-8 4.0L","6",6,{"$f":"IF($BA10=\"\",\"\",IF(ISERROR(DB10),0,IF(ISNA(VLOOKUP(DB10,Tables!AE$5:AF$100,2,FALSE)),\"0\",VLOOKUP(DB10,Tables!AE$5:AF$100,2,FALSE))))","v":0},"4.0L","4.0",4,4,4,{"$f":"IF($BA10=\"\",\"\",IF(ISERROR(DH10),0,IF(ISNA(VLOOKUP(DG10,Tables!AG$5:AH$100,2,FALSE)),\"0\",VLOOKUP(DG10,Tables!AG$5:AH$100,2,FALSE))))","v":2},"6-7 4.8L","6",6,{"$f":"IF($BA10=\"\",\"\",IF(ISERROR(DL10),0,IF(ISNA(VLOOKUP(DL10,Tables!AI$5:AJ$100,2,FALSE)),\"0\",VLOOKUP(DL10,Tables!AI$5:AJ$100,2,FALSE))))","v":0},"4.8L","4.8",5,5,5,{"$f":"IF($BA10=\"\",\"\",IF(ISERROR(DR10),0,IF(ISNA(VLOOKUP(DQ10,Tables!AK$5:AL$100,2,FALSE)),\"0\",VLOOKUP(DQ10,Tables!AK$5:AL$100,2,FALSE))))","v":2},"3-12 1.8L","3",3,{"$f":"IF($BA10=\"\",\"\",IF(ISERROR(DV10),0,IF(ISNA(VLOOKUP(DV10,Tables!AM$5:AN$100,2,FALSE)),\"0\",VLOOKUP(DV10,Tables!AM$5:AN$100,2,FALSE))))","v":3},"1.8L","1.8",2,2,2,{"$f":"IF($BC10=\"\",\"\",IF(ISERROR(EB10),0,IF(ISNA(VLOOKUP(EA10,Tables!AO$5:AP$100,2,FALSE)),\"0\",VLOOKUP(EA10,Tables!AO$5:AP$100,2,FALSE))))","v":5},96,"96",96,{"$f":"IF($EE10=\"\",\"0\",IF(ISNA(VLOOKUP(EF10,Tables!AQ$5:AR$100,2,FALSE)),\"0\",VLOOKUP(EF10,Tables!AQ$5:AR$100,2,FALSE)))","v":3},{"$f":"IF(BA10=\"\",\"\",IF(MainSheet!D17=\"Scratched\",\"\",BD10+BF10+BH10+BM10+BP10+BS10+BV10+BZ10+CC10+CF10+CI10+CM10+CQ10+CU10+CY10+DC10+DI10+DM10+DS10+DW10+EC10+EG10))","v":25}]
[{"$f":"IF(Meetings1!A11=\"\",\"\",IF(Meetings1!A11=\"END\",\"END\",IF(Meetings1!E11=\"\",\"\",getAddress(Meetings1!E11))))","v":""},{"$nulls":11},{"$f":"IF(ISNA(VLOOKUP(N11,RaceList!$J$3:$L$19,3,FALSE)),\"\",VLOOKUP(N11,RaceList!$J$3:$L$19,3,FALSE))","v":""},{"$f":"IF(Meetings2!$B11=\"\",\"\",Meetings2!$B11)","v":"PINJARRA (PR)"},{"$f":"IF(Meetings2!D11=\"\",\"\",getAddress(Meetings2!D11))","v":"http://www.tabonline.com.au/2010/12/02/PR01.html"},{"$f":"IF(Meetings2!E11=\"\",\"\",getAddress(Meetings2!E11))","v":"http://www.tabonline.com.au/2010/12/02/PR02.html"},{"$f":"IF(Meetings2!F11=\"\",\"\",getAddress(Meetings2!F11))","v":"http://www.tabonline.com.au/2010/12/02/PR03.html"},{"$f":"IF(Meetings2!G11=\"\",\"\",getAddress(Meetings2!G11))","v":"http://www.tabonline.com.au/2010/12/02/PR04.html"},{"$f":"IF(Meetings2!H11=\"\",\"\",getAddress(Meetings2!H11))","v":"http://www.tabonline.com.au/2010/12/02/PR05.html"},{"$f":"IF(Meetings2!I11=\"\",\"\",getAddress(Meetings2!I11))","v":"http://www.tabonline.com.au/2010/12/02/PR06.html"},{"$f":"IF(Meetings2!J11=\"\",\"\",getAddress(Meetings2!J11))","v":"http://www.tabonline.com.au/2010/12/02/PR07.html"},{"$f":"IF(Meetings2!K11=\"\",\"\",getAddress(Meetings2!K11))","v":"http://www.tabonline.com.au/2010/12/02/PR08.html"},{"$f":"IF(Meetings2!L11=\"\",\"\",getAddress(Meetings2!L11))","v":""},{"$f":"IF(Meetings2!M11=\"\",\"\",getAddress(Meetings2!M11))","v":""},{"$f":"IF(Meetings2!N11=\"\",\"\",getAddress(Meetings2!N11))","v":""},"",7,{"$nulls":20},7,"",{"$f":"IF(Race!N11<>\"\",Race!C11,\"\")","v":""},{"$f":"IF(AX11<>\"\",Race!N11,\"\")","v":""},{"$f":"IF(AX11<>\"\",Race!I11,\"\")","v":""},{"$f":"IF(Form!I14<>\"\",LEFT(Form!C14,FIND(\"(\",Form!C14)-2),\"\")","v":""},null,{"$f":"IF(BA11=\"\",\"\",Form!A14)","v":""},{"$f":"IF($BA11=\"\",\"\",IF(ISNA(VLOOKUP(BC11,Tables!A$5:B$100,2,FALSE)),\"0\",VLOOKUP(BC11,Tables!A$5:B$100,2,FALSE)))","v":""},"",{"$f":"IF($BE11=\"\",\"0\",IF(ISNA(VLOOKUP(BE11,Tables!C$5:D$100,2,FALSE)),\"0\",VLOOKUP(BE11,Tables!C$5:D$100,2,FALSE)))","v":"0"},{"$f":"IF(BA11=\"\",\"\",Form!F14)","v":""},{"$f":"IF($BA11=\"\",\"\",IF(ISNA(VLOOKUP(BG11,Tables!E$5:F$100,2,FALSE)),\"0\",VLOOKUP(BG11,Tables!E$5:F$100,2,FALSE)))","v":""},"","","","",{"$f":"IF($BA11=\"\",\"\",IF(ISERROR(BL11),0,IF(ISNA(VLOOKUP(BK11,Tables!G$5:H$100,2,FALSE)),\"0\",VLOOKUP(BK11,Tables!G14:H$100,2,FALSE))))","v":""},{"$f":"IF($BA11=\"\",\"\",Form!G14)","v":""},"",{"$f":"IF($BA11=\"\",\"\",IF(ISNA(VLOOKUP(BO11,Tables!I$5:J$100,2,FALSE)),\"0\",VLOOKUP(BO11,Tables!I$5:J$100,2,FALSE)))","v":""},{"$f":"IF($BA11=\"\",\"\",Form!H14)","v":""},"",{"$f":"IF($BA11=\"\",\"\",IF(ISNA(VLOOKUP(BR11,Tables!K$5:L$100,2,FALSE)),\"0\",VLOOKUP(BR11,Tables!K$5:L$100,2,FALSE)))","v":""},{"$f":"IF($BA11=\"\",\"\",Form!I14)","v":""},"",{"$f":"IF($BA11=\"\",\"\",IF(ISNA(VLOOKUP(BU11,Tables!M$5:N$100,2,FALSE)),\"0\",VLOOKUP(BU11,Tables!M$5:N$100,2,FALSE)))","v":""},{"$f":"IF($BA11=\"\",\"\",INDEX(Race!$D$1:$P$100,MATCH($BA11,Race!$C$1:$C$100,0)+0,9))","v":""},"","N",{"$f":"IF($BA11=\"\",\"\",IF(ISNA(VLOOKUP(BY11,Tables!O$5:P$100,2,FALSE)),0,VLOOKUP(BY11,Tables!O$5:P$100,2,FALSE)))","v":""},"","N",{"$f":"IF($BA11=\"\",\"\",IF(ISNA(VLOOKUP(CB11,Tables!Q$5:R$100,2,FALSE)),0,VLOOKUP(CB11,Tables!Q$5:R$100,2,FALSE)))","v":""},"","N",{"$f":"IF($BA11=\"\",\"\",IF(ISNA(VLOOKUP(CE11,Tables!S$5:T$100,2,FALSE)),0,VLOOKUP(CE11,Tables!S$5:T$100,2,FALSE)))","v":""},"","N",{"$f":"IF($BA11=\"\",\"\",IF(ISNA(VLOOKUP(CH11,Tables!U$5:V$100,2,FALSE)),0,VLOOKUP(CH11,Tables!U$5:V$100,2,FALSE)))","v":""},"","",0,{"$f":"IF($BA11=\"\",\"\",IF(ISERROR(CL11),0,IF(ISNA(VLOOKUP(CL11,Tables!W$5:X$100,2,FALSE)),\"0\",VLOOKUP(CL11,Tables!W$5:X$100,2,FALSE))))","v":""},"","",0,{"$f":"IF($BA11=\"\",\"\",IF(ISERROR(CP11),0,IF(ISNA(VLOOKUP(CP11,Tables!Y$5:Z$100,2,FALSE)),\"0\",VLOOKUP(CP11,Tables!Y$5:Z$100,2,FALSE))))","v":""},"","",0,{"$f":"IF($BA11=\"\",\"\",IF(ISERROR(CT11),0,IF(ISNA(VLOOKUP(CT11,Tables!AA$5:AB$100,2,FALSE)),\"0\",VLOOKUP(CT11,Tables!AA$5:AB$100,2,FALSE))))","v":""},"",{"$f":"IF(CV11=\"\",\"\",(Form!$H$3-CV11)/CV11*100)","v":""},"",{"$f":"IF($BA11=\"\",\"\",IF(ISERROR(CX11),0,IF(ISNA(VLOOKUP(CX11,Tables!AC$5:AD$100,2,FALSE)),\"0\",VLOOKUP(CX11,Tables!AC$5:AD$100,2,FALSE))))","v":""},"","","",{"$f":"IF($BA11=\"\",\"\",IF(ISERROR(DB11),0,IF(ISNA(VLOOKUP(DB11,Tables!AE$5:AF$100,2,FALSE)),\"0\",VLOOKUP(DB11,Tables!AE$5:AF$100,2,FALSE))))","v":""},"","","","","",{"$f":"IF($BA11=\"\",\"\",IF(ISERROR(DH11),0,IF(ISNA(VLOOKUP(DG11,Tables!AG$5:AH$100,2,FALSE)),\"0\",VLOOKUP(DG11,Tables!AG$5:AH$100,2,FALSE))))","v":""},"","","",{"$f":"IF($BA11=\"\",\"\",IF(ISERROR(DL11),0,IF(ISNA(VLOOKUP(DL11,Tables!AI$5:AJ$100,2,FALSE)),\"0\",VLOOKUP(DL11,Tables!AI$5:AJ$100,2,FALSE))))","v":""},"","","","","",{"$f":"IF($BA11=\"\",\"\",IF(ISERROR(DR11),0,IF(ISNA(VLOOKUP(DQ11,Tables!AK$5:AL$100,2,FALSE)),\"0\",VLOOKUP(DQ11,Tables!AK$5:AL$100,2,FALSE))))","v":""},"","","",{"$f":"IF($BA11=\"\",\"\",IF(ISERROR(DV11),0,IF(ISNA(VLOOKUP(DV11,Tables!AM$5:AN$100,2,FALSE)),\"0\",VLOOKUP(DV11,Tables!AM$5:AN$100,2,FALSE))))","v":""},"","","","","",{"$f":"IF($BC11=\"\",\"\",IF(ISERROR(EB11),0,IF(ISNA(VLOOKUP(EA11,Tables!AO$5:AP$100,2,FALSE)),\"0\",VLOOKUP(EA11,Tables!AO$5:AP$100,2,FALSE))))","v":""},"","","",{"$f":"IF($EE11=\"\",\"0\",IF(ISNA(VLOOKUP(EF11,Tables!AQ$5:AR$100,2,FALSE)),\"0\",VLOOKUP(EF11,Tables!AQ$5:AR$100,2,FALSE)))","v":"0"},{"$f":"IF(BA11=\"\",\"\",IF(MainSheet!D18=\"Scratched\",\"\",BD11+BF11+BH11+BM11+BP11+BS11+BV11+BZ11+CC11+CF11+CI11+CM11+CQ11+CU11+CY11+DC11+DI11+DM11+DS11+DW11+EC11+EG11))","v":""}]
[{"$f":"IF(Meetings1!A12=\"\",\"\",IF(Meetings1!A12=\"END\",\"END\",IF(Meetings1!E12=\"\",\"\",getAddress(Meetings1!E12))))","v":"http://formguide.cyberhorse.com.au/index.php/Form/form.html?formdate=2010-12-02&track=H'bury&raceno=1"},{"$nulls":11},{"$f":"IF(ISNA(VLOOKUP(N12,RaceList!$J$3:$L$19,3,FALSE)),\"\",VLOOKUP(N12,RaceList!$J$3:$L$19,3,FALSE))","v":""},{"$f":"IF(Meetings2!$B12=\"\",\"\",Meetings2!$B12)","v":"LAUNCESTON (TR)"},{"$f":"IF(Meetings2!D12=\"\",\"\",getAddress(Meetings2!D12))","v":"http://www.tabonline.com.au/2010/12/02/TR01.html"},{"$f":"IF(Meetings2!E12=\"\",\"\",getAddress(Meetings2!E12))","v":"http://www.tabonline.com.au/2010/12/02/TR02.html"},{"$f":"IF(Meetings2!F12=\"\",\"\",getAddress(Meetings2!F12))","v":"http://www.tabonline.com.au/2010/12/02/TR03.html"},{"$f":"IF(Meetings2!G12=\"\",\"\",getAddress(Meetings2!G12))","v":"http://www.tabonline.com.au/2010/12/02/TR04.html"},{"$f":"IF(Meetings2!H12=\"\",\"\",getAddress(Meetings2!H12))","v":"http://www.tabonline.com.au/2010/12/02/TR05.html"},{"$f":"IF(Meetings2!I12=\"\",\"\",getAddress(Meetings2!I12))","v":"http://www.tabonline.com.au/2010/12/02/TR06.html"},{"$f":"IF(Meetings2!J12=\"\",\"\",getAddress(Meetings2!J12))","v":"http://www.tabonline.com.au/2010/12/02/TR07.html"},{"$f":"IF(Meetings2!K12=\"\",\"\",getAddress(Meetings2!K12))","v":"http://www.tabonline.com.au/2010/12/02/TR08.html"},{"$f":"IF(Meetings2!L12=\"\",\"\",getAddress(Meetings2!L12))","v":""},{"$f":"IF(Meetings2!M12=\"\",\"\",getAddress(Meetings2!M12))","v":""},{"$f":"IF(Meetings2!N12=\"\",\"\",getAddress(Meetings2!N12))","v":""},"",8,{"$nulls":20},7,"",{"$f":"IF(Race!N12<>\"\",Race!C12,\"\")","v":""},{"$f":"IF(AX12<>\"\",Race!N12,\"\")","v":""},{"$f":"IF(AX12<>\"\",Race!I12,\"\")","v":""},{"$f":"IF(Form!I15<>\"\",LEFT(Form!C15,FIND(\"(\",Form!C15)-2),\"\")","v":""},null,{"$f":"IF(BA12=\"\",\"\",Form!A15)","v":""},{"$f":"IF($BA12=\"\",\"\",IF(ISNA(VLOOKUP(BC12,Tables!A$5:B$100,2,FALSE)),\"0\",VLOOKUP(BC12,Tables!A$5:B$100,2,FALSE)))","v":""},"",{"$f":"IF($BE12=\"\",\"0\",IF(ISNA(VLOOKUP(BE12,Tables!C$5:D$100,2,FALSE)),\"0\",VLOOKUP(BE12,Tables!C$5:D$100,2,FALSE)))","v":"0"},{"$f":"IF(BA12=\"\",\"\",Form!F15)","v":""},{"$f":"IF($BA12=\"\",\"\",IF(ISNA(VLOOKUP(BG12,Tables!E$5:F$100,2,FALSE)),\"0\",VLOOKUP(BG12,Tables!E$5:F$100,2,FALSE)))","v":""},"","","","",{"$f":"IF($BA12=\"\",\"\",IF(ISERROR(BL12),0,IF(ISNA(VLOOKUP(BK12,Tables!G$5:H$100,2,FALSE)),\"0\",VLOOKUP(BK12,Tables!G15:H$100,2,FALSE))))","v":""},{"$f":"IF($BA12=\"\",\"\",Form!G15)","v":""},"",{"$f":"IF($BA12=\"\",\"\",IF(ISNA(VLOOKUP(BO12,Tables!I$5:J$100,2,FALSE)),\"0\",VLOOKUP(BO12,Tables!I$5:J$100,2,FALSE)))","v":""},{"$f":"IF($BA12=\"\",\"\",Form!H15)","v":""},"",{"$f":"IF($BA12=\"\",\"\",IF(ISNA(VLOOKUP(BR12,Tables!K$5:L$100,2,FALSE)),\"0\",VLOOKUP(BR12,Tables!K$5:L$100,2,FALSE)))","v":""},{"$f":"IF($BA12=\"\",\"\",Form!I15)","v":""},"",{"$f":"IF($BA12=\"\",\"\",IF(ISNA(VLOOKUP(BU12,Tables!M$5:N$100,2,FALSE)),\"0\",VLOOKUP(BU12,Tables!M$5:N$100,2,FALSE)))","v":""},{"$f":"IF($BA12=\"\",\"\",INDEX(Race!$D$1:$P$100,MATCH($BA12,Race!$C$1:$C$100,0)+0,9))","v":""},"","N",{"$f":"IF($BA12=\"\",\"\",IF(ISNA(VLOOKUP(BY12,Tables!O$5:P$100,2,FALSE)),0,VLOOKUP(BY12,Tables!O$5:P$100,2,FALSE)))","v":""},"","N",{"$f":"IF($BA12=\"\",\"\",IF(ISNA(VLOOKUP(CB12,Tables!Q$5:R$100,2,FALSE)),0,VLOOKUP(CB12,Tables!Q$5:R$100,2,FALSE)))","v":""},"","N",{"$f":"IF($BA12=\"\",\"\",IF(ISNA(VLOOKUP(CE12,Tables!S$5:T$100,2,FALSE)),0,VLOOKUP(CE12,Tables!S$5:T$100,2,FALSE)))","v":""},"","N",{"$f":"IF($BA12=\"\",\"\",IF(ISNA(VLOOKUP(CH12,Tables!U$5:V$100,2,FALSE)),0,VLOOKUP(CH12,Tables!U$5:V$100,2,FALSE)))","v":""},"","",0,{"$f":"IF($BA12=\"\",\"\",IF(ISERROR(CL12),0,IF(ISNA(VLOOKUP(CL12,Tables!W$5:X$100,2,FALSE)),\"0\",VLOOKUP(CL12,Tables!W$5:X$100,2,FALSE))))","v":""},"","",0,{"$f":"IF($BA12=\"\",\"\",IF(ISERROR(CP12),0,IF(ISNA(VLOOKUP(CP12,Tables!Y$5:Z$100,2,FALSE)),\"0\",VLOOKUP(CP12,Tables!Y$5:Z$100,2,FALSE))))","v":""},"","",0,{"$f":"IF($BA12=\"\",\"\",IF(ISERROR(CT12),0,IF(ISNA(VLOOKUP(CT12,Tables!AA$5:AB$100,2,FALSE)),\"0\",VLOOKUP(CT12,Tables!AA$5:AB$100,2,FALSE))))","v":""},"",{"$f":"IF(CV12=\"\",\"\",(Form!$H$3-CV12)/CV12*100)","v":""},"",{"$f":"IF($BA12=\"\",\"\",IF(ISERROR(CX12),0,IF(ISNA(VLOOKUP(CX12,Tables!AC$5:AD$100,2,FALSE)),\"0\",VLOOKUP(CX12,Tables!AC$5:AD$100,2,FALSE))))","v":""},"","","",{"$f":"IF($BA12=\"\",\"\",IF(ISERROR(DB12),0,IF(ISNA(VLOOKUP(DB12,Tables!AE$5:AF$100,2,FALSE)),\"0\",VLOOKUP(DB12,Tables!AE$5:AF$100,2,FALSE))))","v":""},"","","","","",{"$f":"IF($BA12=\"\",\"\",IF(ISERROR(DH12),0,IF(ISNA(VLOOKUP(DG12,Tables!AG$5:AH$100,2,FALSE)),\"0\",VLOOKUP(DG12,Tables!AG$5:AH$100,2,FALSE))))","v":""},"","","",{"$f":"IF($BA12=\"\",\"\",IF(ISERROR(DL12),0,IF(ISNA(VLOOKUP(DL12,Tables!AI$5:AJ$100,2,FALSE)),\"0\",VLOOKUP(DL12,Tables!AI$5:AJ$100,2,FALSE))))","v":""},"","","","","",{"$f":"IF($BA12=\"\",\"\",IF(ISERROR(DR12),0,IF(ISNA(VLOOKUP(DQ12,Tables!AK$5:AL$100,2,FALSE)),\"0\",VLOOKUP(DQ12,Tables!AK$5:AL$100,2,FALSE))))","v":""},"","","",{"$f":"IF($BA12=\"\",\"\",IF(ISERROR(DV12),0,IF(ISNA(VLOOKUP(DV12,Tables!AM$5:AN$100,2,FALSE)),\"0\",VLOOKUP(DV12,Tables!AM$5:AN$100,2,FALSE))))","v":""},"","","","","",{"$f":"IF($BC12=\"\",\"\",IF(ISERROR(EB12),0,IF(ISNA(VLOOKUP(EA12,Tables!AO$5:AP$100,2,FALSE)),\"0\",VLOOKUP(EA12,Tables!AO$5:AP$100,2,FALSE))))","v":""},"","","",{"$f":"IF($EE12=\"\",\"0\",IF(ISNA(VLOOKUP(EF12,Tables!AQ$5:AR$100,2,FALSE)),\"0\",VLOOKUP(EF12,Tables!AQ$5:AR$100,2,FALSE)))","v":"0"},{"$f":"IF(BA12=\"\",\"\",IF(MainSheet!D19=\"Scratched\",\"\",BD12+BF12+BH12+BM12+BP12+BS12+BV12+BZ12+CC12+CF12+CI12+CM12+CQ12+CU12+CY12+DC12+DI12+DM12+DS12+DW12+EC12+EG12))","v":""}]
[{"$f":"IF(Meetings1!A13=\"\",\"\",IF(Meetings1!A13=\"END\",\"END\",IF(Meetings1!E13=\"\",\"\",getAddress(Meetings1!E13))))","v":"http://formguide.cyberhorse.com.au/index.php/Form/form.html?formdate=2010-12-02&track=H'bury&raceno=2"},{"$nulls":11},{"$f":"IF(ISNA(VLOOKUP(N13,RaceList!$J$3:$L$19,3,FALSE)),\"\",VLOOKUP(N13,RaceList!$J$3:$L$19,3,FALSE))","v":""},{"$f":"IF(Meetings2!$B13=\"\",\"\",Meetings2!$B13)","v":"VAAL (AS)"},{"$f":"IF(Meetings2!D13=\"\",\"\",getAddress(Meetings2!D13))","v":"http://www.tabonline.com.au/2010/12/02/AS01.html"},{"$f":"IF(Meetings2!E13=\"\",\"\",getAddress(Meetings2!E13))","v":"http://www.tabonline.com.au/2010/12/02/AS02.html"},{"$f":"IF(Meetings2!F13=\"\",\"\",getAddress(Meetings2!F13))","v":"http://www.tabonline.com.au/2010/12/02/AS03.html"},{"$f":"IF(Meetings2!G13=\"\",\"\",getAddress(Meetings2!G13))","v":"http://www.tabonline.com.au/2010/12/02/AS04.html"},{"$f":"IF(Meetings2!H13=\"\",\"\",getAddress(Meetings2!H13))","v":"http://www.tabonline.com.au/2010/12/02/AS05.html"},{"$f":"IF(Meetings2!I13=\"\",\"\",getAddress(Meetings2!I13))","v":"http://www.tabonline.com.au/2010/12/02/AS06.html"},{"$f":"IF(Meetings2!J13=\"\",\"\",getAddress(Meetings2!J13))","v":"http://www.tabonline.com.au/2010/12/02/AS07.html"},{"$f":"IF(Meetings2!K13=\"\",\"\",getAddress(Meetings2!K13))","v":""},{"$f":"IF(Meetings2!L13=\"\",\"\",getAddress(Meetings2!L13))","v":""},{"$f":"IF(Meetings2!M13=\"\",\"\",getAddress(Meetings2!M13))","v":""},{"$f":"IF(Meetings2!N13=\"\",\"\",getAddress(Meetings2!N13))","v":""},"",9,{"$nulls":20},7,"",{"$f":"IF(Race!N13<>\"\",Race!C13,\"\")","v":""},{"$f":"IF(AX13<>\"\",Race!N13,\"\")","v":""},{"$f":"IF(AX13<>\"\",Race!I13,\"\")","v":""},{"$f":"IF(Form!I16<>\"\",LEFT(Form!C16,FIND(\"(\",Form!C16)-2),\"\")","v":""},null,{"$f":"IF(BA13=\"\",\"\",Form!A16)","v":""},{"$f":"IF($BA13=\"\",\"\",IF(ISNA(VLOOKUP(BC13,Tables!A$5:B$100,2,FALSE)),\"0\",VLOOKUP(BC13,Tables!A$5:B$100,2,FALSE)))","v":""},"",{"$f":"IF($BE13=\"\",\"0\",IF(ISNA(VLOOKUP(BE13,Tables!C$5:D$100,2,FALSE)),\"0\",VLOOKUP(BE13,Tables!C$5:D$100,2,FALSE)))","v":"0"},{"$f":"IF(BA13=\"\",\"\",Form!F16)","v":""},{"$f":"IF($BA13=\"\",\"\",IF(ISNA(VLOOKUP(BG13,Tables!E$5:F$100,2,FALSE)),\"0\",VLOOKUP(BG13,Tables!E$5:F$100,2,FALSE)))","v":""},"","","","",{"$f":"IF($BA13=\"\",\"\",IF(ISERROR(BL13),0,IF(ISNA(VLOOKUP(BK13,Tables!G$5:H$100,2,FALSE)),\"0\",VLOOKUP(BK13,Tables!G16:H$100,2,FALSE))))","v":""},{"$f":"IF($BA13=\"\",\"\",Form!G16)","v":""},"",{"$f":"IF($BA13=\"\",\"\",IF(ISNA(VLOOKUP(BO13,Tables!I$5:J$100,2,FALSE)),\"0\",VLOOKUP(BO13,Tables!I$5:J$100,2,FALSE)))","v":""},{"$f":"IF($BA13=\"\",\"\",Form!H16)","v":""},"",{"$f":"IF($BA13=\"\",\"\",IF(ISNA(VLOOKUP(BR13,Tables!K$5:L$100,2,FALSE)),\"0\",VLOOKUP(BR13,Tables!K$5:L$100,2,FALSE)))","v":""},{"$f":"IF($BA13=\"\",\"\",Form!I16)","v":""},"",{"$f":"IF($BA13=\"\",\"\",IF(ISNA(VLOOKUP(BU13,Tables!M$5:N$100,2,FALSE)),\"0\",VLOOKUP(BU13,Tables!M$5:N$100,2,FALSE)))","v":""},{"$f":"IF($BA13=\"\",\"\",INDEX(Race!$D$1:$P$100,MATCH($BA13,Race!$C$1:$C$100,0)+0,9))","v":""},"","N",{"$f":"IF($BA13=\"\",\"\",IF(ISNA(VLOOKUP(BY13,Tables!O$5:P$100,2,FALSE)),0,VLOOKUP(BY13,Tables!O$5:P$100,2,FALSE)))","v":""},"","N",{"$f":"IF($BA13=\"\",\"\",IF(ISNA(VLOOKUP(CB13,Tables!Q$5:R$100,2,FALSE)),0,VLOOKUP(CB13,Tables!Q$5:R$100,2,FALSE)))","v":""},"","N",{"$f":"IF($BA13=\"\",\"\",IF(ISNA(VLOOKUP(CE13,Tables!S$5:T$100,2,FALSE)),0,VLOOKUP(CE13,Tables!S$5:T$100,2,FALSE)))","v":""},"","N",{"$f":"IF($BA13=\"\",\"\",IF(ISNA(VLOOKUP(CH13,Tables!U$5:V$100,2,FALSE)),0,VLOOKUP(CH13,Tables!U$5:V$100,2,FALSE)))","v":""},"","",0,{"$f":"IF($BA13=\"\",\"\",IF(ISERROR(CL13),0,IF(ISNA(VLOOKUP(CL13,Tables!W$5:X$100,2,FALSE)),\"0\",VLOOKUP(CL13,Tables!W$5:X$100,2,FALSE))))","v":""},"","",0,{"$f":"IF($BA13=\"\",\"\",IF(ISERROR(CP13),0,IF(ISNA(VLOOKUP(CP13,Tables!Y$5:Z$100,2,FALSE)),\"0\",VLOOKUP(CP13,Tables!Y$5:Z$100,2,FALSE))))","v":""},"","",0,{"$f":"IF($BA13=\"\",\"\",IF(ISERROR(CT13),0,IF(ISNA(VLOOKUP(CT13,Tables!AA$5:AB$100,2,FALSE)),\"0\",VLOOKUP(CT13,Tables!AA$5:AB$100,2,FALSE))))","v":""},"",{"$f":"IF(CV13=\"\",\"\",(Form!$H$3-CV13)/CV13*100)","v":""},"",{"$f":"IF($BA13=\"\",\"\",IF(ISERROR(CX13),0,IF(ISNA(VLOOKUP(CX13,Tables!AC$5:AD$100,2,FALSE)),\"0\",VLOOKUP(CX13,Tables!AC$5:AD$100,2,FALSE))))","v":""},"","","",{"$f":"IF($BA13=\"\",\"\",IF(ISERROR(DB13),0,IF(ISNA(VLOOKUP(DB13,Tables!AE$5:AF$100,2,FALSE)),\"0\",VLOOKUP(DB13,Tables!AE$5:AF$100,2,FALSE))))","v":""},"","","","","",{"$f":"IF($BA13=\"\",\"\",IF(ISERROR(DH13),0,IF(ISNA(VLOOKUP(DG13,Tables!AG$5:AH$100,2,FALSE)),\"0\",VLOOKUP(DG13,Tables!AG$5:AH$100,2,FALSE))))","v":""},"","","",{"$f":"IF($BA13=\"\",\"\",IF(ISERROR(DL13),0,IF(ISNA(VLOOKUP(DL13,Tables!AI$5:AJ$100,2,FALSE)),\"0\",VLOOKUP(DL13,Tables!AI$5:AJ$100,2,FALSE))))","v":""},"","","","","",{"$f":"IF($BA13=\"\",\"\",IF(ISERROR(DR13),0,IF(ISNA(VLOOKUP(DQ13,Tables!AK$5:AL$100,2,FALSE)),\"0\",VLOOKUP(DQ13,Tables!AK$5:AL$100,2,FALSE))))","v":""},"","","",{"$f":"IF($BA13=\"\",\"\",IF(ISERROR(DV13),0,IF(ISNA(VLOOKUP(DV13,Tables!AM$5:AN$100,2,FALSE)),\"0\",VLOOKUP(DV13,Tables!AM$5:AN$100,2,FALSE))))","v":""},"","","","","",{"$f":"IF($BC13=\"\",\"\",IF(ISERROR(EB13),0,IF(ISNA(VLOOKUP(EA13,Tables!AO$5:AP$100,2,FALSE)),\"0\",VLOOKUP(EA13,Tables!AO$5:AP$100,2,FALSE))))","v":""},"","","",{"$f":"IF($EE13=\"\",\"0\",IF(ISNA(VLOOKUP(EF13,Tables!AQ$5:AR$100,2,FALSE)),\"0\",VLOOKUP(EF13,Tables!AQ$5:AR$100,2,FALSE)))","v":"0"},{"$f":"IF(BA13=\"\",\"\",IF(MainSheet!D20=\"Scratched\",\"\",BD13+BF13+BH13+BM13+BP13+BS13+BV13+BZ13+CC13+CF13+CI13+CM13+CQ13+CU13+CY13+DC13+DI13+DM13+DS13+DW13+EC13+EG13))","v":""}]
[{"$f":"IF(Meetings1!A14=\"\",\"\",IF(Meetings1!A14=\"END\",\"END\",IF(Meetings1!E14=\"\",\"\",getAddress(Meetings1!E14))))","v":"http://formguide.cyberhorse.com.au/index.php/Form/form.html?formdate=2010-12-02&track=H'bury&raceno=3"},{"$nulls":11},{"$f":"IF(ISNA(VLOOKUP(N14,RaceList!$J$3:$L$19,3,FALSE)),\"\",VLOOKUP(N14,RaceList!$J$3:$L$19,3,FALSE))","v":""},{"$f":"IF(Meetings2!$B14=\"\",\"\",Meetings2!$B14)","v":"LINGFIELD (ES)"},{"$f":"IF(Meetings2!D14=\"\",\"\",getAddress(Meetings2!D14))","v":"http://www.tabonline.com.au/2010/12/02/ES01.html"},{"$f":"IF(Meetings2!E14=\"\",\"\",getAddress(Meetings2!E14))","v":"http://www.tabonline.com.au/2010/12/02/ES02.html"},{"$f":"IF(Meetings2!F14=\"\",\"\",getAddress(Meetings2!F14))","v":"http://www.tabonline.com.au/2010/12/02/ES03.html"},{"$f":"IF(Meetings2!G14=\"\",\"\",getAddress(Meetings2!G14))","v":"http://www.tabonline.com.au/2010/12/02/ES04.html"},{"$f":"IF(Meetings2!H14=\"\",\"\",getAddress(Meetings2!H14))","v":""},{"$f":"IF(Meetings2!I14=\"\",\"\",getAddress(Meetings2!I14))","v":""},{"$f":"IF(Meetings2!J14=\"\",\"\",getAddress(Meetings2!J14))","v":""},{"$f":"IF(Meetings2!K14=\"\",\"\",getAddress(Meetings2!K14))","v":""},{"$f":"IF(Meetings2!L14=\"\",\"\",getAddress(Meetings2!L14))","v":""},{"$f":"IF(Meetings2!M14=\"\",\"\",getAddress(Meetings2!M14))","v":""},{"$f":"IF(Meetings2!N14=\"\",\"\",getAddress(Meetings2!N14))","v":""},"",{"$nulls":21},7,"",{"$f":"IF(Race!N14<>\"\",Race!C14,\"\")","v":""},{"$f":"IF(AX14<>\"\",Race!N14,\"\")","v":""},{"$f":"IF(AX14<>\"\",Race!I14,\"\")","v":""},{"$f":"IF(Form!I17<>\"\",LEFT(Form!C17,FIND(\"(\",Form!C17)-2),\"\")","v":""},null,{"$f":"IF(BA14=\"\",\"\",Form!A17)","v":""},{"$f":"IF($BA14=\"\",\"\",IF(ISNA(VLOOKUP(BC14,Tables!A$5:B$100,2,FALSE)),\"0\",VLOOKUP(BC14,Tables!A$5:B$100,2,FALSE)))","v":""},"",{"$f":"IF($BE14=\"\",\"0\",IF(ISNA(VLOOKUP(BE14,Tables!C$5:D$100,2,FALSE)),\"0\",VLOOKUP(BE14,Tables!C$5:D$100,2,FALSE)))","v":"0"},{"$f":"IF(BA14=\"\",\"\",Form!F17)","v":""},{"$f":"IF($BA14=\"\",\"\",IF(ISNA(VLOOKUP(BG14,Tables!E$5:F$100,2,FALSE)),\"0\",VLOOKUP(BG14,Tables!E$5:F$100,2,FALSE)))","v":""},"","","","",{"$f":"IF($BA14=\"\",\"\",IF(ISERROR(BL14),0,IF(ISNA(VLOOKUP(BK14,Tables!G$5:H$100,2,FALSE)),\"0\",VLOOKUP(BK14,Tables!G17:H$100,2,FALSE))))","v":""},{"$f":"IF($BA14=\"\",\"\",Form!G17)","v":""},"",{"$f":"IF($BA14=\"\",\"\",IF(ISNA(VLOOKUP(BO14,Tables!I$5:J$100,2,FALSE)),\"0\",VLOOKUP(BO14,Tables!I$5:J$100,2,FALSE)))","v":""},{"$f":"IF($BA14=\"\",\"\",Form!H17)","v":""},"",{"$f":"IF($BA14=\"\",\"\",IF(ISNA(VLOOKUP(BR14,Tables!K$5:L$100,2,FALSE)),\"0\",VLOOKUP(BR14,Tables!K$5:L$100,2,FALSE)))","v":""},{"$f":"IF($BA14=\"\",\"\",Form!I17)","v":""},"",{"$f":"IF($BA14=\"\",\"\",IF(ISNA(VLOOKUP(BU14,Tables!M$5:N$100,2,FALSE)),\"0\",VLOOKUP(BU14,Tables!M$5:N$100,2,FALSE)))","v":""},{"$f":"IF($BA14=\"\",\"\",INDEX(Race!$D$1:$P$100,MATCH($BA14,Race!$C$1:$C$100,0)+0,9))","v":""},"","N",{"$f":"IF($BA14=\"\",\"\",IF(ISNA(VLOOKUP(BY14,Tables!O$5:P$100,2,FALSE)),0,VLOOKUP(BY14,Tables!O$5:P$100,2,FALSE)))","v":""},"","N",{"$f":"IF($BA14=\"\",\"\",IF(ISNA(VLOOKUP(CB14,Tables!Q$5:R$100,2,FALSE)),0,VLOOKUP(CB14,Tables!Q$5:R$100,2,FALSE)))","v":""},"","N",{"$f":"IF($BA14=\"\",\"\",IF(ISNA(VLOOKUP(CE14,Tables!S$5:T$100,2,FALSE)),0,VLOOKUP(CE14,Tables!S$5:T$100,2,FALSE)))","v":""},"","N",{"$f":"IF($BA14=\"\",\"\",IF(ISNA(VLOOKUP(CH14,Tables!U$5:V$100,2,FALSE)),0,VLOOKUP(CH14,Tables!U$5:V$100,2,FALSE)))","v":""},"","",0,{"$f":"IF($BA14=\"\",\"\",IF(ISERROR(CL14),0,IF(ISNA(VLOOKUP(CL14,Tables!W$5:X$100,2,FALSE)),\"0\",VLOOKUP(CL14,Tables!W$5:X$100,2,FALSE))))","v":""},"","",0,{"$f":"IF($BA14=\"\",\"\",IF(ISERROR(CP14),0,IF(ISNA(VLOOKUP(CP14,Tables!Y$5:Z$100,2,FALSE)),\"0\",VLOOKUP(CP14,Tables!Y$5:Z$100,2,FALSE))))","v":""},"","",0,{"$f":"IF($BA14=\"\",\"\",IF(ISERROR(CT14),0,IF(ISNA(VLOOKUP(CT14,Tables!AA$5:AB$100,2,FALSE)),\"0\",VLOOKUP(CT14,Tables!AA$5:AB$100,2,FALSE))))","v":""},"",{"$f":"IF(CV14=\"\",\"\",(Form!$H$3-CV14)/CV14*100)","v":""},"",{"$f":"IF($BA14=\"\",\"\",IF(ISERROR(CX14),0,IF(ISNA(VLOOKUP(CX14,Tables!AC$5:AD$100,2,FALSE)),\"0\",VLOOKUP(CX14,Tables!AC$5:AD$100,2,FALSE))))","v":""},"","","",{"$f":"IF($BA14=\"\",\"\",IF(ISERROR(DB14),0,IF(ISNA(VLOOKUP(DB14,Tables!AE$5:AF$100,2,FALSE)),\"0\",VLOOKUP(DB14,Tables!AE$5:AF$100,2,FALSE))))","v":""},"","","","","",{"$f":"IF($BA14=\"\",\"\",IF(ISERROR(DH14),0,IF(ISNA(VLOOKUP(DG14,Tables!AG$5:AH$100,2,FALSE)),\"0\",VLOOKUP(DG14,Tables!AG$5:AH$100,2,FALSE))))","v":""},"","","",{"$f":"IF($BA14=\"\",\"\",IF(ISERROR(DL14),0,IF(ISNA(VLOOKUP(DL14,Tables!AI$5:AJ$100,2,FALSE)),\"0\",VLOOKUP(DL14,Tables!AI$5:AJ$100,2,FALSE))))","v":""},"","","","","",{"$f":"IF($BA14=\"\",\"\",IF(ISERROR(DR14),0,IF(ISNA(VLOOKUP(DQ14,Tables!AK$5:AL$100,2,FALSE)),\"0\",VLOOKUP(DQ14,Tables!AK$5:AL$100,2,FALSE))))","v":""},"","","",{"$f":"IF($BA14=\"\",\"\",IF(ISERROR(DV14),0,IF(ISNA(VLOOKUP(DV14,Tables!AM$5:AN$100,2,FALSE)),\"0\",VLOOKUP(DV14,Tables!AM$5:AN$100,2,FALSE))))","v":""},"","","","","",{"$f":"IF($BC14=\"\",\"\",IF(ISERROR(EB14),0,IF(ISNA(VLOOKUP(EA14,Tables!AO$5:AP$100,2,FALSE)),\"0\",VLOOKUP(EA14,Tables!AO$5:AP$100,2,FALSE))))","v":""},"","","",{"$f":"IF($EE14=\"\",\"0\",IF(ISNA(VLOOKUP(EF14,Tables!AQ$5:AR$100,2,FALSE)),\"0\",VLOOKUP(EF14,Tables!AQ$5:AR$100,2,FALSE)))","v":"0"},{"$f":"IF(BA14=\"\",\"\",IF(MainSheet!D21=\"Scratched\",\"\",BD14+BF14+BH14+BM14+BP14+BS14+BV14+BZ14+CC14+CF14+CI14+CM14+CQ14+CU14+CY14+DC14+DI14+DM14+DS14+DW14+EC14+EG14))","v":""}]
[{"$f":"IF(Meetings1!A15=\"\",\"\",IF(Meetings1!A15=\"END\",\"END\",IF(Meetings1!E15=\"\",\"\",getAddress(Meetings1!E15))))","v":"http://formguide.cyberhorse.com.au/index.php/Form/form.html?formdate=2010-12-02&track=H'bury&raceno=4"},{"$nulls":11},{"$f":"IF(ISNA(VLOOKUP(N15,RaceList!$J$3:$L$19,3,FALSE)),\"\",VLOOKUP(N15,RaceList!$J$3:$L$19,3,FALSE))","v":""},{"$f":"IF(Meetings2!$B15=\"\",\"\",Meetings2!$B15)","v":"MATAMATA (ZS)"},{"$f":"IF(Meetings2!D15=\"\",\"\",getAddress(Meetings2!D15))","v":"http://www.tabonline.com.au/2010/12/02/ZS01.html"},{"$f":"IF(Meetings2!E15=\"\",\"\",getAddress(Meetings2!E15))","v":"http://www.tabonline.com.au/2010/12/02/ZS02.html"},{"$f":"IF(Meetings2!F15=\"\",\"\",getAddress(Meetings2!F15))","v":"http://www.tabonline.com.au/2010/12/02/ZS03.html"},{"$f":"IF(Meetings2!G15=\"\",\"\",getAddress(Meetings2!G15))","v":"http://www.tabonline.com.au/2010/12/02/ZS04.html"},{"$f":"IF(Meetings2!H15=\"\",\"\",getAddress(Meetings2!H15))","v":"http://www.tabonline.com.au/2010/12/02/ZS05.html"},{"$f":"IF(Meetings2!I15=\"\",\"\",getAddress(Meetings2!I15))","v":"http://www.tabonline.com.au/2010/12/02/ZS06.html"},{"$f":"IF(Meetings2!J15=\"\",\"\",getAddress(Meetings2!J15))","v":"http://www.tabonline.com.au/2010/12/02/ZS07.html"},{"$f":"IF(Meetings2!K15=\"\",\"\",getAddress(Meetings2!K15))","v":"http://www.tabonline.com.au/2010/12/02/ZS08.html"},{"$f":"IF(Meetings2!L15=\"\",\"\",getAddress(Meetings2!L15))","v":"http://www.tabonline.com.au/2010/12/02/ZS09.html"},{"$f":"IF(Meetings2!M15=\"\",\"\",getAddress(Meetings2!M15))","v":"http://www.tabonline.com.au/2010/12/02/ZS10.html"},{"$f":"IF(Meetings2!N15=\"\",\"\",getAddress(Meetings2!N15))","v":""},"Dack's Faz","1 Dack's Faz (8) 58.0kg 5yo b/br g",{"$nulls":20},6,"",{"$f":"IF(Race!N15<>\"\",Race!C15,\"\")","v":""},{"$f":"IF(AX15<>\"\",Race!N15,\"\")","v":""},{"$f":"IF(AX15<>\"\",Race!I15,\"\")","v":""},{"$f":"IF(Form!I18<>\"\",LEFT(Form!C18,FIND(\"(\",Form!C18)-2),\"\")","v":""},null,{"$f":"IF(BA15=\"\",\"\",Form!A18)","v":""},{"$f":"IF($BA15=\"\",\"\",IF(ISNA(VLOOKUP(BC15,Tables!A$5:B$100,2,FALSE)),\"0\",VLOOKUP(BC15,Tables!A$5:B$100,2,FALSE)))","v":""},"",{"$f":"IF($BE15=\"\",\"0\",IF(ISNA(VLOOKUP(BE15,Tables!C$5:D$100,2,FALSE)),\"0\",VLOOKUP(BE15,Tables!C$5:D$100,2,FALSE)))","v":"0"},{"$f":"IF(BA15=\"\",\"\",Form!F18)","v":""},{"$f":"IF($BA15=\"\",\"\",IF(ISNA(VLOOKUP(BG15,Tables!E$5:F$100,2,FALSE)),\"0\",VLOOKUP(BG15,Tables!E$5:F$100,2,FALSE)))","v":""},"","","","",{"$f":"IF($BA15=\"\",\"\",IF(ISERROR(BL15),0,IF(ISNA(VLOOKUP(BK15,Tables!G$5:H$100,2,FALSE)),\"0\",VLOOKUP(BK15,Tables!G18:H$100,2,FALSE))))","v":""},{"$f":"IF($BA15=\"\",\"\",Form!G18)","v":""},"",{"$f":"IF($BA15=\"\",\"\",IF(ISNA(VLOOKUP(BO15,Tables!I$5:J$100,2,FALSE)),\"0\",VLOOKUP(BO15,Tables!I$5:J$100,2,FALSE)))","v":""},{"$f":"IF($BA15=\"\",\"\",Form!H18)","v":""},"",{"$f":"IF($BA15=\"\",\"\",IF(ISNA(VLOOKUP(BR15,Tables!K$5:L$100,2,FALSE)),\"0\",VLOOKUP(BR15,Tables!K$5:L$100,2,FALSE)))","v":""},{"$f":"IF($BA15=\"\",\"\",Form!I18)","v":""},"",{"$f":"IF($BA15=\"\",\"\",IF(ISNA(VLOOKUP(BU15,Tables!M$5:N$100,2,FALSE)),\"0\",VLOOKUP(BU15,Tables!M$5:N$100,2,FALSE)))","v":""},{"$f":"IF($BA15=\"\",\"\",INDEX(Race!$D$1:$P$100,MATCH($BA15,Race!$C$1:$C$100,0)+0,9))","v":""},"","N",{"$f":"IF($BA15=\"\",\"\",IF(ISNA(VLOOKUP(BY15,Tables!O$5:P$100,2,FALSE)),0,VLOOKUP(BY15,Tables!O$5:P$100,2,FALSE)))","v":""},"","N",{"$f":"IF($BA15=\"\",\"\",IF(ISNA(VLOOKUP(CB15,Tables!Q$5:R$100,2,FALSE)),0,VLOOKUP(CB15,Tables!Q$5:R$100,2,FALSE)))","v":""},"","N",{"$f":"IF($BA15=\"\",\"\",IF(ISNA(VLOOKUP(CE15,Tables!S$5:T$100,2,FALSE)),0,VLOOKUP(CE15,Tables!S$5:T$100,2,FALSE)))","v":""},"","N",{"$f":"IF($BA15=\"\",\"\",IF(ISNA(VLOOKUP(CH15,Tables!U$5:V$100,2,FALSE)),0,VLOOKUP(CH15,Tables!U$5:V$100,2,FALSE)))","v":""},"","",0,{"$f":"IF($BA15=\"\",\"\",IF(ISERROR(CL15),0,IF(ISNA(VLOOKUP(CL15,Tables!W$5:X$100,2,FALSE)),\"0\",VLOOKUP(CL15,Tables!W$5:X$100,2,FALSE))))","v":""},"","",0,{"$f":"IF($BA15=\"\",\"\",IF(ISERROR(CP15),0,IF(ISNA(VLOOKUP(CP15,Tables!Y$5:Z$100,2,FALSE)),\"0\",VLOOKUP(CP15,Tables!Y$5:Z$100,2,FALSE))))","v":""},"","",0,{"$f":"IF($BA15=\"\",\"\",IF(ISERROR(CT15),0,IF(ISNA(VLOOKUP(CT15,Tables!AA$5:AB$100,2,FALSE)),\"0\",VLOOKUP(CT15,Tables!AA$5:AB$100,2,FALSE))))","v":""},"",{"$f":"IF(CV15=\"\",\"\",(Form!$H$3-CV15)/CV15*100)","v":""},"",{"$f":"IF($BA15=\"\",\"\",IF(ISERROR(CX15),0,IF(ISNA(VLOOKUP(CX15,Tables!AC$5:AD$100,2,FALSE)),\"0\",VLOOKUP(CX15,Tables!AC$5:AD$100,2,FALSE))))","v":""},"","","",{"$f":"IF($BA15=\"\",\"\",IF(ISERROR(DB15),0,IF(ISNA(VLOOKUP(DB15,Tables!AE$5:AF$100,2,FALSE)),\"0\",VLOOKUP(DB15,Tables!AE$5:AF$100,2,FALSE))))","v":""},"","","","","",{"$f":"IF($BA15=\"\",\"\",IF(ISERROR(DH15),0,IF(ISNA(VLOOKUP(DG15,Tables!AG$5:AH$100,2,FALSE)),\"0\",VLOOKUP(DG15,Tables!AG$5:AH$100,2,FALSE))))","v":""},"","","",{"$f":"IF($BA15=\"\",\"\",IF(ISERROR(DL15),0,IF(ISNA(VLOOKUP(DL15,Tables!AI$5:AJ$100,2,FALSE)),\"0\",VLOOKUP(DL15,Tables!AI$5:AJ$100,2,FALSE))))","v":""},"","","","","",{"$f":"IF($BA15=\"\",\"\",IF(ISERROR(DR15),0,IF(ISNA(VLOOKUP(DQ15,Tables!AK$5:AL$100,2,FALSE)),\"0\",VLOOKUP(DQ15,Tables!AK$5:AL$100,2,FALSE))))","v":""},"","","",{"$f":"IF($BA15=\"\",\"\",IF(ISERROR(DV15),0,IF(ISNA(VLOOKUP(DV15,Tables!AM$5:AN$100,2,FALSE)),\"0\",VLOOKUP(DV15,Tables!AM$5:AN$100,2,FALSE))))","v":""},"","","","","",{"$f":"IF($BC15=\"\",\"\",IF(ISERROR(EB15),0,IF(ISNA(VLOOKUP(EA15,Tables!AO$5:AP$100,2,FALSE)),\"0\",VLOOKUP(EA15,Tables!AO$5:AP$100,2,FALSE))))","v":""},"","","",{"$f":"IF($EE15=\"\",\"0\",IF(ISNA(VLOOKUP(EF15,Tables!AQ$5:AR$100,2,FALSE)),\"0\",VLOOKUP(EF15,Tables!AQ$5:AR$100,2,FALSE)))","v":"0"},{"$f":"IF(BA15=\"\",\"\",IF(MainSheet!D22=\"Scratched\",\"\",BD15+BF15+BH15+BM15+BP15+BS15+BV15+BZ15+CC15+CF15+CI15+CM15+CQ15+CU15+CY15+DC15+DI15+DM15+DS15+DW15+EC15+EG15))","v":""}]
[{"$f":"IF(Meetings1!A16=\"\",\"\",IF(Meetings1!A16=\"END\",\"END\",IF(Meetings1!E16=\"\",\"\",getAddress(Meetings1!E16))))","v":"http://formguide.cyberhorse.com.au/index.php/Form/form.html?formdate=2010-12-02&track=H'bury&raceno=5"},{"$nulls":11},{"$f":"IF(ISNA(VLOOKUP(N16,RaceList!$J$3:$L$19,3,FALSE)),\"\",VLOOKUP(N16,RaceList!$J$3:$L$19,3,FALSE))","v":""},{"$f":"IF(Meetings2!$B16=\"\",\"\",Meetings2!$B16)","v":""},{"$f":"IF(Meetings2!D16=\"\",\"\",getAddress(Meetings2!D16))","v":{"$error":"#VALUE!"}},{"$f":"IF(Meetings2!E16=\"\",\"\",getAddress(Meetings2!E16))","v":{"$error":"#VALUE!"}},{"$f":"IF(Meetings2!F16=\"\",\"\",getAddress(Meetings2!F16))","v":{"$error":"#VALUE!"}},{"$f":"IF(Meetings2!G16=\"\",\"\",getAddress(Meetings2!G16))","v":{"$error":"#VALUE!"}},{"$f":"IF(Meetings2!H16=\"\",\"\",getAddress(Meetings2!H16))","v":{"$error":"#VALUE!"}},{"$f":"IF(Meetings2!I16=\"\",\"\",getAddress(Meetings2!I16))","v":{"$error":"#VALUE!"}},{"$f":"IF(Meetings2!J16=\"\",\"\",getAddress(Meetings2!J16))","v":{"$error":"#VALUE!"}},{"$f":"IF(Meetings2!K16=\"\",\"\",getAddress(Meetings2!K16))","v":{"$error":"#VALUE!"}},{"$f":"IF(Meetings2!L16=\"\",\"\",getAddress(Meetings2!L16))","v":{"$error":"#VALUE!"}},{"$f":"IF(Meetings2!M16=\"\",\"\",getAddress(Meetings2!M16))","v":{"$error":"#VALUE!"}},{"$f":"IF(Meetings2!N16=\"\",\"\",getAddress(Meetings2!N16))","v":{"$error":"#VALUE!"}},"","Colours: Gold"," black sash and cap",{"$nulls":19},6,"",{"$f":"IF(Race!N16<>\"\",Race!C16,\"\")","v":"Name"},{"$f":"IF(AX16<>\"\",Race!N16,\"\")","v":"Rtng"},{"$f":"IF(AX16<>\"\",Race!I16,\"\")","v":"Bar"},{"$f":"IF(Form!I19<>\"\",LEFT(Form!C19,FIND(\"(\",Form!C19)-2),\"\")","v":""},null,{"$f":"IF(BA16=\"\",\"\",Form!A19)","v":""},{"$f":"IF($BA16=\"\",\"\",IF(ISNA(VLOOKUP(BC16,Tables!A$5:B$100,2,FALSE)),\"0\",VLOOKUP(BC16,Tables!A$5:B$100,2,FALSE)))","v":""},"",{"$f":"IF($BE16=\"\",\"0\",IF(ISNA(VLOOKUP(BE16,Tables!C$5:D$100,2,FALSE)),\"0\",VLOOKUP(BE16,Tables!C$5:D$100,2,FALSE)))","v":"0"},{"$f":"IF(BA16=\"\",\"\",Form!F19)","v":""},{"$f":"IF($BA16=\"\",\"\",IF(ISNA(VLOOKUP(BG16,Tables!E$5:F$100,2,FALSE)),\"0\",VLOOKUP(BG16,Tables!E$5:F$100,2,FALSE)))","v":""},"","","","",{"$f":"IF($BA16=\"\",\"\",IF(ISERROR(BL16),0,IF(ISNA(VLOOKUP(BK16,Tables!G$5:H$100,2,FALSE)),\"0\",VLOOKUP(BK16,Tables!G19:H$100,2,FALSE))))","v":""},{"$f":"IF($BA16=\"\",\"\",Form!G19)","v":""},"",{"$f":"IF($BA16=\"\",\"\",IF(ISNA(VLOOKUP(BO16,Tables!I$5:J$100,2,FALSE)),\"0\",VLOOKUP(BO16,Tables!I$5:J$100,2,FALSE)))","v":""},{"$f":"IF($BA16=\"\",\"\",Form!H19)","v":""},"",{"$f":"IF($BA16=\"\",\"\",IF(ISNA(VLOOKUP(BR16,Tables!K$5:L$100,2,FALSE)),\"0\",VLOOKUP(BR16,Tables!K$5:L$100,2,FALSE)))","v":""},{"$f":"IF($BA16=\"\",\"\",Form!I19)","v":""},"",{"$f":"IF($BA16=\"\",\"\",IF(ISNA(VLOOKUP(BU16,Tables!M$5:N$100,2,FALSE)),\"0\",VLOOKUP(BU16,Tables!M$5:N$100,2,FALSE)))","v":""},{"$f":"IF($BA16=\"\",\"\",INDEX(Race!$D$1:$P$100,MATCH($BA16,Race!$C$1:$C$100,0)+0,9))","v":""},"","N",{"$f":"IF($BA16=\"\",\"\",IF(ISNA(VLOOKUP(BY16,Tables!O$5:P$100,2,FALSE)),0,VLOOKUP(BY16,Tables!O$5:P$100,2,FALSE)))","v":""},"","N",{"$f":"IF($BA16=\"\",\"\",IF(ISNA(VLOOKUP(CB16,Tables!Q$5:R$100,2,FALSE)),0,VLOOKUP(CB16,Tables!Q$5:R$100,2,FALSE)))","v":""},"","N",{"$f":"IF($BA16=\"\",\"\",IF(ISNA(VLOOKUP(CE16,Tables!S$5:T$100,2,FALSE)),0,VLOOKUP(CE16,Tables!S$5:T$100,2,FALSE)))","v":""},"","N",{"$f":"IF($BA16=\"\",\"\",IF(ISNA(VLOOKUP(CH16,Tables!U$5:V$100,2,FALSE)),0,VLOOKUP(CH16,Tables!U$5:V$100,2,FALSE)))","v":""},"","",0,{"$f":"IF($BA16=\"\",\"\",IF(ISERROR(CL16),0,IF(ISNA(VLOOKUP(CL16,Tables!W$5:X$100,2,FALSE)),\"0\",VLOOKUP(CL16,Tables!W$5:X$100,2,FALSE))))","v":""},"","",0,{"$f":"IF($BA16=\"\",\"\",IF(ISERROR(CP16),0,IF(ISNA(VLOOKUP(CP16,Tables!Y$5:Z$100,2,FALSE)),\"0\",VLOOKUP(CP16,Tables!Y$5:Z$100,2,FALSE))))","v":""},"","",0,{"$f":"IF($BA16=\"\",\"\",IF(ISERROR(CT16),0,IF(ISNA(VLOOKUP(CT16,Tables!AA$5:AB$100,2,FALSE)),\"0\",VLOOKUP(CT16,Tables!AA$5:AB$100,2,FALSE))))","v":""},"",{"$f":"IF(CV16=\"\",\"\",(Form!$H$3-CV16)/CV16*100)","v":""},"",{"$f":"IF($BA16=\"\",\"\",IF(ISERROR(CX16),0,IF(ISNA(VLOOKUP(CX16,Tables!AC$5:AD$100,2,FALSE)),\"0\",VLOOKUP(CX16,Tables!AC$5:AD$100,2,FALSE))))","v":""},"","","",{"$f":"IF($BA16=\"\",\"\",IF(ISERROR(DB16),0,IF(ISNA(VLOOKUP(DB16,Tables!AE$5:AF$100,2,FALSE)),\"0\",VLOOKUP(DB16,Tables!AE$5:AF$100,2,FALSE))))","v":""},"","","","","",{"$f":"IF($BA16=\"\",\"\",IF(ISERROR(DH16),0,IF(ISNA(VLOOKUP(DG16,Tables!AG$5:AH$100,2,FALSE)),\"0\",VLOOKUP(DG16,Tables!AG$5:AH$100,2,FALSE))))","v":""},"","","",{"$f":"IF($BA16=\"\",\"\",IF(ISERROR(DL16),0,IF(ISNA(VLOOKUP(DL16,Tables!AI$5:AJ$100,2,FALSE)),\"0\",VLOOKUP(DL16,Tables!AI$5:AJ$100,2,FALSE))))","v":""},"","","","","",{"$f":"IF($BA16=\"\",\"\",IF(ISERROR(DR16),0,IF(ISNA(VLOOKUP(DQ16,Tables!AK$5:AL$100,2,FALSE)),\"0\",VLOOKUP(DQ16,Tables!AK$5:AL$100,2,FALSE))))","v":""},"","","",{"$f":"IF($BA16=\"\",\"\",IF(ISERROR(DV16),0,IF(ISNA(VLOOKUP(DV16,Tables!AM$5:AN$100,2,FALSE)),\"0\",VLOOKUP(DV16,Tables!AM$5:AN$100,2,FALSE))))","v":""},"","","","","",{"$f":"IF($BC16=\"\",\"\",IF(ISERROR(EB16),0,IF(ISNA(VLOOKUP(EA16,Tables!AO$5:AP$100,2,FALSE)),\"0\",VLOOKUP(EA16,Tables!AO$5:AP$100,2,FALSE))))","v":""},"","","",{"$f":"IF($EE16=\"\",\"0\",IF(ISNA(VLOOKUP(EF16,Tables!AQ$5:AR$100,2,FALSE)),\"0\",VLOOKUP(EF16,Tables!AQ$5:AR$100,2,FALSE)))","v":"0"},{"$f":"IF(BA16=\"\",\"\",IF(MainSheet!D23=\"Scratched\",\"\",BD16+BF16+BH16+BM16+BP16+BS16+BV16+BZ16+CC16+CF16+CI16+CM16+CQ16+CU16+CY16+DC16+DI16+DM16+DS16+DW16+EC16+EG16))","v":""}]
[{"$f":"IF(Meetings1!A17=\"\",\"\",IF(Meetings1!A17=\"END\",\"END\",IF(Meetings1!E17=\"\",\"\",getAddress(Meetings1!E17))))","v":"http://formguide.cyberhorse.com.au/index.php/Form/form.html?formdate=2010-12-02&track=H'bury&raceno=6"},{"$nulls":11},{"$f":"IF(ISNA(VLOOKUP(N17,RaceList!$J$3:$L$19,3,FALSE)),\"\",VLOOKUP(N17,RaceList!$J$3:$L$19,3,FALSE))","v":""},{"$f":"IF(Meetings2!$B17=\"\",\"\",Meetings2!$B17)","v":"PENRITH (ST)"},{"$f":"IF(Meetings2!D17=\"\",\"\",getAddress(Meetings2!D17))","v":"http://www.tabonline.com.au/2010/12/02/ST01.html"},{"$f":"IF(Meetings2!E17=\"\",\"\",getAddress(Meetings2!E17))","v":"http://www.tabonline.com.au/2010/12/02/ST02.html"},{"$f":"IF(Meetings2!F17=\"\",\"\",getAddress(Meetings2!F17))","v":"http://www.tabonline.com.au/2010/12/02/ST03.html"},{"$f":"IF(Meetings2!G17=\"\",\"\",getAddress(Meetings2!G17))","v":"http://www.tabonline.com.au/2010/12/02/ST04.html"},{"$f":"IF(Meetings2!H17=\"\",\"\",getAddress(Meetings2!H17))","v":"http://www.tabonline.com.au/2010/12/02/ST05.html"},{"$f":"IF(Meetings2!I17=\"\",\"\",getAddress(Meetings2!I17))","v":"http://www.tabonline.com.au/2010/12/02/ST06.html"},{"$f":"IF(Meetings2!J17=\"\",\"\",getAddress(Meetings2!J17))","v":"http://www.tabonline.com.au/2010/12/02/ST07.html"},{"$f":"IF(Meetings2!K17=\"\",\"\",getAddress(Meetings2!K17))","v":"http://www.tabonline.com.au/2010/12/02/ST08.html"},{"$f":"IF(Meetings2!L17=\"\",\"\",getAddress(Meetings2!L17))","v":""},{"$f":"IF(Meetings2!M17=\"\",\"\",getAddress(Meetings2!M17))","v":""},{"$f":"IF(Meetings2!N17=\"\",\"\",getAddress(Meetings2!N17))","v":""},"","Owners: D L McLennan",{"$nulls":20},6,"",{"$f":"IF(Race!N17<>\"\",Race!C17,\"\")","v":"DACK'S FAZ"},{"$f":"IF(AX17<>\"\",Race!N17,\"\")","v":99},{"$f":"IF(AX17<>\"\",Race!I17,\"\")","v":8},{"$f":"IF(Form!I20<>\"\",LEFT(Form!C20,FIND(\"(\",Form!C20)-2),\"\")","v":""},null,{"$f":"IF(BA17=\"\",\"\",Form!A20)","v":""},{"$f":"IF($BA17=\"\",\"\",IF(ISNA(VLOOKUP(BC17,Tables!A$5:B$100,2,FALSE)),\"0\",VLOOKUP(BC17,Tables!A$5:B$100,2,FALSE)))","v":""},"",{"$f":"IF($BE17=\"\",\"0\",IF(ISNA(VLOOKUP(BE17,Tables!C$5:D$100,2,FALSE)),\"0\",VLOOKUP(BE17,Tables!C$5:D$100,2,FALSE)))","v":"0"},{"$f":"IF(BA17=\"\",\"\",Form!F20)","v":""},{"$f":"IF($BA17=\"\",\"\",IF(ISNA(VLOOKUP(BG17,Tables!E$5:F$100,2,FALSE)),\"0\",VLOOKUP(BG17,Tables!E$5:F$100,2,FALSE)))","v":""},"","","","",{"$f":"IF($BA17=\"\",\"\",IF(ISERROR(BL17),0,IF(ISNA(VLOOKUP(BK17,Tables!G$5:H$100,2,FALSE)),\"0\",VLOOKUP(BK17,Tables!G20:H$100,2,FALSE))))","v":""},{"$f":"IF($BA17=\"\",\"\",Form!G20)","v":""},"",{"$f":"IF($BA17=\"\",\"\",IF(ISNA(VLOOKUP(BO17,Tables!I$5:J$100,2,FALSE)),\"0\",VLOOKUP(BO17,Tables!I$5:J$100,2,FALSE)))","v":""},{"$f":"IF($BA17=\"\",\"\",Form!H20)","v":""},"",{"$f":"IF($BA17=\"\",\"\",IF(ISNA(VLOOKUP(BR17,Tables!K$5:L$100,2,FALSE)),\"0\",VLOOKUP(BR17,Tables!K$5:L$100,2,FALSE)))","v":""},{"$f":"IF($BA17=\"\",\"\",Form!I20)","v":""},"",{"$f":"IF($BA17=\"\",\"\",IF(ISNA(VLOOKUP(BU17,Tables!M$5:N$100,2,FALSE)),\"0\",VLOOKUP(BU17,Tables!M$5:N$100,2,FALSE)))","v":""},{"$f":"IF($BA17=\"\",\"\",INDEX(Race!$D$1:$P$100,MATCH($BA17,Race!$C$1:$C$100,0)+0,9))","v":""},"","N",{"$f":"IF($BA17=\"\",\"\",IF(ISNA(VLOOKUP(BY17,Tables!O$5:P$100,2,FALSE)),0,VLOOKUP(BY17,Tables!O$5:P$100,2,FALSE)))","v":""},"","N",{"$f":"IF($BA17=\"\",\"\",IF(ISNA(VLOOKUP(CB17,Tables!Q$5:R$100,2,FALSE)),0,VLOOKUP(CB17,Tables!Q$5:R$100,2,FALSE)))","v":""},"","N",{"$f":"IF($BA17=\"\",\"\",IF(ISNA(VLOOKUP(CE17,Tables!S$5:T$100,2,FALSE)),0,VLOOKUP(CE17,Tables!S$5:T$100,2,FALSE)))","v":""},"","N",{"$f":"IF($BA17=\"\",\"\",IF(ISNA(VLOOKUP(CH17,Tables!U$5:V$100,2,FALSE)),0,VLOOKUP(CH17,Tables!U$5:V$100,2,FALSE)))","v":""},"","",0,{"$f":"IF($BA17=\"\",\"\",IF(ISERROR(CL17),0,IF(ISNA(VLOOKUP(CL17,Tables!W$5:X$100,2,FALSE)),\"0\",VLOOKUP(CL17,Tables!W$5:X$100,2,FALSE))))","v":""},"","",0,{"$f":"IF($BA17=\"\",\"\",IF(ISERROR(CP17),0,IF(ISNA(VLOOKUP(CP17,Tables!Y$5:Z$100,2,FALSE)),\"0\",VLOOKUP(CP17,Tables!Y$5:Z$100,2,FALSE))))","v":""},"","",0,{"$f":"IF($BA17=\"\",\"\",IF(ISERROR(CT17),0,IF(ISNA(VLOOKUP(CT17,Tables!AA$5:AB$100,2,FALSE)),\"0\",VLOOKUP(CT17,Tables!AA$5:AB$100,2,FALSE))))","v":""},"",{"$f":"IF(CV17=\"\",\"\",(Form!$H$3-CV17)/CV17*100)","v":""},"",{"$f":"IF($BA17=\"\",\"\",IF(ISERROR(CX17),0,IF(ISNA(VLOOKUP(CX17,Tables!AC$5:AD$100,2,FALSE)),\"0\",VLOOKUP(CX17,Tables!AC$5:AD$100,2,FALSE))))","v":""},"","","",{"$f":"IF($BA17=\"\",\"\",IF(ISERROR(DB17),0,IF(ISNA(VLOOKUP(DB17,Tables!AE$5:AF$100,2,FALSE)),\"0\",VLOOKUP(DB17,Tables!AE$5:AF$100,2,FALSE))))","v":""},"","","","","",{"$f":"IF($BA17=\"\",\"\",IF(ISERROR(DH17),0,IF(ISNA(VLOOKUP(DG17,Tables!AG$5:AH$100,2,FALSE)),\"0\",VLOOKUP(DG17,Tables!AG$5:AH$100,2,FALSE))))","v":""},"","","",{"$f":"IF($BA17=\"\",\"\",IF(ISERROR(DL17),0,IF(ISNA(VLOOKUP(DL17,Tables!AI$5:AJ$100,2,FALSE)),\"0\",VLOOKUP(DL17,Tables!AI$5:AJ$100,2,FALSE))))","v":""},"","","","","",{"$f":"IF($BA17=\"\",\"\",IF(ISERROR(DR17),0,IF(ISNA(VLOOKUP(DQ17,Tables!AK$5:AL$100,2,FALSE)),\"0\",VLOOKUP(DQ17,Tables!AK$5:AL$100,2,FALSE))))","v":""},"","","",{"$f":"IF($BA17=\"\",\"\",IF(ISERROR(DV17),0,IF(ISNA(VLOOKUP(DV17,Tables!AM$5:AN$100,2,FALSE)),\"0\",VLOOKUP(DV17,Tables!AM$5:AN$100,2,FALSE))))","v":""},"","","","","",{"$f":"IF($BC17=\"\",\"\",IF(ISERROR(EB17),0,IF(ISNA(VLOOKUP(EA17,Tables!AO$5:AP$100,2,FALSE)),\"0\",VLOOKUP(EA17,Tables!AO$5:AP$100,2,FALSE))))","v":""},"","","",{"$f":"IF($EE17=\"\",\"0\",IF(ISNA(VLOOKUP(EF17,Tables!AQ$5:AR$100,2,FALSE)),\"0\",VLOOKUP(EF17,Tables!AQ$5:AR$100,2,FALSE)))","v":"0"},{"$f":"IF(BA17=\"\",\"\",IF(MainSheet!D24=\"Scratched\",\"\",BD17+BF17+BH17+BM17+BP17+BS17+BV17+BZ17+CC17+CF17+CI17+CM17+CQ17+CU17+CY17+DC17+DI17+DM17+DS17+DW17+EC17+EG17))","v":""}]
[{"$f":"IF(Meetings1!A18=\"\",\"\",IF(Meetings1!A18=\"END\",\"END\",IF(Meetings1!E18=\"\",\"\",getAddress(Meetings1!E18))))","v":"http://formguide.cyberhorse.com.au/index.php/Form/form.html?formdate=2010-12-02&track=H'bury&raceno=7"},{"$nulls":11},{"$f":"IF(ISNA(VLOOKUP(N18,RaceList!$J$3:$L$19,3,FALSE)),\"\",VLOOKUP(N18,RaceList!$J$3:$L$19,3,FALSE))","v":""},{"$f":"IF(Meetings2!$B18=\"\",\"\",Meetings2!$B18)","v":"MELTON (MT)"},{"$f":"IF(Meetings2!D18=\"\",\"\",getAddress(Meetings2!D18))","v":"http://www.tabonline.com.au/2010/12/02/MT01.html"},{"$f":"IF(Meetings2!E18=\"\",\"\",getAddress(Meetings2!E18))","v":"http://www.tabonline.com.au/2010/12/02/MT02.html"},{"$f":"IF(Meetings2!F18=\"\",\"\",getAddress(Meetings2!F18))","v":"http://www.tabonline.com.au/2010/12/02/MT03.html"},{"$f":"IF(Meetings2!G18=\"\",\"\",getAddress(Meetings2!G18))","v":"http://www.tabonline.com.au/2010/12/02/MT04.html"},{"$f":"IF(Meetings2!H18=\"\",\"\",getAddress(Meetings2!H18))","v":"http://www.tabonline.com.au/2010/12/02/MT05.html"},{"$f":"IF(Meetings2!I18=\"\",\"\",getAddress(Meetings2!I18))","v":"http://www.tabonline.com.au/2010/12/02/MT06.html"},{"$f":"IF(Meetings2!J18=\"\",\"\",getAddress(Meetings2!J18))","v":"http://www.tabonline.com.au/2010/12/02/MT07.html"},{"$f":"IF(Meetings2!K18=\"\",\"\",getAddress(Meetings2!K18))","v":"http://www.tabonline.com.au/2010/12/02/MT08.html"},{"$f":"IF(Meetings2!L18=\"\",\"\",getAddress(Meetings2!L18))","v":""},{"$f":"IF(Meetings2!M18=\"\",\"\",getAddress(Meetings2!M18))","v":""},{"$f":"IF(Meetings2!N18=\"\",\"\",getAddress(Meetings2!N18))","v":""},"","Career:",{"$nulls":20},6,"",{"$f":"IF(Race!N18<>\"\",Race!C18,\"\")","v":"IGOTITFROMMYMUMMA"},{"$f":"IF(AX18<>\"\",Race!N18,\"\")","v":99},{"$f":"IF(AX18<>\"\",Race!I18,\"\")","v":3},{"$f":"IF(Form!I21<>\"\",LEFT(Form!C21,FIND(\"(\",Form!C21)-2),\"\")","v":""},null,{"$f":"IF(BA18=\"\",\"\",Form!A21)","v":""},{"$f":"IF($BA18=\"\",\"\",IF(ISNA(VLOOKUP(BC18,Tables!A$5:B$100,2,FALSE)),\"0\",VLOOKUP(BC18,Tables!A$5:B$100,2,FALSE)))","v":""},"",{"$f":"IF($BE18=\"\",\"0\",IF(ISNA(VLOOKUP(BE18,Tables!C$5:D$100,2,FALSE)),\"0\",VLOOKUP(BE18,Tables!C$5:D$100,2,FALSE)))","v":"0"},{"$f":"IF(BA18=\"\",\"\",Form!F21)","v":""},{"$f":"IF($BA18=\"\",\"\",IF(ISNA(VLOOKUP(BG18,Tables!E$5:F$100,2,FALSE)),\"0\",VLOOKUP(BG18,Tables!E$5:F$100,2,FALSE)))","v":""},"","","","",{"$f":"IF($BA18=\"\",\"\",IF(ISERROR(BL18),0,IF(ISNA(VLOOKUP(BK18,Tables!G$5:H$100,2,FALSE)),\"0\",VLOOKUP(BK18,Tables!G21:H$100,2,FALSE))))","v":""},{"$f":"IF($BA18=\"\",\"\",Form!G21)","v":""},"",{"$f":"IF($BA18=\"\",\"\",IF(ISNA(VLOOKUP(BO18,Tables!I$5:J$100,2,FALSE)),\"0\",VLOOKUP(BO18,Tables!I$5:J$100,2,FALSE)))","v":""},{"$f":"IF($BA18=\"\",\"\",Form!H21)","v":""},"",{"$f":"IF($BA18=\"\",\"\",IF(ISNA(VLOOKUP(BR18,Tables!K$5:L$100,2,FALSE)),\"0\",VLOOKUP(BR18,Tables!K$5:L$100,2,FALSE)))","v":""},{"$f":"IF($BA18=\"\",\"\",Form!I21)","v":""},"",{"$f":"IF($BA18=\"\",\"\",IF(ISNA(VLOOKUP(BU18,Tables!M$5:N$100,2,FALSE)),\"0\",VLOOKUP(BU18,Tables!M$5:N$100,2,FALSE)))","v":""},{"$f":"IF($BA18=\"\",\"\",INDEX(Race!$D$1:$P$100,MATCH($BA18,Race!$C$1:$C$100,0)+0,9))","v":""},"","N",{"$f":"IF($BA18=\"\",\"\",IF(ISNA(VLOOKUP(BY18,Tables!O$5:P$100,2,FALSE)),0,VLOOKUP(BY18,Tables!O$5:P$100,2,FALSE)))","v":""},"","N",{"$f":"IF($BA18=\"\",\"\",IF(ISNA(VLOOKUP(CB18,Tables!Q$5:R$100,2,FALSE)),0,VLOOKUP(CB18,Tables!Q$5:R$100,2,FALSE)))","v":""},"","N",{"$f":"IF($BA18=\"\",\"\",IF(ISNA(VLOOKUP(CE18,Tables!S$5:T$100,2,FALSE)),0,VLOOKUP(CE18,Tables!S$5:T$100,2,FALSE)))","v":""},"","N",{"$f":"IF($BA18=\"\",\"\",IF(ISNA(VLOOKUP(CH18,Tables!U$5:V$100,2,FALSE)),0,VLOOKUP(CH18,Tables!U$5:V$100,2,FALSE)))","v":""},"","",0,{"$f":"IF($BA18=\"\",\"\",IF(ISERROR(CL18),0,IF(ISNA(VLOOKUP(CL18,Tables!W$5:X$100,2,FALSE)),\"0\",VLOOKUP(CL18,Tables!W$5:X$100,2,FALSE))))","v":""},"","",0,{"$f":"IF($BA18=\"\",\"\",IF(ISERROR(CP18),0,IF(ISNA(VLOOKUP(CP18,Tables!Y$5:Z$100,2,FALSE)),\"0\",VLOOKUP(CP18,Tables!Y$5:Z$100,2,FALSE))))","v":""},"","",0,{"$f":"IF($BA18=\"\",\"\",IF(ISERROR(CT18),0,IF(ISNA(VLOOKUP(CT18,Tables!AA$5:AB$100,2,FALSE)),\"0\",VLOOKUP(CT18,Tables!AA$5:AB$100,2,FALSE))))","v":""},"",{"$f":"IF(CV18=\"\",\"\",(Form!$H$3-CV18)/CV18*100)","v":""},"",{"$f":"IF($BA18=\"\",\"\",IF(ISERROR(CX18),0,IF(ISNA(VLOOKUP(CX18,Tables!AC$5:AD$100,2,FALSE)),\"0\",VLOOKUP(CX18,Tables!AC$5:AD$100,2,FALSE))))","v":""},"","","",{"$f":"IF($BA18=\"\",\"\",IF(ISERROR(DB18),0,IF(ISNA(VLOOKUP(DB18,Tables!AE$5:AF$100,2,FALSE)),\"0\",VLOOKUP(DB18,Tables!AE$5:AF$100,2,FALSE))))","v":""},"","","","","",{"$f":"IF($BA18=\"\",\"\",IF(ISERROR(DH18),0,IF(ISNA(VLOOKUP(DG18,Tables!AG$5:AH$100,2,FALSE)),\"0\",VLOOKUP(DG18,Tables!AG$5:AH$100,2,FALSE))))","v":""},"","","",{"$f":"IF($BA18=\"\",\"\",IF(ISERROR(DL18),0,IF(ISNA(VLOOKUP(DL18,Tables!AI$5:AJ$100,2,FALSE)),\"0\",VLOOKUP(DL18,Tables!AI$5:AJ$100,2,FALSE))))","v":""},"","","","","",{"$f":"IF($BA18=\"\",\"\",IF(ISERROR(DR18),0,IF(ISNA(VLOOKUP(DQ18,Tables!AK$5:AL$100,2,FALSE)),\"0\",VLOOKUP(DQ18,Tables!AK$5:AL$100,2,FALSE))))","v":""},"","","",{"$f":"IF($BA18=\"\",\"\",IF(ISERROR(DV18),0,IF(ISNA(VLOOKUP(DV18,Tables!AM$5:AN$100,2,FALSE)),\"0\",VLOOKUP(DV18,Tables!AM$5:AN$100,2,FALSE))))","v":""},"","","","","",{"$f":"IF($BC18=\"\",\"\",IF(ISERROR(EB18),0,IF(ISNA(VLOOKUP(EA18,Tables!AO$5:AP$100,2,FALSE)),\"0\",VLOOKUP(EA18,Tables!AO$5:AP$100,2,FALSE))))","v":""},"","","",{"$f":"IF($EE18=\"\",\"0\",IF(ISNA(VLOOKUP(EF18,Tables!AQ$5:AR$100,2,FALSE)),\"0\",VLOOKUP(EF18,Tables!AQ$5:AR$100,2,FALSE)))","v":"0"},{"$f":"IF(BA18=\"\",\"\",IF(MainSheet!D25=\"Scratched\",\"\",BD18+BF18+BH18+BM18+BP18+BS18+BV18+BZ18+CC18+CF18+CI18+CM18+CQ18+CU18+CY18+DC18+DI18+DM18+DS18+DW18+EC18+EG18))","v":""}]
[{"$f":"IF(Meetings1!A19=\"\",\"\",IF(Meetings1!A19=\"END\",\"END\",IF(Meetings1!E19=\"\",\"\",getAddress(Meetings1!E19))))","v":"http://formguide.cyberhorse.com.au/index.php/Form/form.html?formdate=2010-12-02&track=H'bury&raceno=8"},{"$nulls":11},{"$f":"IF(ISNA(VLOOKUP(N19,RaceList!$J$3:$L$19,3,FALSE)),\"\",VLOOKUP(N19,RaceList!$J$3:$L$19,3,FALSE))","v":""},{"$f":"IF(Meetings2!$B19=\"\",\"\",Meetings2!$B19)","v":"GOLD COAST (QT)"},{"$f":"IF(Meetings2!D19=\"\",\"\",getAddress(Meetings2!D19))","v":"http://www.tabonline.com.au/2010/12/02/QT01.html"},{"$f":"IF(Meetings2!E19=\"\",\"\",getAddress(Meetings2!E19))","v":"http://www.tabonline.com.au/2010/12/02/QT02.html"},{"$f":"IF(Meetings2!F19=\"\",\"\",getAddress(Meetings2!F19))","v":"http://www.tabonline.com.au/2010/12/02/QT03.html"},{"$f":"IF(Meetings2!G19=\"\",\"\",getAddress(Meetings2!G19))","v":"http://www.tabonline.com.au/2010/12/02/QT04.html"},{"$f":"IF(Meetings2!H19=\"\",\"\",getAddress(Meetings2!H19))","v":"http://www.tabonline.com.au/2010/12/02/QT05.html"},{"$f":"IF(Meetings2!I19=\"\",\"\",getAddress(Meetings2!I19))","v":"http://www.tabonline.com.au/2010/12/02/QT06.html"},{"$f":"IF(Meetings2!J19=\"\",\"\",getAddress(Meetings2!J19))","v":"http://www.tabonline.com.au/2010/12/02/QT07.html"},{"$f":"IF(Meetings2!K19=\"\",\"\",getAddress(Meetings2!K19))","v":""},{"$f":"IF(Meetings2!L19=\"\",\"\",getAddress(Meetings2!L19))","v":""},{"$f":"IF(Meetings2!M19=\"\",\"\",getAddress(Meetings2!M19))","v":""},{"$f":"IF(Meetings2!N19=\"\",\"\",getAddress(Meetings2!N19))","v":""},"","2010-02-03T14:04:00",{"$nulls":20},6,"",{"$f":"IF(Race!N19<>\"\",Race!C19,\"\")","v":"NOBLE LUSTRE"},{"$f":"IF(AX19<>\"\",Race!N19,\"\")","v":100},{"$f":"IF(AX19<>\"\",Race!I19,\"\")","v":5},{"$f":"IF(Form!I22<>\"\",LEFT(Form!C22,FIND(\"(\",Form!C22)-2),\"\")","v":""},null,{"$f":"IF(BA19=\"\",\"\",Form!A22)","v":""},{"$f":"IF($BA19=\"\",\"\",IF(ISNA(VLOOKUP(BC19,Tables!A$5:B$100,2,FALSE)),\"0\",VLOOKUP(BC19,Tables!A$5:B$100,2,FALSE)))","v":""},"",{"$f":"IF($BE19=\"\",\"0\",IF(ISNA(VLOOKUP(BE19,Tables!C$5:D$100,2,FALSE)),\"0\",VLOOKUP(BE19,Tables!C$5:D$100,2,FALSE)))","v":"0"},{"$f":"IF(BA19=\"\",\"\",Form!F22)","v":""},{"$f":"IF($BA19=\"\",\"\",IF(ISNA(VLOOKUP(BG19,Tables!E$5:F$100,2,FALSE)),\"0\",VLOOKUP(BG19,Tables!E$5:F$100,2,FALSE)))","v":""},"","","","",{"$f":"IF($BA19=\"\",\"\",IF(ISERROR(BL19),0,IF(ISNA(VLOOKUP(BK19,Tables!G$5:H$100,2,FALSE)),\"0\",VLOOKUP(BK19,Tables!G22:H$100,2,FALSE))))","v":""},{"$f":"IF($BA19=\"\",\"\",Form!G22)","v":""},"",{"$f":"IF($BA19=\"\",\"\",IF(ISNA(VLOOKUP(BO19,Tables!I$5:J$100,2,FALSE)),\"0\",VLOOKUP(BO19,Tables!I$5:J$100,2,FALSE)))","v":""},{"$f":"IF($BA19=\"\",\"\",Form!H22)","v":""},"",{"$f":"IF($BA19=\"\",\"\",IF(ISNA(VLOOKUP(BR19,Tables!K$5:L$100,2,FALSE)),\"0\",VLOOKUP(BR19,Tables!K$5:L$100,2,FALSE)))","v":""},{"$f":"IF($BA19=\"\",\"\",Form!I22)","v":""},"",{"$f":"IF($BA19=\"\",\"\",IF(ISNA(VLOOKUP(BU19,Tables!M$5:N$100,2,FALSE)),\"0\",VLOOKUP(BU19,Tables!M$5:N$100,2,FALSE)))","v":""},{"$f":"IF($BA19=\"\",\"\",INDEX(Race!$D$1:$P$100,MATCH($BA19,Race!$C$1:$C$100,0)+0,9))","v":""},"","N",{"$f":"IF($BA19=\"\",\"\",IF(ISNA(VLOOKUP(BY19,Tables!O$5:P$100,2,FALSE)),0,VLOOKUP(BY19,Tables!O$5:P$100,2,FALSE)))","v":""},"","N",{"$f":"IF($BA19=\"\",\"\",IF(ISNA(VLOOKUP(CB19,Tables!Q$5:R$100,2,FALSE)),0,VLOOKUP(CB19,Tables!Q$5:R$100,2,FALSE)))","v":""},"","N",{"$f":"IF($BA19=\"\",\"\",IF(ISNA(VLOOKUP(CE19,Tables!S$5:T$100,2,FALSE)),0,VLOOKUP(CE19,Tables!S$5:T$100,2,FALSE)))","v":""},"","N",{"$f":"IF($BA19=\"\",\"\",IF(ISNA(VLOOKUP(CH19,Tables!U$5:V$100,2,FALSE)),0,VLOOKUP(CH19,Tables!U$5:V$100,2,FALSE)))","v":""},"","",0,{"$f":"IF($BA19=\"\",\"\",IF(ISERROR(CL19),0,IF(ISNA(VLOOKUP(CL19,Tables!W$5:X$100,2,FALSE)),\"0\",VLOOKUP(CL19,Tables!W$5:X$100,2,FALSE))))","v":""},"","",0,{"$f":"IF($BA19=\"\",\"\",IF(ISERROR(CP19),0,IF(ISNA(VLOOKUP(CP19,Tables!Y$5:Z$100,2,FALSE)),\"0\",VLOOKUP(CP19,Tables!Y$5:Z$100,2,FALSE))))","v":""},"","",0,{"$f":"IF($BA19=\"\",\"\",IF(ISERROR(CT19),0,IF(ISNA(VLOOKUP(CT19,Tables!AA$5:AB$100,2,FALSE)),\"0\",VLOOKUP(CT19,Tables!AA$5:AB$100,2,FALSE))))","v":""},"",{"$f":"IF(CV19=\"\",\"\",(Form!$H$3-CV19)/CV19*100)","v":""},"",{"$f":"IF($BA19=\"\",\"\",IF(ISERROR(CX19),0,IF(ISNA(VLOOKUP(CX19,Tables!AC$5:AD$100,2,FALSE)),\"0\",VLOOKUP(CX19,Tables!AC$5:AD$100,2,FALSE))))","v":""},"","","",{"$f":"IF($BA19=\"\",\"\",IF(ISERROR(DB19),0,IF(ISNA(VLOOKUP(DB19,Tables!AE$5:AF$100,2,FALSE)),\"0\",VLOOKUP(DB19,Tables!AE$5:AF$100,2,FALSE))))","v":""},"","","","","",{"$f":"IF($BA19=\"\",\"\",IF(ISERROR(DH19),0,IF(ISNA(VLOOKUP(DG19,Tables!AG$5:AH$100,2,FALSE)),\"0\",VLOOKUP(DG19,Tables!AG$5:AH$100,2,FALSE))))","v":""},"","","",{"$f":"IF($BA19=\"\",\"\",IF(ISERROR(DL19),0,IF(ISNA(VLOOKUP(DL19,Tables!AI$5:AJ$100,2,FALSE)),\"0\",VLOOKUP(DL19,Tables!AI$5:AJ$100,2,FALSE))))","v":""},"","","","","",{"$f":"IF($BA19=\"\",\"\",IF(ISERROR(DR19),0,IF(ISNA(VLOOKUP(DQ19,Tables!AK$5:AL$100,2,FALSE)),\"0\",VLOOKUP(DQ19,Tables!AK$5:AL$100,2,FALSE))))","v":""},"","","",{"$f":"IF($BA19=\"\",\"\",IF(ISERROR(DV19),0,IF(ISNA(VLOOKUP(DV19,Tables!AM$5:AN$100,2,FALSE)),\"0\",VLOOKUP(DV19,Tables!AM$5:AN$100,2,FALSE))))","v":""},"","","","","",{"$f":"IF($BC19=\"\",\"\",IF(ISERROR(EB19),0,IF(ISNA(VLOOKUP(EA19,Tables!AO$5:AP$100,2,FALSE)),\"0\",VLOOKUP(EA19,Tables!AO$5:AP$100,2,FALSE))))","v":""},"","","",{"$f":"IF($EE19=\"\",\"0\",IF(ISNA(VLOOKUP(EF19,Tables!AQ$5:AR$100,2,FALSE)),\"0\",VLOOKUP(EF19,Tables!AQ$5:AR$100,2,FALSE)))","v":"0"},{"$f":"IF(BA19=\"\",\"\",IF(MainSheet!D26=\"Scratched\",\"\",BD19+BF19+BH19+BM19+BP19+BS19+BV19+BZ19+CC19+CF19+CI19+CM19+CQ19+CU19+CY19+DC19+DI19+DM19+DS19+DW19+EC19+EG19))","v":""}]
[{"$f":"IF(Meetings1!A20=\"\",\"\",IF(Meetings1!A20=\"END\",\"END\",IF(Meetings1!E20=\"\",\"\",getAddress(Meetings1!E20))))","v":""},{"$nulls":11},{"$f":"IF(ISNA(VLOOKUP(N20,RaceList!$J$3:$L$19,3,FALSE)),\"\",VLOOKUP(N20,RaceList!$J$3:$L$19,3,FALSE))","v":""},{"$f":"IF(Meetings2!$B20=\"\",\"\",Meetings2!$B20)","v":"NEWCASTLE (NT)"},{"$f":"IF(Meetings2!D20=\"\",\"\",getAddress(Meetings2!D20))","v":"http://www.tabonline.com.au/2010/12/02/NT01.html"},{"$f":"IF(Meetings2!E20=\"\",\"\",getAddress(Meetings2!E20))","v":"http://www.tabonline.com.au/2010/12/02/NT02.html"},{"$f":"IF(Meetings2!F20=\"\",\"\",getAddress(Meetings2!F20))","v":"http://www.tabonline.com.au/2010/12/02/NT03.html"},{"$f":"IF(Meetings2!G20=\"\",\"\",getAddress(Meetings2!G20))","v":"http://www.tabonline.com.au/2010/12/02/NT04.html"},{"$f":"IF(Meetings2!H20=\"\",\"\",getAddress(Meetings2!H20))","v":"http://www.tabonline.com.au/2010/12/02/NT05.html"},{"$f":"IF(Meetings2!I20=\"\",\"\",getAddress(Meetings2!I20))","v":"http://www.tabonline.com.au/2010/12/02/NT06.html"},{"$f":"IF(Meetings2!J20=\"\",\"\",getAddress(Meetings2!J20))","v":"http://www.tabonline.com.au/2010/12/02/NT07.html"},{"$f":"IF(Meetings2!K20=\"\",\"\",getAddress(Meetings2!K20))","v":"http://www.tabonline.com.au/2010/12/02/NT08.html"},{"$f":"IF(Meetings2!L20=\"\",\"\",getAddress(Meetings2!L20))","v":""},{"$f":"IF(Meetings2!M20=\"\",\"\",getAddress(Meetings2!M20))","v":""},{"$f":"IF(Meetings2!N20=\"\",\"\",getAddress(Meetings2!N20))","v":""},"","Fast:",{"$nulls":20},5,"",{"$f":"IF(Race!N20<>\"\",Race!C20,\"\")","v":"CHABAL"},{"$f":"IF(AX20<>\"\",Race!N20,\"\")","v":98},{"$f":"IF(AX20<>\"\",Race!I20,\"\")","v":4},{"$f":"IF(Form!I23<>\"\",LEFT(Form!C23,FIND(\"(\",Form!C23)-2),\"\")","v":""},null,{"$f":"IF(BA20=\"\",\"\",Form!A23)","v":""},{"$f":"IF($BA20=\"\",\"\",IF(ISNA(VLOOKUP(BC20,Tables!A$5:B$100,2,FALSE)),\"0\",VLOOKUP(BC20,Tables!A$5:B$100,2,FALSE)))","v":""},"",{"$f":"IF($BE20=\"\",\"0\",IF(ISNA(VLOOKUP(BE20,Tables!C$5:D$100,2,FALSE)),\"0\",VLOOKUP(BE20,Tables!C$5:D$100,2,FALSE)))","v":"0"},{"$f":"IF(BA20=\"\",\"\",Form!F23)","v":""},{"$f":"IF($BA20=\"\",\"\",IF(ISNA(VLOOKUP(BG20,Tables!E$5:F$100,2,FALSE)),\"0\",VLOOKUP(BG20,Tables!E$5:F$100,2,FALSE)))","v":""},"","","","",{"$f":"IF($BA20=\"\",\"\",IF(ISERROR(BL20),0,IF(ISNA(VLOOKUP(BK20,Tables!G$5:H$100,2,FALSE)),\"0\",VLOOKUP(BK20,Tables!G23:H$100,2,FALSE))))","v":""},{"$f":"IF($BA20=\"\",\"\",Form!G23)","v":""},"",{"$f":"IF($BA20=\"\",\"\",IF(ISNA(VLOOKUP(BO20,Tables!I$5:J$100,2,FALSE)),\"0\",VLOOKUP(BO20,Tables!I$5:J$100,2,FALSE)))","v":""},{"$f":"IF($BA20=\"\",\"\",Form!H23)","v":""},"",{"$f":"IF($BA20=\"\",\"\",IF(ISNA(VLOOKUP(BR20,Tables!K$5:L$100,2,FALSE)),\"0\",VLOOKUP(BR20,Tables!K$5:L$100,2,FALSE)))","v":""},{"$f":"IF($BA20=\"\",\"\",Form!I23)","v":""},"",{"$f":"IF($BA20=\"\",\"\",IF(ISNA(VLOOKUP(BU20,Tables!M$5:N$100,2,FALSE)),\"0\",VLOOKUP(BU20,Tables!M$5:N$100,2,FALSE)))","v":""},{"$f":"IF($BA20=\"\",\"\",INDEX(Race!$D$1:$P$100,MATCH($BA20,Race!$C$1:$C$100,0)+0,9))","v":""},"","N",{"$f":"IF($BA20=\"\",\"\",IF(ISNA(VLOOKUP(BY20,Tables!O$5:P$100,2,FALSE)),0,VLOOKUP(BY20,Tables!O$5:P$100,2,FALSE)))","v":""},"","N",{"$f":"IF($BA20=\"\",\"\",IF(ISNA(VLOOKUP(CB20,Tables!Q$5:R$100,2,FALSE)),0,VLOOKUP(CB20,Tables!Q$5:R$100,2,FALSE)))","v":""},"","N",{"$f":"IF($BA20=\"\",\"\",IF(ISNA(VLOOKUP(CE20,Tables!S$5:T$100,2,FALSE)),0,VLOOKUP(CE20,Tables!S$5:T$100,2,FALSE)))","v":""},"","N",{"$f":"IF($BA20=\"\",\"\",IF(ISNA(VLOOKUP(CH20,Tables!U$5:V$100,2,FALSE)),0,VLOOKUP(CH20,Tables!U$5:V$100,2,FALSE)))","v":""},"","",0,{"$f":"IF($BA20=\"\",\"\",IF(ISERROR(CL20),0,IF(ISNA(VLOOKUP(CL20,Tables!W$5:X$100,2,FALSE)),\"0\",VLOOKUP(CL20,Tables!W$5:X$100,2,FALSE))))","v":""},"","",0,{"$f":"IF($BA20=\"\",\"\",IF(ISERROR(CP20),0,IF(ISNA(VLOOKUP(CP20,Tables!Y$5:Z$100,2,FALSE)),\"0\",VLOOKUP(CP20,Tables!Y$5:Z$100,2,FALSE))))","v":""},"","",0,{"$f":"IF($BA20=\"\",\"\",IF(ISERROR(CT20),0,IF(ISNA(VLOOKUP(CT20,Tables!AA$5:AB$100,2,FALSE)),\"0\",VLOOKUP(CT20,Tables!AA$5:AB$100,2,FALSE))))","v":""},"",{"$f":"IF(CV20=\"\",\"\",(Form!$H$3-CV20)/CV20*100)","v":""},"",{"$f":"IF($BA20=\"\",\"\",IF(ISERROR(CX20),0,IF(ISNA(VLOOKUP(CX20,Tables!AC$5:AD$100,2,FALSE)),\"0\",VLOOKUP(CX20,Tables!AC$5:AD$100,2,FALSE))))","v":""},"","","",{"$f":"IF($BA20=\"\",\"\",IF(ISERROR(DB20),0,IF(ISNA(VLOOKUP(DB20,Tables!AE$5:AF$100,2,FALSE)),\"0\",VLOOKUP(DB20,Tables!AE$5:AF$100,2,FALSE))))","v":""},"","","","","",{"$f":"IF($BA20=\"\",\"\",IF(ISERROR(DH20),0,IF(ISNA(VLOOKUP(DG20,Tables!AG$5:AH$100,2,FALSE)),\"0\",VLOOKUP(DG20,Tables!AG$5:AH$100,2,FALSE))))","v":""},"","","",{"$f":"IF($BA20=\"\",\"\",IF(ISERROR(DL20),0,IF(ISNA(VLOOKUP(DL20,Tables!AI$5:AJ$100,2,FALSE)),\"0\",VLOOKUP(DL20,Tables!AI$5:AJ$100,2,FALSE))))","v":""},"","","","","",{"$f":"IF($BA20=\"\",\"\",IF(ISERROR(DR20),0,IF(ISNA(VLOOKUP(DQ20,Tables!AK$5:AL$100,2,FALSE)),\"0\",VLOOKUP(DQ20,Tables!AK$5:AL$100,2,FALSE))))","v":""},"","","",{"$f":"IF($BA20=\"\",\"\",IF(ISERROR(DV20),0,IF(ISNA(VLOOKUP(DV20,Tables!AM$5:AN$100,2,FALSE)),\"0\",VLOOKUP(DV20,Tables!AM$5:AN$100,2,FALSE))))","v":""},"","","","","",{"$f":"IF($BC20=\"\",\"\",IF(ISERROR(EB20),0,IF(ISNA(VLOOKUP(EA20,Tables!AO$5:AP$100,2,FALSE)),\"0\",VLOOKUP(EA20,Tables!AO$5:AP$100,2,FALSE))))","v":""},"","","",{"$f":"IF($EE20=\"\",\"0\",IF(ISNA(VLOOKUP(EF20,Tables!AQ$5:AR$100,2,FALSE)),\"0\",VLOOKUP(EF20,Tables!AQ$5:AR$100,2,FALSE)))","v":"0"},{"$f":"IF(BA20=\"\",\"\",IF(MainSheet!D27=\"Scratched\",\"\",BD20+BF20+BH20+BM20+BP20+BS20+BV20+BZ20+CC20+CF20+CI20+CM20+CQ20+CU20+CY20+DC20+DI20+DM20+DS20+DW20+EC20+EG20))","v":""}]
[{"$f":"IF(Meetings1!A21=\"\",\"\",IF(Meetings1!A21=\"END\",\"END\",IF(Meetings1!E21=\"\",\"\",getAddress(Meetings1!E21))))","v":"http://formguide.cyberhorse.com.au/index.php/Form/form.html?formdate=2010-12-02&track=Launc.&raceno=1"},{"$nulls":11},{"$f":"IF(ISNA(VLOOKUP(N21,RaceList!$J$3:$L$19,3,FALSE)),\"\",VLOOKUP(N21,RaceList!$J$3:$L$19,3,FALSE))","v":""},{"$f":"IF(Meetings2!$B21=\"\",\"\",Meetings2!$B21)","v":"BALLARAT (VT)"},{"$f":"IF(Meetings2!D21=\"\",\"\",getAddress(Meetings2!D21))","v":"http://www.tabonline.com.au/2010/12/02/VT01.html"},{"$f":"IF(Meetings2!E21=\"\",\"\",getAddress(Meetings2!E21))","v":"http://www.tabonline.com.au/2010/12/02/VT02.html"},{"$f":"IF(Meetings2!F21=\"\",\"\",getAddress(Meetings2!F21))","v":"http://www.tabonline.com.au/2010/12/02/VT03.html"},{"$f":"IF(Meetings2!G21=\"\",\"\",getAddress(Meetings2!G21))","v":"http://www.tabonline.com.au/2010/12/02/VT04.html"},{"$f":"IF(Meetings2!H21=\"\",\"\",getAddress(Meetings2!H21))","v":"http://www.tabonline.com.au/2010/12/02/VT05.html"},{"$f":"IF(Meetings2!I21=\"\",\"\",getAddress(Meetings2!I21))","v":"http://www.tabonline.com.au/2010/12/02/VT06.html"},{"$f":"IF(Meetings2!J21=\"\",\"\",getAddress(Meetings2!J21))","v":"http://www.tabonline.com.au/2010/12/02/VT07.html"},{"$f":"IF(Meetings2!K21=\"\",\"\",getAddress(Meetings2!K21))","v":"http://www.tabonline.com.au/2010/12/02/VT08.html"},{"$f":"IF(Meetings2!L21=\"\",\"\",getAddress(Meetings2!L21))","v":""},{"$f":"IF(Meetings2!M21=\"\",\"\",getAddress(Meetings2!M21))","v":""},{"$f":"IF(Meetings2!N21=\"\",\"\",getAddress(Meetings2!N21))","v":""},"","1:1-0-0",{"$nulls":20},5,"",{"$f":"IF(Race!N21<>\"\",Race!C21,\"\")","v":""},{"$f":"IF(AX21<>\"\",Race!N21,\"\")","v":""},{"$f":"IF(AX21<>\"\",Race!I21,\"\")","v":""},{"$f":"IF(Form!I24<>\"\",LEFT(Form!C24,FIND(\"(\",Form!C24)-2),\"\")","v":""},null,{"$f":"IF(BA21=\"\",\"\",Form!A24)","v":""},{"$f":"IF($BA21=\"\",\"\",IF(ISNA(VLOOKUP(BC21,Tables!A$5:B$100,2,FALSE)),\"0\",VLOOKUP(BC21,Tables!A$5:B$100,2,FALSE)))","v":""},"",{"$f":"IF($BE21=\"\",\"0\",IF(ISNA(VLOOKUP(BE21,Tables!C$5:D$100,2,FALSE)),\"0\",VLOOKUP(BE21,Tables!C$5:D$100,2,FALSE)))","v":"0"},{"$f":"IF(BA21=\"\",\"\",Form!F24)","v":""},{"$f":"IF($BA21=\"\",\"\",IF(ISNA(VLOOKUP(BG21,Tables!E$5:F$100,2,FALSE)),\"0\",VLOOKUP(BG21,Tables!E$5:F$100,2,FALSE)))","v":""},"","","","",{"$f":"IF($BA21=\"\",\"\",IF(ISERROR(BL21),0,IF(ISNA(VLOOKUP(BK21,Tables!G$5:H$100,2,FALSE)),\"0\",VLOOKUP(BK21,Tables!G24:H$100,2,FALSE))))","v":""},{"$f":"IF($BA21=\"\",\"\",Form!G24)","v":""},"",{"$f":"IF($BA21=\"\",\"\",IF(ISNA(VLOOKUP(BO21,Tables!I$5:J$100,2,FALSE)),\"0\",VLOOKUP(BO21,Tables!I$5:J$100,2,FALSE)))","v":""},{"$f":"IF($BA21=\"\",\"\",Form!H24)","v":""},"",{"$f":"IF($BA21=\"\",\"\",IF(ISNA(VLOOKUP(BR21,Tables!K$5:L$100,2,FALSE)),\"0\",VLOOKUP(BR21,Tables!K$5:L$100,2,FALSE)))","v":""},{"$f":"IF($BA21=\"\",\"\",Form!I24)","v":""},"",{"$f":"IF($BA21=\"\",\"\",IF(ISNA(VLOOKUP(BU21,Tables!M$5:N$100,2,FALSE)),\"0\",VLOOKUP(BU21,Tables!M$5:N$100,2,FALSE)))","v":""},{"$f":"IF($BA21=\"\",\"\",INDEX(Race!$D$1:$P$100,MATCH($BA21,Race!$C$1:$C$100,0)+0,9))","v":""},"","N",{"$f":"IF($BA21=\"\",\"\",IF(ISNA(VLOOKUP(BY21,Tables!O$5:P$100,2,FALSE)),0,VLOOKUP(BY21,Tables!O$5:P$100,2,FALSE)))","v":""},"","N",{"$f":"IF($BA21=\"\",\"\",IF(ISNA(VLOOKUP(CB21,Tables!Q$5:R$100,2,FALSE)),0,VLOOKUP(CB21,Tables!Q$5:R$100,2,FALSE)))","v":""},"","N",{"$f":"IF($BA21=\"\",\"\",IF(ISNA(VLOOKUP(CE21,Tables!S$5:T$100,2,FALSE)),0,VLOOKUP(CE21,Tables!S$5:T$100,2,FALSE)))","v":""},"","N",{"$f":"IF($BA21=\"\",\"\",IF(ISNA(VLOOKUP(CH21,Tables!U$5:V$100,2,FALSE)),0,VLOOKUP(CH21,Tables!U$5:V$100,2,FALSE)))","v":""},"","",0,{"$f":"IF($BA21=\"\",\"\",IF(ISERROR(CL21),0,IF(ISNA(VLOOKUP(CL21,Tables!W$5:X$100,2,FALSE)),\"0\",VLOOKUP(CL21,Tables!W$5:X$100,2,FALSE))))","v":""},"","",0,{"$f":"IF($BA21=\"\",\"\",IF(ISERROR(CP21),0,IF(ISNA(VLOOKUP(CP21,Tables!Y$5:Z$100,2,FALSE)),\"0\",VLOOKUP(CP21,Tables!Y$5:Z$100,2,FALSE))))","v":""},"","",0,{"$f":"IF($BA21=\"\",\"\",IF(ISERROR(CT21),0,IF(ISNA(VLOOKUP(CT21,Tables!AA$5:AB$100,2,FALSE)),\"0\",VLOOKUP(CT21,Tables!AA$5:AB$100,2,FALSE))))","v":""},"",{"$f":"IF(CV21=\"\",\"\",(Form!$H$3-CV21)/CV21*100)","v":""},"",{"$f":"IF($BA21=\"\",\"\",IF(ISERROR(CX21),0,IF(ISNA(VLOOKUP(CX21,Tables!AC$5:AD$100,2,FALSE)),\"0\",VLOOKUP(CX21,Tables!AC$5:AD$100,2,FALSE))))","v":""},"","","",{"$f":"IF($BA21=\"\",\"\",IF(ISERROR(DB21),0,IF(ISNA(VLOOKUP(DB21,Tables!AE$5:AF$100,2,FALSE)),\"0\",VLOOKUP(DB21,Tables!AE$5:AF$100,2,FALSE))))","v":""},"","","","","",{"$f":"IF($BA21=\"\",\"\",IF(ISERROR(DH21),0,IF(ISNA(VLOOKUP(DG21,Tables!AG$5:AH$100,2,FALSE)),\"0\",VLOOKUP(DG21,Tables!AG$5:AH$100,2,FALSE))))","v":""},"","","",{"$f":"IF($BA21=\"\",\"\",IF(ISERROR(DL21),0,IF(ISNA(VLOOKUP(DL21,Tables!AI$5:AJ$100,2,FALSE)),\"0\",VLOOKUP(DL21,Tables!AI$5:AJ$100,2,FALSE))))","v":""},"","","","","",{"$f":"IF($BA21=\"\",\"\",IF(ISERROR(DR21),0,IF(ISNA(VLOOKUP(DQ21,Tables!AK$5:AL$100,2,FALSE)),\"0\",VLOOKUP(DQ21,Tables!AK$5:AL$100,2,FALSE))))","v":""},"","","",{"$f":"IF($BA21=\"\",\"\",IF(ISERROR(DV21),0,IF(ISNA(VLOOKUP(DV21,Tables!AM$5:AN$100,2,FALSE)),\"0\",VLOOKUP(DV21,Tables!AM$5:AN$100,2,FALSE))))","v":""},"","","","","",{"$f":"IF($BC21=\"\",\"\",IF(ISERROR(EB21),0,IF(ISNA(VLOOKUP(EA21,Tables!AO$5:AP$100,2,FALSE)),\"0\",VLOOKUP(EA21,Tables!AO$5:AP$100,2,FALSE))))","v":""},"","","",{"$f":"IF($EE21=\"\",\"0\",IF(ISNA(VLOOKUP(EF21,Tables!AQ$5:AR$100,2,FALSE)),\"0\",VLOOKUP(EF21,Tables!AQ$5:AR$100,2,FALSE)))","v":"0"},{"$f":"IF(BA21=\"\",\"\",IF(MainSheet!D28=\"Scratched\",\"\",BD21+BF21+BH21+BM21+BP21+BS21+BV21+BZ21+CC21+CF21+CI21+CM21+CQ21+CU21+CY21+DC21+DI21+DM21+DS21+DW21+EC21+EG21))","v":""}]
[{"$f":"IF(Meetings1!A22=\"\",\"\",IF(Meetings1!A22=\"END\",\"END\",IF(Meetings1!E22=\"\",\"\",getAddress(Meetings1!E22))))","v":"http://formguide.cyberhorse.com.au/index.php/Form/form.html?formdate=2010-12-02&track=Launc.&raceno=2"},{"$nulls":11},{"$f":"IF(ISNA(VLOOKUP(N22,RaceList!$J$3:$L$19,3,FALSE)),\"\",VLOOKUP(N22,RaceList!$J$3:$L$19,3,FALSE))","v":""},{"$f":"IF(Meetings2!$B22=\"\",\"\",Meetings2!$B22)","v":"HARVEY (PT)"},{"$f":"IF(Meetings2!D22=\"\",\"\",getAddress(Meetings2!D22))","v":"http://www.tabonline.com.au/2010/12/02/PT01.html"},{"$f":"IF(Meetings2!E22=\"\",\"\",getAddress(Meetings2!E22))","v":"http://www.tabonline.com.au/2010/12/02/PT02.html"},{"$f":"IF(Meetings2!F22=\"\",\"\",getAddress(Meetings2!F22))","v":"http://www.tabonline.com.au/2010/12/02/PT03.html"},{"$f":"IF(Meetings2!G22=\"\",\"\",getAddress(Meetings2!G22))","v":"http://www.tabonline.com.au/2010/12/02/PT04.html"},{"$f":"IF(Meetings2!H22=\"\",\"\",getAddress(Meetings2!H22))","v":"http://www.tabonline.com.au/2010/12/02/PT05.html"},{"$f":"IF(Meetings2!I22=\"\",\"\",getAddress(Meetings2!I22))","v":"http://www.tabonline.com.au/2010/12/02/PT06.html"},{"$f":"IF(Meetings2!J22=\"\",\"\",getAddress(Meetings2!J22))","v":"http://www.tabonline.com.au/2010/12/02/PT07.html"},{"$f":"IF(Meetings2!K22=\"\",\"\",getAddress(Meetings2!K22))","v":"http://www.tabonline.com.au/2010/12/02/PT08.html"},{"$f":"IF(Meetings2!L22=\"\",\"\",getAddress(Meetings2!L22))","v":""},{"$f":"IF(Meetings2!M22=\"\",\"\",getAddress(Meetings2!M22))","v":""},{"$f":"IF(Meetings2!N22=\"\",\"\",getAddress(Meetings2!N22))","v":""},"","3-12 2.0L"," Roma","2010-11-20"," 1200m"," Good"," Race 4"," Plate"," Cls 6",15000,-1500," Ali Taylor",4," Cd 57.5-0.0"," (SW)"," 1:12.99"," ()"," 7/1"," Settled-- 1200-- 800-- Turn--"," 1-Fidakat 57.0",null,null,5,"",{"$f":"IF(Race!N22<>\"\",Race!C22,\"\")","v":"LOLA BRIGIDA"},{"$f":"IF(AX22<>\"\",Race!N22,\"\")","v":96},{"$f":"IF(AX22<>\"\",Race!I22,\"\")","v":7},{"$f":"IF(Form!I25<>\"\",LEFT(Form!C25,FIND(\"(\",Form!C25)-2),\"\")","v":""},null,{"$f":"IF(BA22=\"\",\"\",Form!A25)","v":""},{"$f":"IF($BA22=\"\",\"\",IF(ISNA(VLOOKUP(BC22,Tables!A$5:B$100,2,FALSE)),\"0\",VLOOKUP(BC22,Tables!A$5:B$100,2,FALSE)))","v":""},"",{"$f":"IF($BE22=\"\",\"0\",IF(ISNA(VLOOKUP(BE22,Tables!C$5:D$100,2,FALSE)),\"0\",VLOOKUP(BE22,Tables!C$5:D$100,2,FALSE)))","v":"0"},{"$f":"IF(BA22=\"\",\"\",Form!F25)","v":""},{"$f":"IF($BA22=\"\",\"\",IF(ISNA(VLOOKUP(BG22,Tables!E$5:F$100,2,FALSE)),\"0\",VLOOKUP(BG22,Tables!E$5:F$100,2,FALSE)))","v":""},"","","","",{"$f":"IF($BA22=\"\",\"\",IF(ISERROR(BL22),0,IF(ISNA(VLOOKUP(BK22,Tables!G$5:H$100,2,FALSE)),\"0\",VLOOKUP(BK22,Tables!G25:H$100,2,FALSE))))","v":""},{"$f":"IF($BA22=\"\",\"\",Form!G25)","v":""},"",{"$f":"IF($BA22=\"\",\"\",IF(ISNA(VLOOKUP(BO22,Tables!I$5:J$100,2,FALSE)),\"0\",VLOOKUP(BO22,Tables!I$5:J$100,2,FALSE)))","v":""},{"$f":"IF($BA22=\"\",\"\",Form!H25)","v":""},"",{"$f":"IF($BA22=\"\",\"\",IF(ISNA(VLOOKUP(BR22,Tables!K$5:L$100,2,FALSE)),\"0\",VLOOKUP(BR22,Tables!K$5:L$100,2,FALSE)))","v":""},{"$f":"IF($BA22=\"\",\"\",Form!I25)","v":""},"",{"$f":"IF($BA22=\"\",\"\",IF(ISNA(VLOOKUP(BU22,Tables!M$5:N$100,2,FALSE)),\"0\",VLOOKUP(BU22,Tables!M$5:N$100,2,FALSE)))","v":""},{"$f":"IF($BA22=\"\",\"\",INDEX(Race!$D$1:$P$100,MATCH($BA22,Race!$C$1:$C$100,0)+0,9))","v":""},"","N",{"$f":"IF($BA22=\"\",\"\",IF(ISNA(VLOOKUP(BY22,Tables!O$5:P$100,2,FALSE)),0,VLOOKUP(BY22,Tables!O$5:P$100,2,FALSE)))","v":""},"","N",{"$f":"IF($BA22=\"\",\"\",IF(ISNA(VLOOKUP(CB22,Tables!Q$5:R$100,2,FALSE)),0,VLOOKUP(CB22,Tables!Q$5:R$100,2,FALSE)))","v":""},"","N",{"$f":"IF($BA22=\"\",\"\",IF(ISNA(VLOOKUP(CE22,Tables!S$5:T$100,2,FALSE)),0,VLOOKUP(CE22,Tables!S$5:T$100,2,FALSE)))","v":""},"","N",{"$f":"IF($BA22=\"\",\"\",IF(ISNA(VLOOKUP(CH22,Tables!U$5:V$100,2,FALSE)),0,VLOOKUP(CH22,Tables!U$5:V$100,2,FALSE)))","v":""},"","",0,{"$f":"IF($BA22=\"\",\"\",IF(ISERROR(CL22),0,IF(ISNA(VLOOKUP(CL22,Tables!W$5:X$100,2,FALSE)),\"0\",VLOOKUP(CL22,Tables!W$5:X$100,2,FALSE))))","v":""},"","",0,{"$f":"IF($BA22=\"\",\"\",IF(ISERROR(CP22),0,IF(ISNA(VLOOKUP(CP22,Tables!Y$5:Z$100,2,FALSE)),\"0\",VLOOKUP(CP22,Tables!Y$5:Z$100,2,FALSE))))","v":""},"","",0,{"$f":"IF($BA22=\"\",\"\",IF(ISERROR(CT22),0,IF(ISNA(VLOOKUP(CT22,Tables!AA$5:AB$100,2,FALSE)),\"0\",VLOOKUP(CT22,Tables!AA$5:AB$100,2,FALSE))))","v":""},"",{"$f":"IF(CV22=\"\",\"\",(Form!$H$3-CV22)/CV22*100)","v":""},"",{"$f":"IF($BA22=\"\",\"\",IF(ISERROR(CX22),0,IF(ISNA(VLOOKUP(CX22,Tables!AC$5:AD$100,2,FALSE)),\"0\",VLOOKUP(CX22,Tables!AC$5:AD$100,2,FALSE))))","v":""},"","","",{"$f":"IF($BA22=\"\",\"\",IF(ISERROR(DB22),0,IF(ISNA(VLOOKUP(DB22,Tables!AE$5:AF$100,2,FALSE)),\"0\",VLOOKUP(DB22,Tables!AE$5:AF$100,2,FALSE))))","v":""},"","","","","",{"$f":"IF($BA22=\"\",\"\",IF(ISERROR(DH22),0,IF(ISNA(VLOOKUP(DG22,Tables!AG$5:AH$100,2,FALSE)),\"0\",VLOOKUP(DG22,Tables!AG$5:AH$100,2,FALSE))))","v":""},"","","",{"$f":"IF($BA22=\"\",\"\",IF(ISERROR(DL22),0,IF(ISNA(VLOOKUP(DL22,Tables!AI$5:AJ$100,2,FALSE)),\"0\",VLOOKUP(DL22,Tables!AI$5:AJ$100,2,FALSE))))","v":""},"","","","","",{"$f":"IF($BA22=\"\",\"\",IF(ISERROR(DR22),0,IF(ISNA(VLOOKUP(DQ22,Tables!AK$5:AL$100,2,FALSE)),\"0\",VLOOKUP(DQ22,Tables!AK$5:AL$100,2,FALSE))))","v":""},"","","",{"$f":"IF($BA22=\"\",\"\",IF(ISERROR(DV22),0,IF(ISNA(VLOOKUP(DV22,Tables!AM$5:AN$100,2,FALSE)),\"0\",VLOOKUP(DV22,Tables!AM$5:AN$100,2,FALSE))))","v":""},"","","","","",{"$f":"IF($BC22=\"\",\"\",IF(ISERROR(EB22),0,IF(ISNA(VLOOKUP(EA22,Tables!AO$5:AP$100,2,FALSE)),\"0\",VLOOKUP(EA22,Tables!AO$5:AP$100,2,FALSE))))","v":""},"","","",{"$f":"IF($EE22=\"\",\"0\",IF(ISNA(VLOOKUP(EF22,Tables!AQ$5:AR$100,2,FALSE)),\"0\",VLOOKUP(EF22,Tables!AQ$5:AR$100,2,FALSE)))","v":"0"},{"$f":"IF(BA22=\"\",\"\",IF(MainSheet!D29=\"Scratched\",\"\",BD22+BF22+BH22+BM22+BP22+BS22+BV22+BZ22+CC22+CF22+CI22+CM22+CQ22+CU22+CY22+DC22+DI22+DM22+DS22+DW22+EC22+EG22))","v":""}]
[{"$f":"IF(Meetings1!A23=\"\",\"\",IF(Meetings1!A23=\"END\",\"END\",IF(Meetings1!E23=\"\",\"\",getAddress(Meetings1!E23))))","v":"http://formguide.cyberhorse.com.au/index.php/Form/form.html?formdate=2010-12-02&track=Launc.&raceno=3"},{"$nulls":11},{"$f":"IF(ISNA(VLOOKUP(N23,RaceList!$J$3:$L$19,3,FALSE)),\"\",VLOOKUP(N23,RaceList!$J$3:$L$19,3,FALSE))","v":""},{"$f":"IF(Meetings2!$B23=\"\",\"\",Meetings2!$B23)","v":"VINCENNES (FT)"},{"$f":"IF(Meetings2!D23=\"\",\"\",getAddress(Meetings2!D23))","v":"http://www.tabonline.com.au/2010/12/02/FT01.html"},{"$f":"IF(Meetings2!E23=\"\",\"\",getAddress(Meetings2!E23))","v":"http://www.tabonline.com.au/2010/12/02/FT02.html"},{"$f":"IF(Meetings2!F23=\"\",\"\",getAddress(Meetings2!F23))","v":"http://www.tabonline.com.au/2010/12/02/FT03.html"},{"$f":"IF(Meetings2!G23=\"\",\"\",getAddress(Meetings2!G23))","v":""},{"$f":"IF(Meetings2!H23=\"\",\"\",getAddress(Meetings2!H23))","v":"http://www.tabonline.com.au/2010/12/02/FT05.html"},{"$f":"IF(Meetings2!I23=\"\",\"\",getAddress(Meetings2!I23))","v":""},{"$f":"IF(Meetings2!J23=\"\",\"\",getAddress(Meetings2!J23))","v":""},{"$f":"IF(Meetings2!K23=\"\",\"\",getAddress(Meetings2!K23))","v":""},{"$f":"IF(Meetings2!L23=\"\",\"\",getAddress(Meetings2!L23))","v":""},{"$f":"IF(Meetings2!M23=\"\",\"\",getAddress(Meetings2!M23))","v":""},{"$f":"IF(Meetings2!N23=\"\",\"\",getAddress(Meetings2!N23))","v":""},"","2-9 0.1L"," Emrld","2010-11-06"," 1200m"," Good"," Race 3"," Hcp"," Cls 4",6000,-1200," Ali Taylor",8," Cd 60.5-0.0",-55," 1:09.56"," ()"," 13/4"," Settled-- 1200-- 800-- Turn--"," 1-Senorina 53.0",null,null,5,"",{"$f":"IF(Race!N23<>\"\",Race!C23,\"\")","v":"ZENACITY"},{"$f":"IF(AX23<>\"\",Race!N23,\"\")","v":92},{"$f":"IF(AX23<>\"\",Race!I23,\"\")","v":1},{"$f":"IF(Form!I26<>\"\",LEFT(Form!C26,FIND(\"(\",Form!C26)-2),\"\")","v":""},null,{"$f":"IF(BA23=\"\",\"\",Form!A26)","v":""},{"$f":"IF($BA23=\"\",\"\",IF(ISNA(VLOOKUP(BC23,Tables!A$5:B$100,2,FALSE)),\"0\",VLOOKUP(BC23,Tables!A$5:B$100,2,FALSE)))","v":""},"",{"$f":"IF($BE23=\"\",\"0\",IF(ISNA(VLOOKUP(BE23,Tables!C$5:D$100,2,FALSE)),\"0\",VLOOKUP(BE23,Tables!C$5:D$100,2,FALSE)))","v":"0"},{"$f":"IF(BA23=\"\",\"\",Form!F26)","v":""},{"$f":"IF($BA23=\"\",\"\",IF(ISNA(VLOOKUP(BG23,Tables!E$5:F$100,2,FALSE)),\"0\",VLOOKUP(BG23,Tables!E$5:F$100,2,FALSE)))","v":""},"","","","",{"$f":"IF($BA23=\"\",\"\",IF(ISERROR(BL23),0,IF(ISNA(VLOOKUP(BK23,Tables!G$5:H$100,2,FALSE)),\"0\",VLOOKUP(BK23,Tables!G26:H$100,2,FALSE))))","v":""},{"$f":"IF($BA23=\"\",\"\",Form!G26)","v":""},"",{"$f":"IF($BA23=\"\",\"\",IF(ISNA(VLOOKUP(BO23,Tables!I$5:J$100,2,FALSE)),\"0\",VLOOKUP(BO23,Tables!I$5:J$100,2,FALSE)))","v":""},{"$f":"IF($BA23=\"\",\"\",Form!H26)","v":""},"",{"$f":"IF($BA23=\"\",\"\",IF(ISNA(VLOOKUP(BR23,Tables!K$5:L$100,2,FALSE)),\"0\",VLOOKUP(BR23,Tables!K$5:L$100,2,FALSE)))","v":""},{"$f":"IF($BA23=\"\",\"\",Form!I26)","v":""},"",{"$f":"IF($BA23=\"\",\"\",IF(ISNA(VLOOKUP(BU23,Tables!M$5:N$100,2,FALSE)),\"0\",VLOOKUP(BU23,Tables!M$5:N$100,2,FALSE)))","v":""},{"$f":"IF($BA23=\"\",\"\",INDEX(Race!$D$1:$P$100,MATCH($BA23,Race!$C$1:$C$100,0)+0,9))","v":""},"","N",{"$f":"IF($BA23=\"\",\"\",IF(ISNA(VLOOKUP(BY23,Tables!O$5:P$100,2,FALSE)),0,VLOOKUP(BY23,Tables!O$5:P$100,2,FALSE)))","v":""},"","N",{"$f":"IF($BA23=\"\",\"\",IF(ISNA(VLOOKUP(CB23,Tables!Q$5:R$100,2,FALSE)),0,VLOOKUP(CB23,Tables!Q$5:R$100,2,FALSE)))","v":""},"","N",{"$f":"IF($BA23=\"\",\"\",IF(ISNA(VLOOKUP(CE23,Tables!S$5:T$100,2,FALSE)),0,VLOOKUP(CE23,Tables!S$5:T$100,2,FALSE)))","v":""},"","N",{"$f":"IF($BA23=\"\",\"\",IF(ISNA(VLOOKUP(CH23,Tables!U$5:V$100,2,FALSE)),0,VLOOKUP(CH23,Tables!U$5:V$100,2,FALSE)))","v":""},"","",0,{"$f":"IF($BA23=\"\",\"\",IF(ISERROR(CL23),0,IF(ISNA(VLOOKUP(CL23,Tables!W$5:X$100,2,FALSE)),\"0\",VLOOKUP(CL23,Tables!W$5:X$100,2,FALSE))))","v":""},"","",0,{"$f":"IF($BA23=\"\",\"\",IF(ISERROR(CP23),0,IF(ISNA(VLOOKUP(CP23,Tables!Y$5:Z$100,2,FALSE)),\"0\",VLOOKUP(CP23,Tables!Y$5:Z$100,2,FALSE))))","v":""},"","",0,{"$f":"IF($BA23=\"\",\"\",IF(ISERROR(CT23),0,IF(ISNA(VLOOKUP(CT23,Tables!AA$5:AB$100,2,FALSE)),\"0\",VLOOKUP(CT23,Tables!AA$5:AB$100,2,FALSE))))","v":""},"",{"$f":"IF(CV23=\"\",\"\",(Form!$H$3-CV23)/CV23*100)","v":""},"",{"$f":"IF($BA23=\"\",\"\",IF(ISERROR(CX23),0,IF(ISNA(VLOOKUP(CX23,Tables!AC$5:AD$100,2,FALSE)),\"0\",VLOOKUP(CX23,Tables!AC$5:AD$100,2,FALSE))))","v":""},"","","",{"$f":"IF($BA23=\"\",\"\",IF(ISERROR(DB23),0,IF(ISNA(VLOOKUP(DB23,Tables!AE$5:AF$100,2,FALSE)),\"0\",VLOOKUP(DB23,Tables!AE$5:AF$100,2,FALSE))))","v":""},"","","","","",{"$f":"IF($BA23=\"\",\"\",IF(ISERROR(DH23),0,IF(ISNA(VLOOKUP(DG23,Tables!AG$5:AH$100,2,FALSE)),\"0\",VLOOKUP(DG23,Tables!AG$5:AH$100,2,FALSE))))","v":""},"","","",{"$f":"IF($BA23=\"\",\"\",IF(ISERROR(DL23),0,IF(ISNA(VLOOKUP(DL23,Tables!AI$5:AJ$100,2,FALSE)),\"0\",VLOOKUP(DL23,Tables!AI$5:AJ$100,2,FALSE))))","v":""},"","","","","",{"$f":"IF($BA23=\"\",\"\",IF(ISERROR(DR23),0,IF(ISNA(VLOOKUP(DQ23,Tables!AK$5:AL$100,2,FALSE)),\"0\",VLOOKUP(DQ23,Tables!AK$5:AL$100,2,FALSE))))","v":""},"","","",{"$f":"IF($BA23=\"\",\"\",IF(ISERROR(DV23),0,IF(ISNA(VLOOKUP(DV23,Tables!AM$5:AN$100,2,FALSE)),\"0\",VLOOKUP(DV23,Tables!AM$5:AN$100,2,FALSE))))","v":""},"","","","","",{"$f":"IF($BC23=\"\",\"\",IF(ISERROR(EB23),0,IF(ISNA(VLOOKUP(EA23,Tables!AO$5:AP$100,2,FALSE)),\"0\",VLOOKUP(EA23,Tables!AO$5:AP$100,2,FALSE))))","v":""},"","","",{"$f":"IF($EE23=\"\",\"0\",IF(ISNA(VLOOKUP(EF23,Tables!AQ$5:AR$100,2,FALSE)),\"0\",VLOOKUP(EF23,Tables!AQ$5:AR$100,2,FALSE)))","v":"0"},{"$f":"IF(BA23=\"\",\"\",IF(MainSheet!D30=\"Scratched\",\"\",BD23+BF23+BH23+BM23+BP23+BS23+BV23+BZ23+CC23+CF23+CI23+CM23+CQ23+CU23+CY23+DC23+DI23+DM23+DS23+DW23+EC23+EG23))","v":""}]
[{"$f":"IF(Meetings1!A24=\"\",\"\",IF(Meetings1!A24=\"END\",\"END\",IF(Meetings1!E24=\"\",\"\",getAddress(Meetings1!E24))))","v":"http://formguide.cyberhorse.com.au/index.php/Form/form.html?formdate=2010-12-02&track=Launc.&raceno=4"},{"$nulls":11},{"$f":"IF(ISNA(VLOOKUP(N24,RaceList!$J$3:$L$19,3,FALSE)),\"\",VLOOKUP(N24,RaceList!$J$3:$L$19,3,FALSE))","v":""},{"$f":"IF(Meetings2!$B24=\"\",\"\",Meetings2!$B24)","v":"ASCOT PARK (ZT)"},{"$nulls":12},"8-10 4.7L"," G Cst","2010-10-28"," 1100m"," Dead"," Race 6"," Hcp"," Cls 5",12000,0," C McIver",1," Cd 54.5-0.0",-54," 1:04.47",-34.630000000000003," 10/1"," Settled-5 1200-- 800-- Turn-10"," 1-Tonkatsu 55.5",null,null,5,"",{"$f":"IF(Race!N24<>\"\",Race!C24,\"\")","v":"DANDY KAT"},{"$f":"IF(AX24<>\"\",Race!N24,\"\")","v":94},{"$f":"IF(AX24<>\"\",Race!I24,\"\")","v":6},{"$f":"IF(Form!I27<>\"\",LEFT(Form!C27,FIND(\"(\",Form!C27)-2),\"\")","v":""},null,{"$f":"IF(BA24=\"\",\"\",Form!A27)","v":""},{"$f":"IF($BA24=\"\",\"\",IF(ISNA(VLOOKUP(BC24,Tables!A$5:B$100,2,FALSE)),\"0\",VLOOKUP(BC24,Tables!A$5:B$100,2,FALSE)))","v":""},"",{"$f":"IF($BE24=\"\",\"0\",IF(ISNA(VLOOKUP(BE24,Tables!C$5:D$100,2,FALSE)),\"0\",VLOOKUP(BE24,Tables!C$5:D$100,2,FALSE)))","v":"0"},{"$f":"IF(BA24=\"\",\"\",Form!F27)","v":""},{"$f":"IF($BA24=\"\",\"\",IF(ISNA(VLOOKUP(BG24,Tables!E$5:F$100,2,FALSE)),\"0\",VLOOKUP(BG24,Tables!E$5:F$100,2,FALSE)))","v":""},"","","","",{"$f":"IF($BA24=\"\",\"\",IF(ISERROR(BL24),0,IF(ISNA(VLOOKUP(BK24,Tables!G$5:H$100,2,FALSE)),\"0\",VLOOKUP(BK24,Tables!G27:H$100,2,FALSE))))","v":""},{"$f":"IF($BA24=\"\",\"\",Form!G27)","v":""},"",{"$f":"IF($BA24=\"\",\"\",IF(ISNA(VLOOKUP(BO24,Tables!I$5:J$100,2,FALSE)),\"0\",VLOOKUP(BO24,Tables!I$5:J$100,2,FALSE)))","v":""},{"$f":"IF($BA24=\"\",\"\",Form!H27)","v":""},"",{"$f":"IF($BA24=\"\",\"\",IF(ISNA(VLOOKUP(BR24,Tables!K$5:L$100,2,FALSE)),\"0\",VLOOKUP(BR24,Tables!K$5:L$100,2,FALSE)))","v":""},{"$f":"IF($BA24=\"\",\"\",Form!I27)","v":""},"",{"$f":"IF($BA24=\"\",\"\",IF(ISNA(VLOOKUP(BU24,Tables!M$5:N$100,2,FALSE)),\"0\",VLOOKUP(BU24,Tables!M$5:N$100,2,FALSE)))","v":""},{"$f":"IF($BA24=\"\",\"\",INDEX(Race!$D$1:$P$100,MATCH($BA24,Race!$C$1:$C$100,0)+0,9))","v":""},"","N",{"$f":"IF($BA24=\"\",\"\",IF(ISNA(VLOOKUP(BY24,Tables!O$5:P$100,2,FALSE)),0,VLOOKUP(BY24,Tables!O$5:P$100,2,FALSE)))","v":""},"","N",{"$f":"IF($BA24=\"\",\"\",IF(ISNA(VLOOKUP(CB24,Tables!Q$5:R$100,2,FALSE)),0,VLOOKUP(CB24,Tables!Q$5:R$100,2,FALSE)))","v":""},"","N",{"$f":"IF($BA24=\"\",\"\",IF(ISNA(VLOOKUP(CE24,Tables!S$5:T$100,2,FALSE)),0,VLOOKUP(CE24,Tables!S$5:T$100,2,FALSE)))","v":""},"","N",{"$f":"IF($BA24=\"\",\"\",IF(ISNA(VLOOKUP(CH24,Tables!U$5:V$100,2,FALSE)),0,VLOOKUP(CH24,Tables!U$5:V$100,2,FALSE)))","v":""},"","",0,{"$f":"IF($BA24=\"\",\"\",IF(ISERROR(CL24),0,IF(ISNA(VLOOKUP(CL24,Tables!W$5:X$100,2,FALSE)),\"0\",VLOOKUP(CL24,Tables!W$5:X$100,2,FALSE))))","v":""},"","",0,{"$f":"IF($BA24=\"\",\"\",IF(ISERROR(CP24),0,IF(ISNA(VLOOKUP(CP24,Tables!Y$5:Z$100,2,FALSE)),\"0\",VLOOKUP(CP24,Tables!Y$5:Z$100,2,FALSE))))","v":""},"","",0,{"$f":"IF($BA24=\"\",\"\",IF(ISERROR(CT24),0,IF(ISNA(VLOOKUP(CT24,Tables!AA$5:AB$100,2,FALSE)),\"0\",VLOOKUP(CT24,Tables!AA$5:AB$100,2,FALSE))))","v":""},"",{"$f":"IF(CV24=\"\",\"\",(Form!$H$3-CV24)/CV24*100)","v":""},"",{"$f":"IF($BA24=\"\",\"\",IF(ISERROR(CX24),0,IF(ISNA(VLOOKUP(CX24,Tables!AC$5:AD$100,2,FALSE)),\"0\",VLOOKUP(CX24,Tables!AC$5:AD$100,2,FALSE))))","v":""},"","","",{"$f":"IF($BA24=\"\",\"\",IF(ISERROR(DB24),0,IF(ISNA(VLOOKUP(DB24,Tables!AE$5:AF$100,2,FALSE)),\"0\",VLOOKUP(DB24,Tables!AE$5:AF$100,2,FALSE))))","v":""},"","","","","",{"$f":"IF($BA24=\"\",\"\",IF(ISERROR(DH24),0,IF(ISNA(VLOOKUP(DG24,Tables!AG$5:AH$100,2,FALSE)),\"0\",VLOOKUP(DG24,Tables!AG$5:AH$100,2,FALSE))))","v":""},"","","",{"$f":"IF($BA24=\"\",\"\",IF(ISERROR(DL24),0,IF(ISNA(VLOOKUP(DL24,Tables!AI$5:AJ$100,2,FALSE)),\"0\",VLOOKUP(DL24,Tables!AI$5:AJ$100,2,FALSE))))","v":""},"","","","","",{"$f":"IF($BA24=\"\",\"\",IF(ISERROR(DR24),0,IF(ISNA(VLOOKUP(DQ24,Tables!AK$5:AL$100,2,FALSE)),\"0\",VLOOKUP(DQ24,Tables!AK$5:AL$100,2,FALSE))))","v":""},"","","",{"$f":"IF($BA24=\"\",\"\",IF(ISERROR(DV24),0,IF(ISNA(VLOOKUP(DV24,Tables!AM$5:AN$100,2,FALSE)),\"0\",VLOOKUP(DV24,Tables!AM$5:AN$100,2,FALSE))))","v":""},"","","","","",{"$f":"IF($BC24=\"\",\"\",IF(ISERROR(EB24),0,IF(ISNA(VLOOKUP(EA24,Tables!AO$5:AP$100,2,FALSE)),\"0\",VLOOKUP(EA24,Tables!AO$5:AP$100,2,FALSE))))","v":""},"","","",{"$f":"IF($EE24=\"\",\"0\",IF(ISNA(VLOOKUP(EF24,Tables!AQ$5:AR$100,2,FALSE)),\"0\",VLOOKUP(EF24,Tables!AQ$5:AR$100,2,FALSE)))","v":"0"},{"$f":"IF(BA24=\"\",\"\",IF(MainSheet!D31=\"Scratched\",\"\",BD24+BF24+BH24+BM24+BP24+BS24+BV24+BZ24+CC24+CF24+CI24+CM24+CQ24+CU24+CY24+DC24+DI24+DM24+DS24+DW24+EC24+EG24))","v":""}]
[{"$f":"IF(Meetings1!A25=\"\",\"\",IF(Meetings1!A25=\"END\",\"END\",IF(Meetings1!E25=\"\",\"\",getAddress(Meetings1!E25))))","v":"http://formguide.cyberhorse.com.au/index.php/Form/form.html?formdate=2010-12-02&track=Launc.&raceno=5"},{"$nulls":11},{"$f":"IF(ISNA(VLOOKUP(N25,RaceList!$J$3:$L$19,3,FALSE)),\"\",VLOOKUP(N25,RaceList!$J$3:$L$19,3,FALSE))","v":""},{"$f":"IF(Meetings2!$B25=\"\",\"\",Meetings2!$B25)","v":""},{"$f":"IF(Meetings2!D24=\"\",\"\",getAddress(Meetings2!D24))","v":"http://www.tabonline.com.au/2010/12/02/ZT01.html"},{"$f":"IF(Meetings2!E24=\"\",\"\",getAddress(Meetings2!E24))","v":"http://www.tabonline.com.au/2010/12/02/ZT02.html"},{"$f":"IF(Meetings2!F24=\"\",\"\",getAddress(Meetings2!F24))","v":"http://www.tabonline.com.au/2010/12/02/ZT03.html"},{"$f":"IF(Meetings2!G24=\"\",\"\",getAddress(Meetings2!G24))","v":"http://www.tabonline.com.au/2010/12/02/ZT04.html"},{"$f":"IF(Meetings2!H24=\"\",\"\",getAddress(Meetings2!H24))","v":"http://www.tabonline.com.au/2010/12/02/ZT05.html"},{"$f":"IF(Meetings2!I24=\"\",\"\",getAddress(Meetings2!I24))","v":"http://www.tabonline.com.au/2010/12/02/ZT06.html"},{"$f":"IF(Meetings2!J24=\"\",\"\",getAddress(Meetings2!J24))","v":"http://www.tabonline.com.au/2010/12/02/ZT07.html"},{"$f":"IF(Meetings2!K24=\"\",\"\",getAddress(Meetings2!K24))","v":"http://www.tabonline.com.au/2010/12/02/ZT08.html"},{"$f":"IF(Meetings2!L24=\"\",\"\",getAddress(Meetings2!L24))","v":"http://www.tabonline.com.au/2010/12/02/ZT09.html"},{"$f":"IF(Meetings2!M24=\"\",\"\",getAddress(Meetings2!M24))","v":""},{"$f":"IF(Meetings2!N24=\"\",\"\",getAddress(Meetings2!N24))","v":""},{"$f":"IF(AA25=\"\",\"\",IF(ISERROR(MID(AA25,FIND(\" \",AA25,1)+1,FIND(\"(\",AA25,1)-FIND(\" \",AA25,1)-2)),\"\",MID(AA25,FIND(\" \",AA25,1)+1,FIND(\"(\",AA25,1)-FIND(\" \",AA25,1)-2)))","v":""},"4-11 3.4L"," Emrld","2010-10-09"," 1000m"," Good"," Race 2"," Hcp"," Cls 4",6000,-200," R Cox",3," Cd 59.5--1.5",-55," 0:57.38"," ()"," 1/1F"," Settled-- 1200-- 800-- Turn--"," 1-Black Angus 56.0",null,null,4,"",{"$f":"IF(Race!N25<>\"\",Race!C25,\"\")","v":"FU MIN BU"},{"$f":"IF(AX25<>\"\",Race!N25,\"\")","v":96},{"$f":"IF(AX25<>\"\",Race!I25,\"\")","v":9},{"$f":"IF(Form!I28<>\"\",LEFT(Form!C28,FIND(\"(\",Form!C28)-2),\"\")","v":""},null,{"$f":"IF(BA25=\"\",\"\",Form!A28)","v":""},{"$f":"IF($BA25=\"\",\"\",IF(ISNA(VLOOKUP(BC25,Tables!A$5:B$100,2,FALSE)),\"0\",VLOOKUP(BC25,Tables!A$5:B$100,2,FALSE)))","v":""},"",{"$f":"IF($BE25=\"\",\"0\",IF(ISNA(VLOOKUP(BE25,Tables!C$5:D$100,2,FALSE)),\"0\",VLOOKUP(BE25,Tables!C$5:D$100,2,FALSE)))","v":"0"},{"$f":"IF(BA25=\"\",\"\",Form!F28)","v":""},{"$f":"IF($BA25=\"\",\"\",IF(ISNA(VLOOKUP(BG25,Tables!E$5:F$100,2,FALSE)),\"0\",VLOOKUP(BG25,Tables!E$5:F$100,2,FALSE)))","v":""},"","","","",{"$f":"IF($BA25=\"\",\"\",IF(ISERROR(BL25),0,IF(ISNA(VLOOKUP(BK25,Tables!G$5:H$100,2,FALSE)),\"0\",VLOOKUP(BK25,Tables!G28:H$100,2,FALSE))))","v":""},{"$f":"IF($BA25=\"\",\"\",Form!G27)","v":""},"",{"$f":"IF($BA25=\"\",\"\",IF(ISNA(VLOOKUP(BO25,Tables!I$5:J$100,2,FALSE)),\"0\",VLOOKUP(BO25,Tables!I$5:J$100,2,FALSE)))","v":""},{"$f":"IF($BA25=\"\",\"\",Form!H27)","v":""},"",{"$f":"IF($BA25=\"\",\"\",IF(ISNA(VLOOKUP(BR25,Tables!K$5:L$100,2,FALSE)),\"0\",VLOOKUP(BR25,Tables!K$5:L$100,2,FALSE)))","v":""},{"$f":"IF($BA25=\"\",\"\",Form!I28)","v":""},"",{"$f":"IF($BA25=\"\",\"\",IF(ISNA(VLOOKUP(BU25,Tables!M$5:N$100,2,FALSE)),\"0\",VLOOKUP(BU25,Tables!M$5:N$100,2,FALSE)))","v":""},{"$f":"IF($BA25=\"\",\"\",INDEX(Race!$D$1:$P$100,MATCH($BA25,Race!$C$1:$C$100,0)+0,9))","v":""},"","N",{"$f":"IF($BA25=\"\",\"\",IF(ISNA(VLOOKUP(BY25,Tables!O$5:P$100,2,FALSE)),0,VLOOKUP(BY25,Tables!O$5:P$100,2,FALSE)))","v":""},"","N",{"$f":"IF($BA25=\"\",\"\",IF(ISNA(VLOOKUP(CB25,Tables!Q$5:R$100,2,FALSE)),0,VLOOKUP(CB25,Tables!Q$5:R$100,2,FALSE)))","v":""},"","N",{"$f":"IF($BA25=\"\",\"\",IF(ISNA(VLOOKUP(CE25,Tables!S$5:T$100,2,FALSE)),0,VLOOKUP(CE25,Tables!S$5:T$100,2,FALSE)))","v":""},"","N",{"$f":"IF($BA25=\"\",\"\",IF(ISNA(VLOOKUP(CH25,Tables!U$5:V$100,2,FALSE)),0,VLOOKUP(CH25,Tables!U$5:V$100,2,FALSE)))","v":""},"","",0,{"$f":"IF($BA25=\"\",\"\",IF(ISERROR(CL25),0,IF(ISNA(VLOOKUP(CL25,Tables!W$5:X$100,2,FALSE)),\"0\",VLOOKUP(CL25,Tables!W$5:X$100,2,FALSE))))","v":""},"","",0,{"$f":"IF($BA25=\"\",\"\",IF(ISERROR(CP25),0,IF(ISNA(VLOOKUP(CP25,Tables!Y$5:Z$100,2,FALSE)),\"0\",VLOOKUP(CP25,Tables!Y$5:Z$100,2,FALSE))))","v":""},"","",0,{"$f":"IF($BA25=\"\",\"\",IF(ISERROR(CT25),0,IF(ISNA(VLOOKUP(CT25,Tables!AA$5:AB$100,2,FALSE)),\"0\",VLOOKUP(CT25,Tables!AA$5:AB$100,2,FALSE))))","v":""},"",{"$f":"IF(CV25=\"\",\"\",(Form!$H$3-CV25)/CV25*100)","v":""},"",{"$f":"IF($BA25=\"\",\"\",IF(ISERROR(CX25),0,IF(ISNA(VLOOKUP(CX25,Tables!AC$5:AD$100,2,FALSE)),\"0\",VLOOKUP(CX25,Tables!AC$5:AD$100,2,FALSE))))","v":""},"","","",{"$f":"IF($BA25=\"\",\"\",IF(ISERROR(DB25),0,IF(ISNA(VLOOKUP(DB25,Tables!AE$5:AF$100,2,FALSE)),\"0\",VLOOKUP(DB25,Tables!AE$5:AF$100,2,FALSE))))","v":""},"","","","","",{"$f":"IF($BA25=\"\",\"\",IF(ISERROR(DH25),0,IF(ISNA(VLOOKUP(DG25,Tables!AG$5:AH$100,2,FALSE)),\"0\",VLOOKUP(DG25,Tables!AG$5:AH$100,2,FALSE))))","v":""},"","","",{"$f":"IF($BA25=\"\",\"\",IF(ISERROR(DL25),0,IF(ISNA(VLOOKUP(DL25,Tables!AI$5:AJ$100,2,FALSE)),\"0\",VLOOKUP(DL25,Tables!AI$5:AJ$100,2,FALSE))))","v":""},"","","","","",{"$f":"IF($BA25=\"\",\"\",IF(ISERROR(DR25),0,IF(ISNA(VLOOKUP(DQ25,Tables!AK$5:AL$100,2,FALSE)),\"0\",VLOOKUP(DQ25,Tables!AK$5:AL$100,2,FALSE))))","v":""},"","","",{"$f":"IF($BA25=\"\",\"\",IF(ISERROR(DV25),0,IF(ISNA(VLOOKUP(DV25,Tables!AM$5:AN$100,2,FALSE)),\"0\",VLOOKUP(DV25,Tables!AM$5:AN$100,2,FALSE))))","v":""},"","","","","",{"$f":"IF($BC25=\"\",\"\",IF(ISERROR(EB25),0,IF(ISNA(VLOOKUP(EA25,Tables!AO$5:AP$100,2,FALSE)),\"0\",VLOOKUP(EA25,Tables!AO$5:AP$100,2,FALSE))))","v":""},"","","",{"$f":"IF($EE25=\"\",\"0\",IF(ISNA(VLOOKUP(EF25,Tables!AQ$5:AR$100,2,FALSE)),\"0\",VLOOKUP(EF25,Tables!AQ$5:AR$100,2,FALSE)))","v":"0"},{"$f":"IF(BA25=\"\",\"\",IF(MainSheet!D32=\"Scratched\",\"\",BD25+BF25+BH25+BM25+BP25+BS25+BV25+BZ25+CC25+CF25+CI25+CM25+CQ25+CU25+CY25+DC25+DI25+DM25+DS25+DW25+EC25+EG25))","v":""}]
[{"$f":"IF(Meetings1!A26=\"\",\"\",IF(Meetings1!A26=\"END\",\"END\",IF(Meetings1!E26=\"\",\"\",getAddress(Meetings1!E26))))","v":"http://formguide.cyberhorse.com.au/index.php/Form/form.html?formdate=2010-12-02&track=Launc.&raceno=6"},{"$nulls":11},{"$f":"IF(ISNA(VLOOKUP(N26,RaceList!$J$3:$L$19,3,FALSE)),\"\",VLOOKUP(N26,RaceList!$J$3:$L$19,3,FALSE))","v":""},{"$f":"IF(Meetings2!$B26=\"\",\"\",Meetings2!$B26)","v":"ALBION PARK (BG)"},{"$f":"IF(Meetings2!D25=\"\",\"\",getAddress(Meetings2!D25))","v":{"$error":"#VALUE!"}},{"$f":"IF(Meetings2!E25=\"\",\"\",getAddress(Meetings2!E25))","v":{"$error":"#VALUE!"}},{"$f":"IF(Meetings2!F25=\"\",\"\",getAddress(Meetings2!F25))","v":{"$error":"#VALUE!"}},{"$f":"IF(Meetings2!G25=\"\",\"\",getAddress(Meetings2!G25))","v":{"$error":"#VALUE!"}},{"$f":"IF(Meetings2!H25=\"\",\"\",getAddress(Meetings2!H25))","v":{"$error":"#VALUE!"}},{"$f":"IF(Meetings2!I25=\"\",\"\",getAddress(Meetings2!I25))","v":{"$error":"#VALUE!"}},{"$f":"IF(Meetings2!J25=\"\",\"\",getAddress(Meetings2!J25))","v":{"$error":"#VALUE!"}},{"$f":"IF(Meetings2!K25=\"\",\"\",getAddress(Meetings2!K25))","v":{"$error":"#VALUE!"}},{"$f":"IF(Meetings2!L25=\"\",\"\",getAddress(Meetings2!L25))","v":{"$error":"#VALUE!"}},{"$f":"IF(Meetings2!M25=\"\",\"\",getAddress(Meetings2!M25))","v":{"$error":"#VALUE!"}},{"$f":"IF(Meetings2!N25=\"\",\"\",getAddress(Meetings2!N25))","v":{"$error":"#VALUE!"}},"","1-9 0.3L"," Rocky","2010-09-23"," 970m"," Heavy"," Race 6"," Hcp"," Cls 3",12000,-7800," C McIver",6," Cd 56.5-0.0",-54," 0:57.42",-34.270000000000003," 7/2"," Settled-- 1200-- 800-- Turn--"," 2-Basheeba 54.5",null,null,4,"",{"$f":"IF(Race!N26<>\"\",Race!C26,\"\")","v":""},{"$f":"IF(AX26<>\"\",Race!N26,\"\")","v":""},{"$f":"IF(AX26<>\"\",Race!I26,\"\")","v":""}]
[{"$f":"IF(Meetings1!A27=\"\",\"\",IF(Meetings1!A27=\"END\",\"END\",IF(Meetings1!E27=\"\",\"\",getAddress(Meetings1!E27))))","v":"http://formguide.cyberhorse.com.au/index.php/Form/form.html?formdate=2010-12-02&track=Launc.&raceno=7"},{"$nulls":11},{"$f":"IF(ISNA(VLOOKUP(N27,RaceList!$J$3:$L$19,3,FALSE)),\"\",VLOOKUP(N27,RaceList!$J$3:$L$19,3,FALSE))","v":""},{"$f":"IF(Meetings2!$B27=\"\",\"\",Meetings2!$B27)","v":"DAPTO (SG)"},{"$f":"IF(Meetings2!D26=\"\",\"\",getAddress(Meetings2!D26))","v":"http://www.tabonline.com.au/2010/12/02/BG01.html"},{"$f":"IF(Meetings2!E26=\"\",\"\",getAddress(Meetings2!E26))","v":"http://www.tabonline.com.au/2010/12/02/BG02.html"},{"$f":"IF(Meetings2!F26=\"\",\"\",getAddress(Meetings2!F26))","v":"http://www.tabonline.com.au/2010/12/02/BG03.html"},{"$f":"IF(Meetings2!G26=\"\",\"\",getAddress(Meetings2!G26))","v":"http://www.tabonline.com.au/2010/12/02/BG04.html"},{"$f":"IF(Meetings2!H26=\"\",\"\",getAddress(Meetings2!H26))","v":"http://www.tabonline.com.au/2010/12/02/BG05.html"},{"$f":"IF(Meetings2!I26=\"\",\"\",getAddress(Meetings2!I26))","v":"http://www.tabonline.com.au/2010/12/02/BG06.html"},{"$f":"IF(Meetings2!J26=\"\",\"\",getAddress(Meetings2!J26))","v":"http://www.tabonline.com.au/2010/12/02/BG07.html"},{"$f":"IF(Meetings2!K26=\"\",\"\",getAddress(Meetings2!K26))","v":"http://www.tabonline.com.au/2010/12/02/BG08.html"},{"$f":"IF(Meetings2!L26=\"\",\"\",getAddress(Meetings2!L26))","v":"http://www.tabonline.com.au/2010/12/02/BG09.html"},{"$f":"IF(Meetings2!M26=\"\",\"\",getAddress(Meetings2!M26))","v":"http://www.tabonline.com.au/2010/12/02/BG10.html"},{"$f":"IF(Meetings2!N26=\"\",\"\",getAddress(Meetings2!N26))","v":""},"","1-7 4.3L"," Chinch","2008-11-08"," 1200m"," Dead"," Race 2"," Plate"," Cls 3",6500,-4200," L McCoy",6," Cd 58.0-0.0"," (SW)"," 1:10.02"," ()"," 8/11F"," Settled-- 1200-- 800-- Turn--"," 2-My Kavita 54.5",null,null,4,"",{"$f":"IF(Race!N27<>\"\",Race!C27,\"\")","v":""},{"$f":"IF(AX27<>\"\",Race!N27,\"\")","v":""},{"$f":"IF(AX27<>\"\",Race!I27,\"\")","v":""},{"$nulls":66},{"$f":"IF($BI27=\"\",\"\",ROUND(0+DN27/0.5,0)*0.5)","v":""},{"$nulls":9},{"$f":"IF($BI27=\"\",\"\",ROUND(0+DX27/0.5,0)*0.5)","v":""},{"$f":"IF($BI27=\"\",\"\",ROUND(0+DY27/0.5,0)*0.5)","v":""}]
[{"$f":"IF(Meetings1!A28=\"\",\"\",IF(Meetings1!A28=\"END\",\"END\",IF(Meetings1!E28=\"\",\"\",getAddress(Meetings1!E28))))","v":"http://formguide.cyberhorse.com.au/index.php/Form/form.html?formdate=2010-12-02&track=Launc.&raceno=8"},{"$nulls":11},{"$f":"IF(ISNA(VLOOKUP(N28,RaceList!$J$3:$L$19,3,FALSE)),\"\",VLOOKUP(N28,RaceList!$J$3:$L$19,3,FALSE))","v":""},{"$f":"IF(Meetings2!$B28=\"\",\"\",Meetings2!$B28)","v":"SANDOWN PARK (MG)"},{"$f":"IF(Meetings2!D27=\"\",\"\",getAddress(Meetings2!D27))","v":"http://www.tabonline.com.au/2010/12/02/SG01.html"},{"$f":"IF(Meetings2!E27=\"\",\"\",getAddress(Meetings2!E27))","v":"http://www.tabonline.com.au/2010/12/02/SG02.html"},{"$f":"IF(Meetings2!F27=\"\",\"\",getAddress(Meetings2!F27))","v":"http://www.tabonline.com.au/2010/12/02/SG03.html"},{"$f":"IF(Meetings2!G27=\"\",\"\",getAddress(Meetings2!G27))","v":"http://www.tabonline.com.au/2010/12/02/SG04.html"},{"$f":"IF(Meetings2!H27=\"\",\"\",getAddress(Meetings2!H27))","v":"http://www.tabonline.com.au/2010/12/02/SG05.html"},{"$f":"IF(Meetings2!I27=\"\",\"\",getAddress(Meetings2!I27))","v":"http://www.tabonline.com.au/2010/12/02/SG06.html"},{"$f":"IF(Meetings2!J27=\"\",\"\",getAddress(Meetings2!J27))","v":"http://www.tabonline.com.au/2010/12/02/SG07.html"},{"$f":"IF(Meetings2!K27=\"\",\"\",getAddress(Meetings2!K27))","v":"http://www.tabonline.com.au/2010/12/02/SG08.html"},{"$f":"IF(Meetings2!L27=\"\",\"\",getAddress(Meetings2!L27))","v":"http://www.tabonline.com.au/2010/12/02/SG09.html"},{"$f":"IF(Meetings2!M27=\"\",\"\",getAddress(Meetings2!M27))","v":"http://www.tabonline.com.au/2010/12/02/SG10.html"},{"$f":"IF(Meetings2!N27=\"\",\"\",getAddress(Meetings2!N27))","v":""},"","2-8 3.0L"," Twba","2008-10-24"," 1000m"," Good"," Race 8"," 3yo+ Hcp"," Cls 3 3+",10000,-2000," L McCoy",3," Cd 54.0-0.0",-54," 0:58.95",-34.590000000000003," 13/4"," Settled-2 1200-- 800-- Turn-2"," 1-Morcombe 52.0",null,null,4,"",{"$f":"IF(Race!N28<>\"\",Race!C28,\"\")","v":""},{"$f":"IF(AX28<>\"\",Race!N28,\"\")","v":""},{"$f":"IF(AX28<>\"\",Race!I28,\"\")","v":""}]
[{"$f":"IF(Meetings1!A29=\"\",\"\",IF(Meetings1!A29=\"END\",\"END\",IF(Meetings1!E29=\"\",\"\",getAddress(Meetings1!E29))))","v":""},{"$nulls":11},{"$f":"IF(ISNA(VLOOKUP(N29,RaceList!$J$3:$L$19,3,FALSE)),\"\",VLOOKUP(N29,RaceList!$J$3:$L$19,3,FALSE))","v":""},{"$f":"IF(Meetings2!$B29=\"\",\"\",Meetings2!$B29)","v":"MAITLAND (NG)"},{"$f":"IF(Meetings2!D28=\"\",\"\",getAddress(Meetings2!D28))","v":"http://www.tabonline.com.au/2010/12/02/MG01.html"},{"$f":"IF(Meetings2!E28=\"\",\"\",getAddress(Meetings2!E28))","v":"http://www.tabonline.com.au/2010/12/02/MG02.html"},{"$f":"IF(Meetings2!F28=\"\",\"\",getAddress(Meetings2!F28))","v":"http://www.tabonline.com.au/2010/12/02/MG03.html"},{"$f":"IF(Meetings2!G28=\"\",\"\",getAddress(Meetings2!G28))","v":"http://www.tabonline.com.au/2010/12/02/MG04.html"},{"$f":"IF(Meetings2!H28=\"\",\"\",getAddress(Meetings2!H28))","v":"http://www.tabonline.com.au/2010/12/02/MG05.html"},{"$f":"IF(Meetings2!I28=\"\",\"\",getAddress(Meetings2!I28))","v":"http://www.tabonline.com.au/2010/12/02/MG06.html"},{"$f":"IF(Meetings2!J28=\"\",\"\",getAddress(Meetings2!J28))","v":"http://www.tabonline.com.au/2010/12/02/MG07.html"},{"$f":"IF(Meetings2!K28=\"\",\"\",getAddress(Meetings2!K28))","v":"http://www.tabonline.com.au/2010/12/02/MG08.html"},{"$f":"IF(Meetings2!L28=\"\",\"\",getAddress(Meetings2!L28))","v":"http://www.tabonline.com.au/2010/12/02/MG09.html"},{"$f":"IF(Meetings2!M28=\"\",\"\",getAddress(Meetings2!M28))","v":"http://www.tabonline.com.au/2010/12/02/MG10.html"},{"$f":"IF(Meetings2!N28=\"\",\"\",getAddress(Meetings2!N28))","v":"http://www.tabonline.com.au/2010/12/02/MG11.html"},"","1-9 2.5L"," Twba","2008-10-11"," 1012m"," Slow"," Race 2"," 3yo+ Hcp"," Cls 1 3+",10000,-6500," C Eaton",1," Cd 54.0-0.0",-54," 1:01.05",-36.049999999999997," 8/1"," Settled-1 1200-- 800-- Turn-1"," 2-Magical Joker 58.0",null,null,4,"",{"$f":"IF(Race!N29<>\"\",Race!C29,\"\")","v":""},{"$f":"IF(AX29<>\"\",Race!N29,\"\")","v":""},{"$f":"IF(AX29<>\"\",Race!I29,\"\")","v":""}]
[{"$f":"IF(Meetings1!A30=\"\",\"\",IF(Meetings1!A30=\"END\",\"END\",IF(Meetings1!E30=\"\",\"\",getAddress(Meetings1!E30))))","v":"http://formguide.cyberhorse.com.au/index.php/Form/form.html?formdate=2010-12-02&track=Pinjra&raceno=1"},{"$nulls":11},{"$f":"IF(ISNA(VLOOKUP(N30,RaceList!$J$3:$L$19,3,FALSE)),\"\",VLOOKUP(N30,RaceList!$J$3:$L$19,3,FALSE))","v":""},{"$f":"IF(Meetings2!$B30=\"\",\"\",Meetings2!$B30)","v":"SHEPPARTON (VG)"},{"$f":"IF(Meetings2!D29=\"\",\"\",getAddress(Meetings2!D29))","v":"http://www.tabonline.com.au/2010/12/02/NG01.html"},{"$f":"IF(Meetings2!E29=\"\",\"\",getAddress(Meetings2!E29))","v":"http://www.tabonline.com.au/2010/12/02/NG02.html"},{"$f":"IF(Meetings2!F29=\"\",\"\",getAddress(Meetings2!F29))","v":"http://www.tabonline.com.au/2010/12/02/NG03.html"},{"$f":"IF(Meetings2!G29=\"\",\"\",getAddress(Meetings2!G29))","v":"http://www.tabonline.com.au/2010/12/02/NG04.html"},{"$f":"IF(Meetings2!H29=\"\",\"\",getAddress(Meetings2!H29))","v":"http://www.tabonline.com.au/2010/12/02/NG05.html"},{"$f":"IF(Meetings2!I29=\"\",\"\",getAddress(Meetings2!I29))","v":"http://www.tabonline.com.au/2010/12/02/NG06.html"},{"$f":"IF(Meetings2!J29=\"\",\"\",getAddress(Meetings2!J29))","v":"http://www.tabonline.com.au/2010/12/02/NG07.html"},{"$f":"IF(Meetings2!K29=\"\",\"\",getAddress(Meetings2!K29))","v":"http://www.tabonline.com.au/2010/12/02/NG08.html"},{"$f":"IF(Meetings2!L29=\"\",\"\",getAddress(Meetings2!L29))","v":"http://www.tabonline.com.au/2010/12/02/NG09.html"},{"$f":"IF(Meetings2!M29=\"\",\"\",getAddress(Meetings2!M29))","v":"http://www.tabonline.com.au/2010/12/02/NG10.html"},{"$f":"IF(Meetings2!N29=\"\",\"\",getAddress(Meetings2!N29))","v":""},"","1-10 2.5L"," Taroom","2008-09-27"," 1000m"," Fast"," Race 1"," 3yo+ Mdn"," Mdn 3+",8000,-5200," L McCoy",1," Cd 57.0-0.0"," (SW)"," 0:58.86"," ()"," 2/1F"," Settled-- 1200-- 800-- Turn--"," 2-Mon Jolie 56.5",null,null,3,"",{"$f":"IF(Race!N30<>\"\",Race!C30,\"\")","v":""},{"$f":"IF(AX30<>\"\",Race!N30,\"\")","v":""},{"$f":"IF(AX30<>\"\",Race!I30,\"\")","v":""}]
[{"$f":"IF(Meetings1!A31=\"\",\"\",IF(Meetings1!A31=\"END\",\"END\",IF(Meetings1!E31=\"\",\"\",getAddress(Meetings1!E31))))","v":"http://formguide.cyberhorse.com.au/index.php/Form/form.html?formdate=2010-12-02&track=Pinjra&raceno=2"},{"$nulls":13},{"$f":"IF(Meetings2!D30=\"\",\"\",getAddress(Meetings2!D30))","v":"http://www.tabonline.com.au/2010/12/02/VG01.html"},{"$f":"IF(Meetings2!E30=\"\",\"\",getAddress(Meetings2!E30))","v":"http://www.tabonline.com.au/2010/12/02/VG02.html"},{"$f":"IF(Meetings2!F30=\"\",\"\",getAddress(Meetings2!F30))","v":"http://www.tabonline.com.au/2010/12/02/VG03.html"},{"$f":"IF(Meetings2!G30=\"\",\"\",getAddress(Meetings2!G30))","v":"http://www.tabonline.com.au/2010/12/02/VG04.html"},{"$f":"IF(Meetings2!H30=\"\",\"\",getAddress(Meetings2!H30))","v":"http://www.tabonline.com.au/2010/12/02/VG05.html"},{"$f":"IF(Meetings2!I30=\"\",\"\",getAddress(Meetings2!I30))","v":"http://www.tabonline.com.au/2010/12/02/VG06.html"},{"$f":"IF(Meetings2!J30=\"\",\"\",getAddress(Meetings2!J30))","v":"http://www.tabonline.com.au/2010/12/02/VG07.html"},{"$f":"IF(Meetings2!K30=\"\",\"\",getAddress(Meetings2!K30))","v":"http://www.tabonline.com.au/2010/12/02/VG08.html"},{"$f":"IF(Meetings2!L30=\"\",\"\",getAddress(Meetings2!L30))","v":"http://www.tabonline.com.au/2010/12/02/VG09.html"},{"$f":"IF(Meetings2!M30=\"\",\"\",getAddress(Meetings2!M30))","v":"http://www.tabonline.com.au/2010/12/02/VG10.html"},{"$f":"IF(Meetings2!N30=\"\",\"\",getAddress(Meetings2!N30))","v":"http://www.tabonline.com.au/2010/12/02/VG11.html"},"","7-10 10.3L"," Rocky","2008-04-19"," 1200m"," Good"," Race 4"," 2yo Classic"," Open 2",30000,0," L McCoy",9," Cd 57.0-0.0",-54," 1:12.27"," ()"," 6/1"," Settled-- 1200-- 800-- Turn--"," 1-Ready Royal 55.0",null,null,3,"",{"$f":"IF(Race!N31<>\"\",Race!C31,\"\")","v":""},{"$f":"IF(AX31<>\"\",Race!N31,\"\")","v":""},{"$f":"IF(AX31<>\"\",Race!I31,\"\")","v":""}]
[{"$f":"IF(Meetings1!A32=\"\",\"\",IF(Meetings1!A32=\"END\",\"END\",IF(Meetings1!E32=\"\",\"\",getAddress(Meetings1!E32))))","v":"http://formguide.cyberhorse.com.au/index.php/Form/form.html?formdate=2010-12-02&track=Pinjra&raceno=3"},{"$nulls":13},{"$f":"IF(Meetings2!D31=\"\",\"\",getAddress(Meetings2!D31))","v":"http://www.tabonline.com.au/2010/12/02/AG01.html"},{"$f":"IF(Meetings2!E31=\"\",\"\",getAddress(Meetings2!E31))","v":"http://www.tabonline.com.au/2010/12/02/AG02.html"},{"$f":"IF(Meetings2!F31=\"\",\"\",getAddress(Meetings2!F31))","v":"http://www.tabonline.com.au/2010/12/02/AG03.html"},{"$f":"IF(Meetings2!G31=\"\",\"\",getAddress(Meetings2!G31))","v":"http://www.tabonline.com.au/2010/12/02/AG04.html"},{"$f":"IF(Meetings2!H31=\"\",\"\",getAddress(Meetings2!H31))","v":"http://www.tabonline.com.au/2010/12/02/AG05.html"},{"$f":"IF(Meetings2!I31=\"\",\"\",getAddress(Meetings2!I31))","v":"http://www.tabonline.com.au/2010/12/02/AG06.html"},{"$f":"IF(Meetings2!J31=\"\",\"\",getAddress(Meetings2!J31))","v":"http://www.tabonline.com.au/2010/12/02/AG07.html"},{"$f":"IF(Meetings2!K31=\"\",\"\",getAddress(Meetings2!K31))","v":"http://www.tabonline.com.au/2010/12/02/AG08.html"},{"$f":"IF(Meetings2!L31=\"\",\"\",getAddress(Meetings2!L31))","v":"http://www.tabonline.com.au/2010/12/02/AG09.html"},{"$f":"IF(Meetings2!M31=\"\",\"\",getAddress(Meetings2!M31))","v":"http://www.tabonline.com.au/2010/12/02/AG10.html"},{"$f":"IF(Meetings2!N31=\"\",\"\",getAddress(Meetings2!N31))","v":"http://www.tabonline.com.au/2010/12/02/AG11.html"},"Igotitfrommymumma","2 Igotitfrommymumma (3) 55.5kg 6yo b g",{"$nulls":20},3,"",{"$f":"IF(Race!N32<>\"\",Race!C32,\"\")","v":""},{"$f":"IF(AX32<>\"\",Race!N32,\"\")","v":""},{"$f":"IF(AX32<>\"\",Race!I32,\"\")","v":""}]
[{"$f":"IF(Meetings1!A33=\"\",\"\",IF(Meetings1!A33=\"END\",\"END\",IF(Meetings1!E33=\"\",\"\",getAddress(Meetings1!E33))))","v":"http://formguide.cyberhorse.com.au/index.php/Form/form.html?formdate=2010-12-02&track=Pinjra&raceno=4"},{"$nulls":13},{"$f":"IF(Meetings2!D32=\"\",\"\",getAddress(Meetings2!D32))","v":"http://www.tabonline.com.au/2010/12/02/CG01.html"},{"$f":"IF(Meetings2!E32=\"\",\"\",getAddress(Meetings2!E32))","v":"http://www.tabonline.com.au/2010/12/02/CG02.html"},{"$f":"IF(Meetings2!F32=\"\",\"\",getAddress(Meetings2!F32))","v":"http://www.tabonline.com.au/2010/12/02/CG03.html"},{"$f":"IF(Meetings2!G32=\"\",\"\",getAddress(Meetings2!G32))","v":"http://www.tabonline.com.au/2010/12/02/CG04.html"},{"$f":"IF(Meetings2!H32=\"\",\"\",getAddress(Meetings2!H32))","v":"http://www.tabonline.com.au/2010/12/02/CG05.html"},{"$f":"IF(Meetings2!I32=\"\",\"\",getAddress(Meetings2!I32))","v":"http://www.tabonline.com.au/2010/12/02/CG06.html"},{"$f":"IF(Meetings2!J32=\"\",\"\",getAddress(Meetings2!J32))","v":"http://www.tabonline.com.au/2010/12/02/CG07.html"},{"$f":"IF(Meetings2!K32=\"\",\"\",getAddress(Meetings2!K32))","v":"http://www.tabonline.com.au/2010/12/02/CG08.html"},{"$f":"IF(Meetings2!L32=\"\",\"\",getAddress(Meetings2!L32))","v":"http://www.tabonline.com.au/2010/12/02/CG09.html"},{"$f":"IF(Meetings2!M32=\"\",\"\",getAddress(Meetings2!M32))","v":"http://www.tabonline.com.au/2010/12/02/CG10.html"},{"$f":"IF(Meetings2!N32=\"\",\"\",getAddress(Meetings2!N32))","v":""},"","Colours: White with green dollar sign"," red sleeves and cap",{"$nulls":19},3,"",{"$f":"IF(Race!N33<>\"\",Race!C33,\"\")","v":""},{"$f":"IF(AX33<>\"\",Race!N33,\"\")","v":""},{"$f":"IF(AX33<>\"\",Race!I33,\"\")","v":""}]
[{"$f":"IF(Meetings1!A34=\"\",\"\",IF(Meetings1!A34=\"END\",\"END\",IF(Meetings1!E34=\"\",\"\",getAddress(Meetings1!E34))))","v":"http://formguide.cyberhorse.com.au/index.php/Form/form.html?formdate=2010-12-02&track=Pinjra&raceno=5"},{"$nulls":13},{"$f":"IF(Meetings2!D33=\"\",\"\",getAddress(Meetings2!D33))","v":"http://www.tabonline.com.au/2010/12/02/PG01.html"},{"$f":"IF(Meetings2!E33=\"\",\"\",getAddress(Meetings2!E33))","v":"http://www.tabonline.com.au/2010/12/02/PG02.html"},{"$f":"IF(Meetings2!F33=\"\",\"\",getAddress(Meetings2!F33))","v":"http://www.tabonline.com.au/2010/12/02/PG03.html"},{"$f":"IF(Meetings2!G33=\"\",\"\",getAddress(Meetings2!G33))","v":"http://www.tabonline.com.au/2010/12/02/PG04.html"},{"$f":"IF(Meetings2!H33=\"\",\"\",getAddress(Meetings2!H33))","v":"http://www.tabonline.com.au/2010/12/02/PG05.html"},{"$f":"IF(Meetings2!I33=\"\",\"\",getAddress(Meetings2!I33))","v":"http://www.tabonline.com.au/2010/12/02/PG06.html"},{"$f":"IF(Meetings2!J33=\"\",\"\",getAddress(Meetings2!J33))","v":"http://www.tabonline.com.au/2010/12/02/PG07.html"},{"$f":"IF(Meetings2!K33=\"\",\"\",getAddress(Meetings2!K33))","v":"http://www.tabonline.com.au/2010/12/02/PG08.html"},{"$f":"IF(Meetings2!L33=\"\",\"\",getAddress(Meetings2!L33))","v":"http://www.tabonline.com.au/2010/12/02/PG09.html"},{"$f":"IF(Meetings2!M33=\"\",\"\",getAddress(Meetings2!M33))","v":"http://www.tabonline.com.au/2010/12/02/PG10.html"},{"$f":"IF(Meetings2!N33=\"\",\"\",getAddress(Meetings2!N33))","v":"http://www.tabonline.com.au/2010/12/02/PG11.html"},"","Owners: Mrs K & C Curd",{"$nulls":20},3,"",{"$f":"IF(Race!N34<>\"\",Race!C34,\"\")","v":""},{"$f":"IF(AX34<>\"\",Race!N34,\"\")","v":""},{"$f":"IF(AX34<>\"\",Race!I34,\"\")","v":""}]
[{"$f":"IF(Meetings1!A35=\"\",\"\",IF(Meetings1!A35=\"END\",\"END\",IF(Meetings1!E35=\"\",\"\",getAddress(Meetings1!E35))))","v":"http://formguide.cyberhorse.com.au/index.php/Form/form.html?formdate=2010-12-02&track=Pinjra&raceno=6"},{"$nulls":13},{"$f":"IF(Meetings2!D34=\"\",\"\",getAddress(Meetings2!D34))","v":"http://www.tabonline.com.au/2010/12/02/EG01.html"},{"$f":"IF(Meetings2!E34=\"\",\"\",getAddress(Meetings2!E34))","v":"http://www.tabonline.com.au/2010/12/02/EG02.html"},{"$f":"IF(Meetings2!F34=\"\",\"\",getAddress(Meetings2!F34))","v":"http://www.tabonline.com.au/2010/12/02/EG03.html"},{"$f":"IF(Meetings2!G34=\"\",\"\",getAddress(Meetings2!G34))","v":"http://www.tabonline.com.au/2010/12/02/EG04.html"},{"$f":"IF(Meetings2!H34=\"\",\"\",getAddress(Meetings2!H34))","v":"http://www.tabonline.com.au/2010/12/02/EG05.html"},{"$f":"IF(Meetings2!I34=\"\",\"\",getAddress(Meetings2!I34))","v":"http://www.tabonline.com.au/2010/12/02/EG06.html"},{"$f":"IF(Meetings2!J34=\"\",\"\",getAddress(Meetings2!J34))","v":"http://www.tabonline.com.au/2010/12/02/EG07.html"},{"$f":"IF(Meetings2!K34=\"\",\"\",getAddress(Meetings2!K34))","v":"http://www.tabonline.com.au/2010/12/02/EG08.html"},{"$f":"IF(Meetings2!L34=\"\",\"\",getAddress(Meetings2!L34))","v":"http://www.tabonline.com.au/2010/12/02/EG09.html"},{"$f":"IF(Meetings2!M34=\"\",\"\",getAddress(Meetings2!M34))","v":"http://www.tabonline.com.au/2010/12/02/EG10.html"},{"$f":"IF(Meetings2!N34=\"\",\"\",getAddress(Meetings2!N34))","v":"http://www.tabonline.com.au/2010/12/02/EG11.html"},"","Career:",{"$nulls":20},2,"",{"$f":"IF(Race!N35<>\"\",Race!C35,\"\")","v":""},{"$f":"IF(AX35<>\"\",Race!N35,\"\")","v":""},{"$f":"IF(AX35<>\"\",Race!I35,\"\")","v":""}]
[{"$f":"IF(Meetings1!A36=\"\",\"\",IF(Meetings1!A36=\"END\",\"END\",IF(Meetings1!E36=\"\",\"\",getAddress(Meetings1!E36))))","v":"http://formguide.cyberhorse.com.au/index.php/Form/form.html?formdate=2010-12-02&track=Pinjra&raceno=7"},{"$nulls":13},{"$f":"IF(Meetings2!D35=\"\",\"\",getAddress(Meetings2!D35))","v":"http://www.tabonline.com.au/2010/12/02/OG01.html"},{"$f":"IF(Meetings2!E35=\"\",\"\",getAddress(Meetings2!E35))","v":"http://www.tabonline.com.au/2010/12/02/OG02.html"},{"$f":"IF(Meetings2!F35=\"\",\"\",getAddress(Meetings2!F35))","v":"http://www.tabonline.com.au/2010/12/02/OG03.html"},{"$f":"IF(Meetings2!G35=\"\",\"\",getAddress(Meetings2!G35))","v":"http://www.tabonline.com.au/2010/12/02/OG04.html"},{"$f":"IF(Meetings2!H35=\"\",\"\",getAddress(Meetings2!H35))","v":"http://www.tabonline.com.au/2010/12/02/OG05.html"},{"$f":"IF(Meetings2!I35=\"\",\"\",getAddress(Meetings2!I35))","v":"http://www.tabonline.com.au/2010/12/02/OG06.html"},{"$f":"IF(Meetings2!J35=\"\",\"\",getAddress(Meetings2!J35))","v":"http://www.tabonline.com.au/2010/12/02/OG07.html"},{"$f":"IF(Meetings2!K35=\"\",\"\",getAddress(Meetings2!K35))","v":"http://www.tabonline.com.au/2010/12/02/OG08.html"},{"$f":"IF(Meetings2!L35=\"\",\"\",getAddress(Meetings2!L35))","v":"http://www.tabonline.com.au/2010/12/02/OG09.html"},{"$f":"IF(Meetings2!M35=\"\",\"\",getAddress(Meetings2!M35))","v":"http://www.tabonline.com.au/2010/12/02/OG10.html"},{"$f":"IF(Meetings2!N35=\"\",\"\",getAddress(Meetings2!N35))","v":"http://www.tabonline.com.au/2010/12/02/OG11.html"},"","2010-05-05T07:04:00",{"$nulls":20},2,"",{"$f":"IF(Race!N36<>\"\",Race!C36,\"\")","v":""},{"$f":"IF(AX36<>\"\",Race!N36,\"\")","v":""},{"$f":"IF(AX36<>\"\",Race!I36,\"\")","v":""}]
[{"$f":"IF(Meetings1!A37=\"\",\"\",IF(Meetings1!A37=\"END\",\"END\",IF(Meetings1!E37=\"\",\"\",getAddress(Meetings1!E37))))","v":"http://formguide.cyberhorse.com.au/index.php/Form/form.html?formdate=2010-12-02&track=Pinjra&raceno=8"},{"$nulls":13},{"$f":"IF(Meetings2!D36=\"\",\"\",getAddress(Meetings2!D36))","v":"http://www.tabonline.com.au/2010/12/02/ZG01.html"},{"$f":"IF(Meetings2!E36=\"\",\"\",getAddress(Meetings2!E36))","v":"http://www.tabonline.com.au/2010/12/02/ZG02.html"},{"$f":"IF(Meetings2!F36=\"\",\"\",getAddress(Meetings2!F36))","v":"http://www.tabonline.com.au/2010/12/02/ZG03.html"},{"$f":"IF(Meetings2!G36=\"\",\"\",getAddress(Meetings2!G36))","v":"http://www.tabonline.com.au/2010/12/02/ZG04.html"},{"$f":"IF(Meetings2!H36=\"\",\"\",getAddress(Meetings2!H36))","v":"http://www.tabonline.com.au/2010/12/02/ZG05.html"},{"$f":"IF(Meetings2!I36=\"\",\"\",getAddress(Meetings2!I36))","v":"http://www.tabonline.com.au/2010/12/02/ZG06.html"},{"$f":"IF(Meetings2!J36=\"\",\"\",getAddress(Meetings2!J36))","v":"http://www.tabonline.com.au/2010/12/02/ZG07.html"},{"$f":"IF(Meetings2!K36=\"\",\"\",getAddress(Meetings2!K36))","v":"http://www.tabonline.com.au/2010/12/02/ZG08.html"},{"$f":"IF(Meetings2!L36=\"\",\"\",getAddress(Meetings2!L36))","v":"http://www.tabonline.com.au/2010/12/02/ZG09.html"},{"$f":"IF(Meetings2!M36=\"\",\"\",getAddress(Meetings2!M36))","v":"http://www.tabonline.com.au/2010/12/02/ZG10.html"},{"$f":"IF(Meetings2!N36=\"\",\"\",getAddress(Meetings2!N36))","v":"http://www.tabonline.com.au/2010/12/02/ZG11.html"},"","Fast:",{"$nulls":20},2,"",{"$f":"IF(Race!N37<>\"\",Race!C37,\"\")","v":""},{"$f":"IF(AX37<>\"\",Race!N37,\"\")","v":""},{"$f":"IF(AX37<>\"\",Race!I37,\"\")","v":""}]
[{"$f":"IF(Meetings1!A38=\"\",\"\",IF(Meetings1!A38=\"END\",\"END\",IF(Meetings1!E38=\"\",\"\",getAddress(Meetings1!E38))))","v":""},{"$nulls":13},{"$f":"IF(Meetings2!D37=\"\",\"\",getAddress(Meetings2!D37))","v":"http://www.tabonline.com.au/2010/12/02/TG01.html"},{"$f":"IF(Meetings2!E37=\"\",\"\",getAddress(Meetings2!E37))","v":"http://www.tabonline.com.au/2010/12/02/TG02.html"},{"$f":"IF(Meetings2!F37=\"\",\"\",getAddress(Meetings2!F37))","v":"http://www.tabonline.com.au/2010/12/02/TG03.html"},{"$f":"IF(Meetings2!G37=\"\",\"\",getAddress(Meetings2!G37))","v":"http://www.tabonline.com.au/2010/12/02/TG04.html"},{"$f":"IF(Meetings2!H37=\"\",\"\",getAddress(Meetings2!H37))","v":"http://www.tabonline.com.au/2010/12/02/TG05.html"},{"$f":"IF(Meetings2!I37=\"\",\"\",getAddress(Meetings2!I37))","v":"http://www.tabonline.com.au/2010/12/02/TG06.html"},{"$f":"IF(Meetings2!J37=\"\",\"\",getAddress(Meetings2!J37))","v":"http://www.tabonline.com.au/2010/12/02/TG07.html"},{"$f":"IF(Meetings2!K37=\"\",\"\",getAddress(Meetings2!K37))","v":"http://www.tabonline.com.au/2010/12/02/TG08.html"},{"$f":"IF(Meetings2!L37=\"\",\"\",getAddress(Meetings2!L37))","v":"http://www.tabonline.com.au/2010/12/02/TG09.html"},{"$f":"IF(Meetings2!M37=\"\",\"\",getAddress(Meetings2!M37))","v":"http://www.tabonline.com.au/2010/12/02/TG10.html"},{"$f":"IF(Meetings2!N37=\"\",\"\",getAddress(Meetings2!N37))","v":""},"","0:0-0-0",{"$nulls":20},2,"",{"$f":"IF(Race!N38<>\"\",Race!C38,\"\")","v":""},{"$f":"IF(AX38<>\"\",Race!N38,\"\")","v":""},{"$f":"IF(AX38<>\"\",Race!I38,\"\")","v":""}]
[{"$f":"IF(Meetings1!A39=\"\",\"\",IF(Meetings1!A39=\"END\",\"END\",IF(Meetings1!E39=\"\",\"\",getAddress(Meetings1!E39))))","v":"http://formguide.cyberhorse.com.au/index.php/Form/form.html?formdate=2010-12-02&track=Rocky&raceno=1"},{"$nulls":13},{"$f":"IF(Meetings2!D38=\"\",\"\",getAddress(Meetings2!D38))","v":""},{"$f":"IF(Meetings2!E38=\"\",\"\",getAddress(Meetings2!E38))","v":""},{"$f":"IF(Meetings2!F38=\"\",\"\",getAddress(Meetings2!F38))","v":""},{"$f":"IF(Meetings2!G38=\"\",\"\",getAddress(Meetings2!G38))","v":""},{"$f":"IF(Meetings2!H38=\"\",\"\",getAddress(Meetings2!H38))","v":""},{"$f":"IF(Meetings2!I38=\"\",\"\",getAddress(Meetings2!I38))","v":""},{"$f":"IF(Meetings2!J38=\"\",\"\",getAddress(Meetings2!J38))","v":""},{"$f":"IF(Meetings2!K38=\"\",\"\",getAddress(Meetings2!K38))","v":""},{"$f":"IF(Meetings2!L38=\"\",\"\",getAddress(Meetings2!L38))","v":""},{"$f":"IF(Meetings2!M38=\"\",\"\",getAddress(Meetings2!M38))","v":""},{"$f":"IF(Meetings2!N38=\"\",\"\",getAddress(Meetings2!N38))","v":""},"","7-8 4.2L"," Rocky","2010-11-04"," 1300m"," Dead"," Race 4"," Hcp"," Cls 5",12000,0," C Pye",1," Cd 52.0--2.0",-54," 1:18.05",-35.11," 12/1"," Settled-- 1200-- 800-- Turn--"," 1-Martiros 54.5",null,null,2,"",{"$f":"IF(Race!N39<>\"\",Race!C39,\"\")","v":""},{"$f":"IF(AX39<>\"\",Race!N39,\"\")","v":""},{"$f":"IF(AX39<>\"\",Race!I39,\"\")","v":""}]
[{"$f":"IF(Meetings1!A40=\"\",\"\",IF(Meetings1!A40=\"END\",\"END\",IF(Meetings1!E40=\"\",\"\",getAddress(Meetings1!E40))))","v":"http://formguide.cyberhorse.com.au/index.php/Form/form.html?formdate=2010-12-02&track=Rocky&raceno=2"},{"$nulls":13},{"$f":"IF(Meetings2!D39=\"\",\"\",getAddress(Meetings2!D39))","v":""},{"$f":"IF(Meetings2!E39=\"\",\"\",getAddress(Meetings2!E39))","v":""},{"$f":"IF(Meetings2!F39=\"\",\"\",getAddress(Meetings2!F39))","v":""},{"$f":"IF(Meetings2!G39=\"\",\"\",getAddress(Meetings2!G39))","v":""},{"$f":"IF(Meetings2!H39=\"\",\"\",getAddress(Meetings2!H39))","v":""},{"$f":"IF(Meetings2!I39=\"\",\"\",getAddress(Meetings2!I39))","v":""},{"$f":"IF(Meetings2!J39=\"\",\"\",getAddress(Meetings2!J39))","v":""},{"$f":"IF(Meetings2!K39=\"\",\"\",getAddress(Meetings2!K39))","v":""},{"$f":"IF(Meetings2!L39=\"\",\"\",getAddress(Meetings2!L39))","v":""},{"$f":"IF(Meetings2!M39=\"\",\"\",getAddress(Meetings2!M39))","v":""},{"$f":"IF(Meetings2!N39=\"\",\"\",getAddress(Meetings2!N39))","v":""},"","3-7 2.4L"," Mackay","2010-10-19"," 1500m"," Good"," Race 2"," Plate"," Cls 6",10000,-1000," C Pye",6," Cd 52.5--3.0"," (SW)"," 1:30.50"," ()"," 5/1"," Settled-2 1200-- 800-- Turn-3"," 1-Polrossa 55.5",null,null,1,"",{"$f":"IF(Race!N40<>\"\",Race!C40,\"\")","v":""},{"$f":"IF(AX40<>\"\",Race!N40,\"\")","v":""},{"$f":"IF(AX40<>\"\",Race!I40,\"\")","v":""}]
[{"$f":"IF(Meetings1!A41=\"\",\"\",IF(Meetings1!A41=\"END\",\"END\",IF(Meetings1!E41=\"\",\"\",getAddress(Meetings1!E41))))","v":"http://formguide.cyberhorse.com.au/index.php/Form/form.html?formdate=2010-12-02&track=Rocky&raceno=3"},{"$nulls":13},{"$f":"IF(Meetings2!D40=\"\",\"\",getAddress(Meetings2!D40))","v":"http://www.tabonline.com.au/2010/12/02/mtgraces.html"},{"$f":"IF(Meetings2!E40=\"\",\"\",getAddress(Meetings2!E40))","v":""},{"$f":"IF(Meetings2!F40=\"\",\"\",getAddress(Meetings2!F40))","v":""},{"$f":"IF(Meetings2!G40=\"\",\"\",getAddress(Meetings2!G40))","v":""},{"$f":"IF(Meetings2!H40=\"\",\"\",getAddress(Meetings2!H40))","v":""},{"$f":"IF(Meetings2!I40=\"\",\"\",getAddress(Meetings2!I40))","v":""},{"$f":"IF(Meetings2!J40=\"\",\"\",getAddress(Meetings2!J40))","v":""},{"$f":"IF(Meetings2!K40=\"\",\"\",getAddress(Meetings2!K40))","v":""},{"$f":"IF(Meetings2!L40=\"\",\"\",getAddress(Meetings2!L40))","v":""},{"$f":"IF(Meetings2!M40=\"\",\"\",getAddress(Meetings2!M40))","v":""},{"$f":"IF(Meetings2!N40=\"\",\"\",getAddress(Meetings2!N40))","v":""},"","1-6 0.2L"," Mackay","2010-10-09"," 1500m"," Good"," Race 2"," Hcp"," Cls 4",7500,-4800," K Cross",6," Cd 51.0--3.0",-54," 1:28.90"," ()"," 5/2"," Settled-- 1200-- 800-- Turn--"," 2-Ellehro 54.0",null,null,1,"",{"$f":"IF(Race!N41<>\"\",Race!C41,\"\")","v":""},{"$f":"IF(AX41<>\"\",Race!N41,\"\")","v":""},{"$f":"IF(AX41<>\"\",Race!I41,\"\")","v":""}]
[{"$f":"IF(Meetings1!A42=\"\",\"\",IF(Meetings1!A42=\"END\",\"END\",IF(Meetings1!E42=\"\",\"\",getAddress(Meetings1!E42))))","v":"http://formguide.cyberhorse.com.au/index.php/Form/form.html?formdate=2010-12-02&track=Rocky&raceno=4"},{"$nulls":13},{"$f":"IF(Meetings2!D41=\"\",\"\",getAddress(Meetings2!D41))","v":""},{"$f":"IF(Meetings2!E41=\"\",\"\",getAddress(Meetings2!E41))","v":""},{"$f":"IF(Meetings2!F41=\"\",\"\",getAddress(Meetings2!F41))","v":""},{"$f":"IF(Meetings2!G41=\"\",\"\",getAddress(Meetings2!G41))","v":""},{"$f":"IF(Meetings2!H41=\"\",\"\",getAddress(Meetings2!H41))","v":""},{"$f":"IF(Meetings2!I41=\"\",\"\",getAddress(Meetings2!I41))","v":""},{"$f":"IF(Meetings2!J41=\"\",\"\",getAddress(Meetings2!J41))","v":""},{"$f":"IF(Meetings2!K41=\"\",\"\",getAddress(Meetings2!K41))","v":""},{"$f":"IF(Meetings2!L41=\"\",\"\",getAddress(Meetings2!L41))","v":""},{"$f":"IF(Meetings2!M41=\"\",\"\",getAddress(Meetings2!M41))","v":""},{"$f":"IF(Meetings2!N41=\"\",\"\",getAddress(Meetings2!N41))","v":""},"","5-9 8.5L"," Mackay","2010-09-28"," 1250m"," Heavy"," Race 6"," Plate"," Cls 3",10000,0," H O'Hara",9," Cd 55.5--3.0"," (SW)"," 1:16.40"," ()"," 8/1"," Settled-8 1200-- 800-- Turn-8"," 1-Achill Island 57.0",null,null,1,"",{"$f":"IF(Race!N40<>\"\",Race!C40,\"\")","v":""},{"$f":"IF(AX43<>\"\",Race!N41,\"\")","v":""},{"$f":"IF(AX44<>\"\",Race!I42,\"\")","v":""}]
[{"$f":"IF(Meetings1!A43=\"\",\"\",IF(Meetings1!A43=\"END\",\"END\",IF(Meetings1!E43=\"\",\"\",getAddress(Meetings1!E43))))","v":"http://formguide.cyberhorse.com.au/index.php/Form/form.html?formdate=2010-12-02&track=Rocky&raceno=5"},{"$nulls":13},{"$f":"IF(Meetings2!D42=\"\",\"\",getAddress(Meetings2!D42))","v":""},{"$f":"IF(Meetings2!E42=\"\",\"\",getAddress(Meetings2!E42))","v":""},{"$f":"IF(Meetings2!F42=\"\",\"\",getAddress(Meetings2!F42))","v":""},{"$f":"IF(Meetings2!G42=\"\",\"\",getAddress(Meetings2!G42))","v":""},{"$f":"IF(Meetings2!H42=\"\",\"\",getAddress(Meetings2!H42))","v":""},{"$f":"IF(Meetings2!I42=\"\",\"\",getAddress(Meetings2!I42))","v":""},{"$f":"IF(Meetings2!J42=\"\",\"\",getAddress(Meetings2!J42))","v":""},{"$f":"IF(Meetings2!K42=\"\",\"\",getAddress(Meetings2!K42))","v":""},{"$f":"IF(Meetings2!L42=\"\",\"\",getAddress(Meetings2!L42))","v":""},{"$f":"IF(Meetings2!M42=\"\",\"\",getAddress(Meetings2!M42))","v":""},{"$f":"IF(Meetings2!N42=\"\",\"\",getAddress(Meetings2!N42))","v":""},"","1-7 3.0L"," S'sure","2010-09-18"," 1400m"," Good"," Race 5"," Hcp"," Cls 2",5100,-3400," H O'Hara",6," Cd 54.5--2.0",-55," 1:27.55"," ()"," 3/1"," Settled-- 1200-- 800-- Turn--"," 2-Craiglea Fancy 53.0",null,null,1,"",{"$f":"IF(Race!N41<>\"\",Race!C41,\"\")","v":""},{"$f":"IF(AX44<>\"\",Race!N42,\"\")","v":""},{"$f":"IF(AX45<>\"\",Race!I43,\"\")","v":""}]
[{"$f":"IF(Meetings1!A44=\"\",\"\",IF(Meetings1!A44=\"END\",\"END\",IF(Meetings1!E44=\"\",\"\",getAddress(Meetings1!E44))))","v":"http://formguide.cyberhorse.com.au/index.php/Form/form.html?formdate=2010-12-02&track=Rocky&raceno=6"},{"$nulls":13},{"$f":"IF(Meetings2!D43=\"\",\"\",getAddress(Meetings2!D43))","v":""},{"$f":"IF(Meetings2!E43=\"\",\"\",getAddress(Meetings2!E43))","v":""},{"$f":"IF(Meetings2!F43=\"\",\"\",getAddress(Meetings2!F43))","v":""},{"$f":"IF(Meetings2!G43=\"\",\"\",getAddress(Meetings2!G43))","v":""},{"$f":"IF(Meetings2!H43=\"\",\"\",getAddress(Meetings2!H43))","v":""},{"$f":"IF(Meetings2!I43=\"\",\"\",getAddress(Meetings2!I43))","v":""},{"$f":"IF(Meetings2!J43=\"\",\"\",getAddress(Meetings2!J43))","v":""},{"$f":"IF(Meetings2!K43=\"\",\"\",getAddress(Meetings2!K43))","v":""},{"$f":"IF(Meetings2!L43=\"\",\"\",getAddress(Meetings2!L43))","v":""},{"$f":"IF(Meetings2!M43=\"\",\"\",getAddress(Meetings2!M43))","v":""},{"$f":"IF(Meetings2!N43=\"\",\"\",getAddress(Meetings2!N43))","v":""},"","5-11 5.7L"," Mackay","2010-09-07"," 1250m"," Good"," Race 5"," Hcp"," Cls 2",10000,0," H O'Hara",7," Cd 52.0--2.0",-54," 1:14.00"," ()"," 20/1"," Settled-9 1200-- 800-- Turn-8"," 1-Essington 58.0",null,null,1,"",{"$f":"IF(Race!N42<>\"\",Race!C42,\"\")","v":""},{"$f":"IF(AX45<>\"\",Race!N43,\"\")","v":""},{"$f":"IF(AX46<>\"\",Race!I44,\"\")","v":""}]
[{"$f":"IF(Meetings1!A45=\"\",\"\",IF(Meetings1!A45=\"END\",\"END\",IF(Meetings1!E45=\"\",\"\",getAddress(Meetings1!E45))))","v":"END"},{"$nulls":13},{"$f":"IF(Meetings2!D44=\"\",\"\",getAddress(Meetings2!D44))","v":""},{"$f":"IF(Meetings2!E44=\"\",\"\",getAddress(Meetings2!E44))","v":""},{"$f":"IF(Meetings2!F44=\"\",\"\",getAddress(Meetings2!F44))","v":""},{"$f":"IF(Meetings2!G44=\"\",\"\",getAddress(Meetings2!G44))","v":""},{"$f":"IF(Meetings2!H44=\"\",\"\",getAddress(Meetings2!H44))","v":""},{"$f":"IF(Meetings2!I44=\"\",\"\",getAddress(Meetings2!I44))","v":""},{"$f":"IF(Meetings2!J44=\"\",\"\",getAddress(Meetings2!J44))","v":""},{"$f":"IF(Meetings2!K44=\"\",\"\",getAddress(Meetings2!K44))","v":""},{"$f":"IF(Meetings2!L44=\"\",\"\",getAddress(Meetings2!L44))","v":""},{"$f":"IF(Meetings2!M44=\"\",\"\",getAddress(Meetings2!M44))","v":""},{"$f":"IF(Meetings2!N44=\"\",\"\",getAddress(Meetings2!N44))","v":""},"","10-12 7.7L"," Mackay","2010-06-17"," 1500m"," Good"," Race 5"," Hcp"," Cls 2",10000,0," R Wiggins",9," Cd 54.0-0.0",-54," 1:29.75"," ()"," 12/1"," Settled-8 1200-- 800-- Turn-11"," 1-Great Gretzky 56.0",null,null,null,0,{"$f":"IF(Race!N43<>\"\",Race!C43,\"\")","v":""},{"$f":"IF(AX46<>\"\",Race!N44,\"\")","v":""},{"$f":"IF(AX47<>\"\",Race!I45,\"\")","v":""}]
[{"$f":"IF(Meetings1!A46=\"\",\"\",IF(Meetings1!A46=\"END\",\"END\",IF(Meetings1!E46=\"\",\"\",getAddress(Meetings1!E46))))","v":""},{"$nulls":24},"","9-10 8.6L"," Rocky","2010-05-22"," 1600m"," Good"," Race 3"," Hcp"," Cls 3",6000,0," C McIver",2," Cd 54.0-0.0",-54," 1:36.03",-37.200000000000003," 14/1"," Settled-- 1200-- 800-- Turn--"," 1-Timecall 58.0",null,null,null,0,{"$f":"IF(Race!N44<>\"\",Race!C44,\"\")","v":""},{"$f":"IF(AX47<>\"\",Race!N45,\"\")","v":""},{"$f":"IF(AX48<>\"\",Race!I46,\"\")","v":""}]
[{"$f":"IF(Meetings1!A47=\"\",\"\",IF(Meetings1!A47=\"END\",\"END\",IF(Meetings1!E47=\"\",\"\",getAddress(Meetings1!E47))))","v":""},{"$nulls":24},"","4-6 5.5L"," Mackay","2010-05-01"," 1250m"," Good"," Race 1"," Hcp"," Cls 3",6000,-200," D Simmons",4," Cd 54.0-0.0",-54," 1:14.13"," ()"," 5/2"," Settled-- 1200-- 800-- Turn--"," 1-Eagledance Kid 54.0",null,null,null,0,{"$f":"IF(Race!N45<>\"\",Race!C45,\"\")","v":""},{"$f":"IF(AX48<>\"\",Race!N46,\"\")","v":""},{"$f":"IF(AX49<>\"\",Race!I47,\"\")","v":""}]
[{"$f":"IF(Meetings1!A48=\"\",\"\",IF(Meetings1!A48=\"END\",\"END\",IF(Meetings1!E48=\"\",\"\",getAddress(Meetings1!E48))))","v":""},{"$nulls":24},"","3-9 1.8L"," Mackay","2010-04-13"," 1050m"," Dead"," Race 7"," Hcp"," Cls 2",12000,-1200," T Bannon",1," Cd 55.0-0.0",-54.5," 1:01.58"," ()"," 12/1"," Settled-- 1200-- 800-- Turn--"," 1-God's Window 55.5",null,null,null,0,{"$f":"IF(Race!N46<>\"\",Race!C46,\"\")","v":""},{"$f":"IF(AX49<>\"\",Race!N47,\"\")","v":""},{"$f":"IF(AX50<>\"\",Race!I48,\"\")","v":""}]
[{"$f":"IF(Meetings1!A49=\"\",\"\",IF(Meetings1!A49=\"END\",\"END\",IF(Meetings1!E49=\"\",\"\",getAddress(Meetings1!E49))))","v":""},{"$nulls":24},"Noble Lustre","3 Noble Lustre (5) 55.5kg 5yo b/br g",{"$nulls":21},0,{"$f":"IF(Race!N47<>\"\",Race!C47,\"\")","v":""},{"$f":"IF(AX50<>\"\",Race!N48,\"\")","v":""},{"$f":"IF(AX51<>\"\",Race!I49,\"\")","v":""}]
[{"$f":"IF(Meetings1!A50=\"\",\"\",IF(Meetings1!A50=\"END\",\"END\",IF(Meetings1!E50=\"\",\"\",getAddress(Meetings1!E50))))","v":""},{"$nulls":24},"","Colours: Dark blue"," yellow seams and cap",{"$nulls":20},0,{"$f":"IF(Race!N48<>\"\",Race!C48,\"\")","v":""},{"$f":"IF(AX51<>\"\",Race!N49,\"\")","v":""},{"$f":"IF(AX52<>\"\",Race!I50,\"\")","v":""}]
[{"$f":"IF(Meetings1!A51=\"\",\"\",IF(Meetings1!A51=\"END\",\"END\",IF(Meetings1!E51=\"\",\"\",getAddress(Meetings1!E51))))","v":""},{"$nulls":24},"","Owners: J Brown"," L L Chang & V Brown",{"$nulls":20},0,{"$f":"IF(Race!N49<>\"\",Race!C49,\"\")","v":""},{"$f":"IF(AX52<>\"\",Race!N50,\"\")","v":""},{"$f":"IF(AX53<>\"\",Race!I51,\"\")","v":""}]
[{"$f":"IF(Meetings1!A52=\"\",\"\",IF(Meetings1!A52=\"END\",\"END\",IF(Meetings1!E52=\"\",\"\",getAddress(Meetings1!E52))))","v":""},{"$nulls":24},"","Career:"]
[{"$f":"IF(Meetings1!A53=\"\",\"\",IF(Meetings1!A53=\"END\",\"END\",IF(Meetings1!E53=\"\",\"\",getAddress(Meetings1!E53))))","v":""},{"$nulls":24},"","2010-03-04T03:03:00"]
[{"$f":"IF(Meetings1!A54=\"\",\"\",IF(Meetings1!A54=\"END\",\"END\",IF(Meetings1!E54=\"\",\"\",getAddress(Meetings1!E54))))","v":""},{"$nulls":24},"","Fast:"]
[{"$f":"IF(Meetings1!A55=\"\",\"\",IF(Meetings1!A55=\"END\",\"END\",IF(Meetings1!E55=\"\",\"\",getAddress(Meetings1!E55))))","v":""},{"$nulls":24},"","0:0-0-0"]
[{"$f":"IF(Meetings1!A56=\"\",\"\",IF(Meetings1!A56=\"END\",\"END\",IF(Meetings1!E56=\"\",\"\",getAddress(Meetings1!E56))))","v":""},{"$nulls":24},"","8-13 4.5L"," Rocky","2010-11-11"," 1200m"," Good"," Race 7"," Hcp"," Cls 3",10000,0," B Stewart",6," Cd 57.0-0.0",-54," 1:10.07",-34.159999999999997," 7/1"," Settled-- 1200-- 800-- Turn--"," 1-Angel Force 54.0"]
[{"$f":"IF(Meetings1!A57=\"\",\"\",IF(Meetings1!A57=\"END\",\"END\",IF(Meetings1!E57=\"\",\"\",getAddress(Meetings1!E57))))","v":""},{"$nulls":24},"","1-6 2.0L"," Rocky","2010-11-02"," 1200m"," Good"," Race 4"," Plate"," Cls 3",6000,-4000," K Cross",1," Cd 54.0--3.0"," (SW)"," 1:10.31",-33.24," 5/2"," Settled-- 1200-- 800-- Turn--"," 2-Mountain King 54.0"]
[{"$f":"IF(Meetings1!A58=\"\",\"\",IF(Meetings1!A58=\"END\",\"END\",IF(Meetings1!E58=\"\",\"\",getAddress(Meetings1!E58))))","v":""},{"$nulls":24},"","9-15 7.2L"," Rocky","2010-10-07"," 1200m"," Good"," Race 7"," Hcp"," Cls 3",10000,0," B Stewart",12," Cd 56.0-0.0",-54," 1:10.26",-34.68," 7/1"," Settled-- 1200-- 800-- Turn--"," 1-Basheeba 56.0"]
[{"$f":"IF(Meetings1!A59=\"\",\"\",IF(Meetings1!A59=\"END\",\"END\",IF(Meetings1!E59=\"\",\"\",getAddress(Meetings1!E59))))","v":""},{"$nulls":24},"","8-9 5.4L"," Rocky","2010-09-23"," 970m"," Heavy"," Race 6"," Hcp"," Cls 3",12000,0," B Stewart",2," Cd 55.5-0.0",-54," 0:57.42",-34.270000000000003," 13/4E"," Settled-- 1200-- 800-- Turn--"," 1-Dack's Faz 56.5"]
[{"$f":"IF(Meetings1!A60=\"\",\"\",IF(Meetings1!A60=\"END\",\"END\",IF(Meetings1!E60=\"\",\"\",getAddress(Meetings1!E60))))","v":""},{"$nulls":24},"","5-10 4.0L"," Rocky","2010-09-09"," 970m"," Good"," Race 1"," Hcp"," Cls 2",10000,0," D Simmons",7," Cd 58.0-0.0",-54," 0:55.87",-33.159999999999997," 3/1E"," Settled-- 1200-- 800-- Turn--"," 1-Noosa Bay 53.0"]
[{"$f":"IF(Meetings1!A61=\"\",\"\",IF(Meetings1!A61=\"END\",\"END\",IF(Meetings1!E61=\"\",\"\",getAddress(Meetings1!E61))))","v":""},{"$nulls":24},"","2-5 2.0L"," Ball't","2010-03-04"," 1100m"," Dead"," Race 5"," Hcp"," RB72",15000,-2700," L Nolen",2," Cd 55.0-0.0",-53," 1:06.04"," ()"," 7/4"," Settled-3 1200-- 800-- Turn-2"," 1-My Girl Helen 56.5"]
[{"$f":"IF(Meetings1!A62=\"\",\"\",IF(Meetings1!A62=\"END\",\"END\",IF(Meetings1!E62=\"\",\"\",getAddress(Meetings1!E62))))","v":""},{"$nulls":24},"","6-11 1.8L"," K'more","2010-02-14"," 1200m"," Dead"," Race 6"," Hcp"," RB68",22500,-200," B Rawiller",9," Cd 57.5-0.0",-53," 1:11.22"," ()"," 9/2E"," Settled-2 1200-- 800-- Turn-1"," 1-De Dion Bouton 57.5"]
[{"$f":"IF(Meetings1!A63=\"\",\"\",IF(Meetings1!A63=\"END\",\"END\",IF(Meetings1!E63=\"\",\"\",getAddress(Meetings1!E63))))","v":""},{"$nulls":24},"","4-8 2.0L"," Morn.","2010-01-29"," 1223m"," Dead"," Race 5"," Hcp"," RB68",13000,-500," B Rawiller",5," Cd 57.5-0.0",-54," 1:13.52"," ()"," 7/4F"," Settled-2 1200-- 800-- Turn-1"," 1-Into The Sun 58.0"]
[{"$f":"IF(Meetings1!A64=\"\",\"\",IF(Meetings1!A64=\"END\",\"END\",IF(Meetings1!E64=\"\",\"\",getAddress(Meetings1!E64))))","v":""},{"$nulls":24},"","2-13 0.5L"," Ball't","2010-01-14"," 1200m"," Good"," Race 8"," Hcp"," RB68",22500,-4200," B Rawiller",11," Cd 57.0-0.0",-53," 1:10.18"," ()"," 12/1"," Settled-3 1200-- 800-- Turn-2"," 1-Mikeys Magic 56.0"]
[{"$f":"IF(Meetings1!A65=\"\",\"\",IF(Meetings1!A65=\"END\",\"END\",IF(Meetings1!E65=\"\",\"\",getAddress(Meetings1!E65))))","v":""},{"$nulls":24},"","3-8 1.1L"," St.Ck","2009-12-28"," 1100m"," Good"," Race 6"," Hcp"," RB68",12000,-1000," J Noonan",8," Cd 56.0--2.0",-53," 1:06.52"," ()"," 13/2"," Settled-8 1200-- 800-- Turn-7"," 1-Shaemist Mountain 54.5"]
[{"$f":"IF(Meetings1!A66=\"\",\"\",IF(Meetings1!A66=\"END\",\"END\",IF(Meetings1!E66=\"\",\"\",getAddress(Meetings1!E66))))","v":""},{"$nulls":24},"Chabal","4 Chabal (4) 55.0kg 5yo b g"]
[{"$f":"IF(Meetings1!A67=\"\",\"\",IF(Meetings1!A67=\"END\",\"END\",IF(Meetings1!E67=\"\",\"\",getAddress(Meetings1!E67))))","v":""},{"$nulls":24},{"$f":"IF(AA67=\"\",\"\",IF(ISERROR(MID(AA67,FIND(\" \",AA67,1)+1,FIND(\"(\",AA67,1)-FIND(\" \",AA67,1)-2)),\"\",MID(AA67,FIND(\" \",AA67,1)+1,FIND(\"(\",AA67,1)-FIND(\" \",AA67,1)-2)))","v":""},"Colours: Black"," lime green sleeves and cap"]
[{"$f":"IF(Meetings1!A68=\"\",\"\",IF(Meetings1!A68=\"END\",\"END\",IF(Meetings1!E68=\"\",\"\",getAddress(Meetings1!E68))))","v":""},{"$nulls":24},"","Owners: Mrs K E Walsh"," C E Watts & D W Matsen"]
[{"$f":"IF(Meetings1!A69=\"\",\"\",IF(Meetings1!A69=\"END\",\"END\",IF(Meetings1!E69=\"\",\"\",getAddress(Meetings1!E69))))","v":""},{"$nulls":24},"","Career:"]
[{"$f":"IF(Meetings1!A70=\"\",\"\",IF(Meetings1!A70=\"END\",\"END\",IF(Meetings1!E70=\"\",\"\",getAddress(Meetings1!E70))))","v":""},{"$nulls":24},"",40301.002083333296]
[{"$f":"IF(Meetings1!A71=\"\",\"\",IF(Meetings1!A71=\"END\",\"END\",IF(Meetings1!E71=\"\",\"\",getAddress(Meetings1!E71))))","v":""},{"$nulls":24},"","Fast:"]
[{"$f":"IF(Meetings1!A72=\"\",\"\",IF(Meetings1!A72=\"END\",\"END\",IF(Meetings1!E72=\"\",\"\",getAddress(Meetings1!E72))))","v":""},{"$nulls":24},"","0:0-0-0"]
[{"$f":"IF(Meetings1!A73=\"\",\"\",IF(Meetings1!A73=\"END\",\"END\",IF(Meetings1!E73=\"\",\"\",getAddress(Meetings1!E73))))","v":""},{"$nulls":24},"","6-13 3.1L"," Rocky","2010-11-11"," 1200m"," Good"," Race 7"," Hcp"," Cls 3",10000,0," J P Stanley",7," Cd 56.5-0.0",-54," 1:10.07",-34.159999999999997," 25/1"," Settled-- 1200-- 800-- Turn--"," 1-Angel Force 54.0"]
[{"$f":"IF(Meetings1!A74=\"\",\"\",IF(Meetings1!A74=\"END\",\"END\",IF(Meetings1!E74=\"\",\"\",getAddress(Meetings1!E74))))","v":""},{"$nulls":24},"","4-11 2.8L"," Rocky","2010-08-26"," 2243m"," Dead"," Race 4"," Hcp"," Cls 4",12000,-600," Dale Missen",8," Cd 56.5-0.0",-54," 2:21.97",-36.58," 8/1"," Settled-- 1200-- 800-- Turn--"," 1-Sir Echo 55.5"]
[{"$f":"IF(Meetings1!A75=\"\",\"\",IF(Meetings1!A75=\"END\",\"END\",IF(Meetings1!E75=\"\",\"\",getAddress(Meetings1!E75))))","v":""},{"$nulls":24},"","5-11 2.2L"," T'vill","2010-08-21"," 1630m"," Good"," Race 4"," Hcp"," Cls 4",15000,0," A Merritt",11," Cd 54.0-0.0",-54," 1:39.31",-35.6," 8/1"," Settled-- 1200-- 800-- Turn--"," 1-Northern Apache 54.0"]
[{"$f":"IF(Meetings1!A76=\"\",\"\",IF(Meetings1!A76=\"END\",\"END\",IF(Meetings1!E76=\"\",\"\",getAddress(Meetings1!E76))))","v":""},{"$nulls":24},"","1-11 0.1L"," T'vill","2010-08-03"," 1630m"," Good"," Race 5"," Hcp"," Cls 3",12000,-7800," T Bannon",2," Cd 54.0-0.0",-54," 1:39.75",-35.369999999999997," 11/1"," Settled-- 1200-- 800-- Turn--"," 2-Hamatym 56.5"]
[{"$f":"IF(Meetings1!A77=\"\",\"\",IF(Meetings1!A77=\"END\",\"END\",IF(Meetings1!E77=\"\",\"\",getAddress(Meetings1!E77))))","v":""},{"$nulls":24},"","5-11 5.0L"," Rocky","2010-07-15"," 1814m"," Good"," Race 3"," Hcp"," Cls 2",12000,0," Dale Missen",10," Cd 57.5-0.0",-54," 1:54.00",-34.39," 13/4"," Settled-- 1200-- 800-- Turn--"," 1-Hot Shot Henry 54.0"]
[{"$f":"IF(Meetings1!A78=\"\",\"\",IF(Meetings1!A78=\"END\",\"END\",IF(Meetings1!E78=\"\",\"\",getAddress(Meetings1!E78))))","v":""},{"$nulls":24},"","3-12 0.3L"," T'vill","2010-06-14"," 1630m"," Good"," Race 2"," Plate"," Cls 3",10000,-1000," Dale Missen",6," Cd 57.0-0.0"," (SW)"," 1:39.48",-35.81," 5/1"," Settled-- 1200-- 800-- Turn--"," 1-Keen On You 58.5"]
[{"$f":"IF(Meetings1!A79=\"\",\"\",IF(Meetings1!A79=\"END\",\"END\",IF(Meetings1!E79=\"\",\"\",getAddress(Meetings1!E79))))","v":""},{"$nulls":24},"","1-8 5.0L"," Mackay","2010-05-29"," 1800m"," Dead"," Race 4"," Hcp"," Cls 1",7500,-4800," Dale Missen",7," Cd 58.0-0.0",-54," 1:50.22"," ()"," 15/4"," Settled-- 1200-- 800-- Turn--"," 2-Sure Of Heart 54.0"]
[{"$f":"IF(Meetings1!A80=\"\",\"\",IF(Meetings1!A80=\"END\",\"END\",IF(Meetings1!E80=\"\",\"\",getAddress(Meetings1!E80))))","v":""},{"$nulls":24},"","3-6 11.1L"," Mackay","2010-05-11"," 1800m"," Slow"," Race 1"," Hcp"," Cls 1",10000,-1000," Dale Missen",1," Cd 57.0-0.0",-54," 1:57.79"," ()"," 2/1"," Settled-- 1200-- 800-- Turn--"," 1-Galaxy Stalker 56.0"]
[{"$f":"IF(Meetings1!A81=\"\",\"\",IF(Meetings1!A81=\"END\",\"END\",IF(Meetings1!E81=\"\",\"\",getAddress(Meetings1!E81))))","v":""},{"$nulls":24},"","2-8 0.4L"," Mackay","2010-05-01"," 1500m"," Good"," Race 6"," Hcp"," Cls 1",6000,-1200," N Patchett",5," Cd 54.0-0.0",-54," 1:31.04"," ()"," 7/1"," Settled-- 1200-- 800-- Turn--"," 1-Prom Knight 54.0"]
[{"$f":"IF(Meetings1!A82=\"\",\"\",IF(Meetings1!A82=\"END\",\"END\",IF(Meetings1!E82=\"\",\"\",getAddress(Meetings1!E82))))","v":""},{"$nulls":24},"","6-8 4.1L"," T'vill","2010-04-22"," 1400m"," Good"," Race 1"," Hcp"," Cls 1",10000,0," A Spinks",6," Cd 54.0-0.0",-54," 1:23.39",-34.6," 7/1"," Settled-- 1200-- 800-- Turn--"," 1-Cinque Terre 58.5"]
[{"$f":"IF(Meetings1!A83=\"\",\"\",IF(Meetings1!A83=\"END\",\"END\",IF(Meetings1!E83=\"\",\"\",getAddress(Meetings1!E83))))","v":""},{"$nulls":24},"Craiglea Tina","5 Craiglea Tina (2) 54.0kg 3yo br f"]
[{"$f":"IF(Meetings1!A84=\"\",\"\",IF(Meetings1!A84=\"END\",\"END\",IF(Meetings1!E84=\"\",\"\",getAddress(Meetings1!E84))))","v":""},{"$nulls":24},"","Colours: Blue"," white crossed sashes"," white striped sleeves"," blue cap"]
[{"$f":"IF(Meetings1!A85=\"\",\"\",IF(Meetings1!A85=\"END\",\"END\",IF(Meetings1!E85=\"\",\"\",getAddress(Meetings1!E85))))","v":""},{"$nulls":24},"","Owners: S M Johnston"," Mrs M L Johnston"," W A & J J Johnston & Miss K J E Johnston"]
[{"$f":"IF(Meetings1!A86=\"\",\"\",IF(Meetings1!A86=\"END\",\"END\",IF(Meetings1!E86=\"\",\"\",getAddress(Meetings1!E86))))","v":""},{"$nulls":24},"","Career:"]
[{"$f":"IF(Meetings1!A87=\"\",\"\",IF(Meetings1!A87=\"END\",\"END\",IF(Meetings1!E87=\"\",\"\",getAddress(Meetings1!E87))))","v":""},{"$nulls":24},"","2010-03-01T17:03:00"]
[{"$f":"IF(Meetings1!A88=\"\",\"\",IF(Meetings1!A88=\"END\",\"END\",IF(Meetings1!E88=\"\",\"\",getAddress(Meetings1!E88))))","v":""},{"$nulls":24},"","Fast:"]
[{"$f":"IF(Meetings1!A89=\"\",\"\",IF(Meetings1!A89=\"END\",\"END\",IF(Meetings1!E89=\"\",\"\",getAddress(Meetings1!E89))))","v":""},{"$nulls":24},"","0:0-0-0"]
[{"$f":"IF(Meetings1!A90=\"\",\"\",IF(Meetings1!A90=\"END\",\"END\",IF(Meetings1!E90=\"\",\"\",getAddress(Meetings1!E90))))","v":""},{"$nulls":24},"","1-9 2.0L"," Gympie","2010-11-27"," 1470m"," Good"," Race 3"," Plate"," Cls 3",6000,-4000," K James",4," Cd 53.0--3.0"," (SW)"," 1:31.06"," ()"," 5/2"," Settled-- 1200-- 800-- Turn--"," 2-Tic Toc Tiger 56.0"]
[{"$f":"IF(Meetings1!A91=\"\",\"\",IF(Meetings1!A91=\"END\",\"END\",IF(Meetings1!E91=\"\",\"\",getAddress(Meetings1!E91))))","v":""},{"$nulls":24},"","7-12 6.4L"," Roma","2010-11-20"," 1640m"," Good"," Race 6"," Plate"," Cls 3",15000,0," K James",8," Cd 54.0--3.0"," (SW)"," 1:45.13"," ()"," 7/1"," Settled-- 1200-- 800-- Turn--"," 1-Bruncher 59.0"]
[{"$f":"IF(Meetings1!A92=\"\",\"\",IF(Meetings1!A92=\"END\",\"END\",IF(Meetings1!E92=\"\",\"\",getAddress(Meetings1!E92))))","v":""},{"$nulls":24},"","3-6 2.2L"," SCstIn","2010-11-14"," 1250m"," Good"," Race 2"," Hcp"," Cls 2",10000,-1000," K Wharton",2," Cd 54.0-0.0",-54," 1:16.65",-35.159999999999997," 5/2"," Settled-1 1200-- 800-- Turn-2"," 1-Monashee Matty 51.0"]
[{"$f":"IF(Meetings1!A93=\"\",\"\",IF(Meetings1!A93=\"END\",\"END\",IF(Meetings1!E93=\"\",\"\",getAddress(Meetings1!E93))))","v":""},{"$nulls":24},"","9-11 6.8L"," Rocky","2010-10-21"," 1300m"," Good"," Race 7"," Hcp"," Cls 4",10000,0," J Kropp",11," Cd 52.0--2.0",-54," 1:17.04",-34.86," 12/1"," Settled-- 1200-- 800-- Turn--"," 1-Ewey Bay 51.0"]
[{"$f":"IF(Meetings1!A94=\"\",\"\",IF(Meetings1!A94=\"END\",\"END\",IF(Meetings1!E94=\"\",\"\",getAddress(Meetings1!E94))))","v":""},{"$nulls":24},"","9-14 11.5L"," E.Farm","2010-10-02"," 1400m"," Slow"," Race 5"," 3yo Hcp"," Open 3",50000,0," J Kropp",4," Cd 51.5--1.5",-53," 1:25.45",-37.840000000000003," 100/1"," Settled-3 1200-- 800-- Turn-3"," 1-Random Orbit 53.0"]
[{"$f":"IF(Meetings1!A95=\"\",\"\",IF(Meetings1!A95=\"END\",\"END\",IF(Meetings1!E95=\"\",\"\",getAddress(Meetings1!E95))))","v":""},{"$nulls":24},"","7-8 2.2L"," Suncst","2010-09-19"," 1600m"," Good"," Race 2"," 3yo Hcp"," Cls 2 3",10000,0," J Kropp",6," Cd 53.0--2.0",-54," 1:37.87",-35.19," 14/1"," Settled-1 1200-- 800-1 Turn-1"," 1-Satch 57.5"]
[{"$f":"IF(Meetings1!A96=\"\",\"\",IF(Meetings1!A96=\"END\",\"END\",IF(Meetings1!E96=\"\",\"\",getAddress(Meetings1!E96))))","v":""},{"$nulls":24},"","3-11 1.5L"," Mackay","2010-09-07"," 1250m"," Good"," Race 5"," Hcp"," Cls 2",10000,-1000," K Cross",3," Cd 51.0--3.0",-54," 1:14.00"," ()"," 13/4"," Settled-2 1200-- 800-- Turn-1"," 1-Essington 58.0"]
[{"$f":"IF(Meetings1!A97=\"\",\"\",IF(Meetings1!A97=\"END\",\"END\",IF(Meetings1!E97=\"\",\"\",getAddress(Meetings1!E97))))","v":""},{"$nulls":24},"","4-7 3.8L"," Suncst","2010-08-15"," 1600m"," Slow"," Race 1"," 3yo Hcp"," Cls 2 3",10000,-500," K Wharton",4," Cd 55.5-0.0",-54," 1:39.71",-37.590000000000003," 4/1"," Settled-3 1200-- 800-5 Turn-4"," 1-Just About Ready 56.0"]
[{"$f":"IF(Meetings1!A98=\"\",\"\",IF(Meetings1!A98=\"END\",\"END\",IF(Meetings1!E98=\"\",\"\",getAddress(Meetings1!E98))))","v":""},{"$nulls":24},"","10-15 9.1L"," E.Farm","2010-07-24"," 1500m"," Good"," Race 1"," 2yo Hcp"," Open 2",50000,0," J Kropp",2," Cd 51.5--3.0",-53," 1:30.06",-35.909999999999997," 60/1"," Settled-1 1200-- 800-- Turn-1"," 1-Fillydelphia 56.0"]
[{"$f":"IF(Meetings1!A99=\"\",\"\",IF(Meetings1!A99=\"END\",\"END\",IF(Meetings1!E99=\"\",\"\",getAddress(Meetings1!E99))))","v":""},{"$nulls":24},"","2-7 5.0L"," Twbc","2010-07-17"," 1300m"," Good"," Race 6"," 2yo Hcp"," Open 2",10000,-2000," K Wharton",1," Cd 56.0-0.0",-54," 1:20.16",-36.700000000000003," 15/4"," Settled-4 1200-- 800-- Turn-3"," 1-Hidden Treasure 57.0"]
[{"$f":"IF(Meetings1!A100=\"\",\"\",IF(Meetings1!A100=\"END\",\"END\",IF(Meetings1!E100=\"\",\"\",getAddress(Meetings1!E100))))","v":""},{"$nulls":24},"Lola Brigida","6 Lola Brigida (7) 54.0kg 5yo ch m"]
[{"$f":"IF(Meetings1!A101=\"\",\"\",IF(Meetings1!A101=\"END\",\"END\",IF(Meetings1!E101=\"\",\"\",getAddress(Meetings1!E101))))","v":""},{"$nulls":24},"","Colours: Lime green"," maroon sash"," maroon sleeves"]
[{"$nulls":25},"","Owners: D Munns"]
[{"$nulls":25},"","Career:"]
[{"$nulls":25},"","2010-04-04T09:03:00"]
[{"$nulls":25},"","Fast:"]
[{"$nulls":25},"","0:0-0-0"]
[{"$nulls":25},"","1-11 4.5L"," Emrld","2010-11-27"," 1300m"," Good"," Race 5"," Plate"," Cls 3",6000,-4000," T Bannon",10," Cd 56.0-0.0"," (SW)"," 1:17.32"," ()"," 5/1"," Settled-- 1200-- 800-- Turn--"," 2-Senorina 55.5"]
[{"$nulls":25},"","6-11 4.4L"," Rocky","2010-11-18"," 1200m"," Good"," Race 6"," Hcp"," Cls 4",12000,0," C McIver",7," Cd 54.0-0.0",-54," 1:10.05",-34.36," 14/1"," Settled-- 1200-- 800-- Turn--"," 1-Two Tone 58.5"]
[{"$nulls":25},"","1-9 0.5L"," Rocky","2010-11-04"," 1200m"," Dead"," Race 5"," Hcp"," Cls 1",10000,-6500," Ash Butler",9," Cd 54.5-0.0",-54," 1:11.60",-35.17," 11/1"," Settled-- 1200-- 800-- Turn--"," 2-Kickdahabit 53.5"]
[{"$nulls":25},"","4-6 9.3L"," Glad.","2010-10-23"," 1194m"," Good"," Race 5"," Hcp"," Cls 2",6000,-200," C A Beets",3," Cd 57.0-0.0",-55," 1:12.77"," ()"," 13/8"," Settled-- 1200-- 800-- Turn--"," 1-Old Flame 55.0"]
[{"$nulls":25},"","7-12 4.7L"," Rocky","2010-10-14"," 1100m"," Good"," Race 5"," F&m Hcp"," Cls 1 fm",10000,0," T Bannon",3," Cd 57.5-0.0",-54," 1:03.96",-33.99," 4/1"," Settled-- 1200-- 800-- Turn--"," 1-Run Kylie Run 58.5"]
[{"$nulls":25},"","3-14 1.4L"," Rocky","2010-09-16"," 1200m"," Good"," Race 5"," Hcp"," Cls 2",10000,-1000," H O'Hara",6," Cd 53.0--2.0",-54," 1:10.21",-34.58," 6/1"," Settled-- 1200-- 800-- Turn--"," 1-Senorina 52.0"]
[{"$nulls":25},"","3-9 2.8L"," Rocky","2010-09-09"," 1300m"," Good"," Race 3"," Hcp"," Cls 4",12000,-1200," H O'Hara",1," Cd 53.0--1.0",-54," 1:16.40",-34.9," 9/1"," Settled-- 1200-- 800-- Turn--"," 1-Martiros 55.0"]
[{"$nulls":25},"","6-11 1.8L"," Emrld","2010-09-04"," 1200m"," Good"," Race 3"," Hcp"," Cls 4",6000,0," M Cant",6," Cd 55.0-0.0",-55," 1:09.81"," ()"," 8/1"," Settled-- 1200-- 800-- Turn--"," 1-Kalkie Miss 54.5"]
[{"$nulls":25},"","13-13 50.1L"," Rocky","2010-08-26"," 1100m"," Dead"," Race 6"," Hcp"," Cls 1",10000,0," N Thomas",10," Cd 54.5-0.0",-54," 1:04.66",-34.909999999999997," 10/1"," Settled-- 1200-- 800-- Turn--"," 1-Dad's Best Mate 54.0"]
[{"$nulls":25},"","3-10 2.5L"," Rocky","2010-08-12"," 1200m"," Dead"," Race 6"," Hcp"," Cls 2",10000,-1000," N Thomas",2," Cd 54.0-0.0",-54," 1:11.28",-34.020000000000003," 8/1"," Settled-- 1200-- 800-- Turn--"," 1-Aladah 56.0"]
[{"$nulls":25},"Zenacity","7 Zenacity (1) 54.0kg 7yo b m"]
[{"$nulls":25},"","Colours: Pink"," blue hooped sleeves and pink cap"]
[{"$nulls":25},"","Owners: D O'Shea & S J Little"]
[{"$nulls":25},"","Career:"]
[{"$nulls":25},"","2010-04-04T11:03:00"]
[{"$nulls":25},"","Fast:"]
[{"$nulls":25},"","0:0-0-0"]
[{"$nulls":25},"","11-11 7.5L"," Rocky","2010-11-18"," 1200m"," Good"," Race 6"," Hcp"," Cls 4",12000,0," R Hall",10," Cd 54.0-0.0",-54," 1:10.05",-34.36," 25/1"," Settled-- 1200-- 800-- Turn--"," 1-Two Tone 58.5"]
[{"$nulls":25},"","3-5 3.7L"," Glad.","2010-11-02"," 1000m"," Dead"," Race 2"," Plate"," Cls 3",6000,-600," R Hall",2," Cd 57.5-0.0"," (SW)"," 1:00.21"," ()"," 6/4"," Settled-- 1200-- 800-- Turn--"," 1-Mala Mala 54.0"]
[{"$nulls":25},"","9-13 8.4L"," Rocky","2010-06-01"," 1400m"," Good"," Race 7"," Hcp"," Cls 4",10000,0," C Whiteley",1," Cd 54.0-0.0",-54," 1:22.03",-34.270000000000003," 12/1"," Settled-- 1200-- 800-- Turn--"," 1-Writer 54.5"]
[{"$nulls":25},"","8-12 4.2L"," Rocky","2010-05-18"," 1300m"," Good"," Race 8"," Hcp"," Cls 4",10000,0," M Hellyer",5," Cd 54.0-0.0",-54," 1:16.57",-35.01," 12/1"," Settled-- 1200-- 800-- Turn--"," 1-Allbutmine 54.0"]
[{"$nulls":25},"","3-10 3.1L"," Rocky","2010-05-06"," 1050m"," Good"," Race 7"," Hcp"," Cls 4",10000,-1000," C Whiteley",2," Cd 54.0-0.0",-54," 1:00.35",-33.75," 25/1"," Settled-- 1200-- 800-- Turn--"," 1-Andy Said 55.5"]
[{"$nulls":25},"","8-10 3.3L"," Rocky","2010-04-20"," 970m"," Good"," Race 5"," Hcp"," Cls 4",10000,0," R Hall",6," Cd 55.0-0.0",-54," 0:56.50",-33.4," 20/1"," Settled-- 1200-- 800-- Turn--"," 1-Falvalea 58.0"]
[{"$nulls":25},"","6-7 8.8L"," Cushio","2010-01-22"," 1600m"," Good"," Race 2"," Hcp"," Cls 4",10000,0," J Holder",7," Cd 54.0-0.0",-54," 1:38.76",-36.89," 5/1"," Settled-6 1200-- 800-5 Turn-4"," 1-Irishkiwi 56.5"]
[{"$nulls":25},{"$f":"IF(AA131=\"\",\"\",IF(ISERROR(MID(AA131,FIND(\" \",AA131,1)+1,FIND(\"(\",AA131,1)-FIND(\" \",AA131,1)-2)),\"\",MID(AA131,FIND(\" \",AA131,1)+1,FIND(\"(\",AA131,1)-FIND(\" \",AA131,1)-2)))","v":""},"7-11 6.0L"," D'Ben","2010-01-13"," 1650m"," Good"," Race 5"," Hcp"," Cls 4",13000,0," J Wood",2," Cd 50.0--3.0",-53," 1:39.23",-35.33," 12/1"," Settled-9 1200-- 800-10 Turn-10"," 1-Bretonneux 53.5"]
[{"$nulls":25},"","6-13 4.0L"," D'Ben","2009-12-26"," 1350m"," Dead"," Race 2"," F&m Rst0"," RS0MW fm",45000,0," J Holder",5," Cd 53.0-0.0",-53," 1:19.84",-35.229999999999997," 25/1"," Settled-10 1200-- 800-- Turn-11"," 1-Alberton Park 53.0"]
[{"$nulls":25},"","1-12 0.4L"," Cushio","2009-12-11"," 1400m"," Good"," Race 9"," Hcp"," Cls 2",10000,-6500," S Katsidis",9," Cd 54.0-0.0",-54," 1:25.80",-37.380000000000003," 2/1E"," Settled-8 1200-- 800-- Turn-8"," 2-Qwerty 54.0"]
[{"$nulls":25},"Dandy Kat","8 Dandy Kat (6) 54.0kg 6yo b g"]
[{"$nulls":25},"","Colours: Blue"," gold horseshoe"," gold armbands and blue and gold qtrd cap"]
[{"$nulls":25},"","Owners: A P Pianta & C R Green"]
[{"$nulls":25},"","Career:"]
[{"$nulls":25},"",40306.4194444444]
[{"$nulls":25},"","Fast:"]
[{"$nulls":25},"","0:0-0-0"]
[{"$nulls":25},"","7-8 9.9L"," Twbc","2010-11-06"," 1850m"," Good"," Race 5"," Plate"," Cls 3",12000,0," P Wolfgram",5," Cd 58.5-0.0"," (SW)"," 1:56.75",-37.93," 7/2"," Settled-5 1200-- 800-5 Turn-7"," 1-Sunday Advice 55.5"]
[{"$nulls":25},"","5-7 6.4L"," Rocky","2010-10-21"," 1500m"," Good"," Race 3"," Open"," Open",10000,0," A Coome",7," Cd 54.0-0.0",-54," 1:29.91",-34.58," 5/1"," Settled-- 1200-- 800-- Turn--"," 1-Tantat Secret 60.0"]
[{"$nulls":25},"","4-10 3.0L"," Rocky","2010-10-14"," 1821m"," Good"," Race 4"," Hcp"," Cls 3",12000,-600," A Coome",10," Cd 57.0-0.0",-54," 1:50.68",-35.19," 4/1"," Settled-- 1200-- 800-- Turn--"," 1-Ewey Bay 52.5"]
[{"$nulls":25},"","11-15 7.7L"," Rocky","2010-10-07"," 1200m"," Good"," Race 7"," Hcp"," Cls 3",10000,0," C McIver",4," Cd 56.0-0.0",-54," 1:10.26",-34.68," 25/1"," Settled-- 1200-- 800-- Turn--"," 1-Basheeba 56.0"]
[{"$nulls":25},"","6-7 8.7L"," Mackay","2010-09-18"," 1250m"," Good"," Race 2"," Plate"," Cls 3",7500,0," D Whitmore",2," Cd 58.5-0.0"," (SW)"," 1:13.30"," ()"," 5/1"," Settled-- 1200-- 800-- Turn--"," 1-Springbok Lad 58.5"]
[{"$nulls":25},"","9-10 6.3L"," Rocky","2010-06-01"," 1828m"," Good"," Race 6"," Hcp"," Cls 3",12000,0," A Coome",3," Cd 58.0-0.0",-54," 1:50.41",-35.43," 5/1"," Settled-- 1200-- 800-- Turn--"," 1-A Boy Called Sue 57.0"]
[{"$nulls":25},"","2-8 0.2L"," Rocky","2010-05-06"," 1823m"," Good"," Race 3"," Hcp"," Cls 3",10000,-2000," Dale Missen",5," Cd 57.5-0.0",-54," 1:51.02",-35.409999999999997," 4/1"," Settled-- 1200-- 800-- Turn--"," 1-Sir Echo 55.0"]
[{"$nulls":25},"","9-13 8.7L"," Rocky","2010-04-28"," 1500m"," Good"," Race 7"," Hcp"," Cls 4",10000,0," B Hull",10," Cd 54.5-0.0",-54," 1:28.69",-35.450000000000003," 8/1"," Settled-- 1200-- 800-- Turn--"," 1-Tomkins 52.0"]
[{"$nulls":25},"","2-9 1.5L"," Rocky","2010-04-09"," 2203m"," Good"," Race 5"," Plate"," Cls 3",15000,-3000," A Coome",2," Cd 58.5-0.0"," (SW)"," 2:14.98"," ()"," 9/2"," Settled-- 1200-- 800-- Turn--"," 1-Craiglea Bella 55.0"]
[{"$nulls":25},"","5-8 3.1L"," Rocky","2010-03-25"," 2200m"," Dead"," Race 2"," Hcp"," Cls 3",10000,0," A Coome",2," Cd 57.5-0.0",-54," 2:24.47"," ()"," 9/4F"," Settled-- 1200-- 800-- Turn--"," 1-Gremmo 56.5"]
[{"$nulls":25},"Fu Min Bu","9 Fu Min Bu (9) 54.0kg 5yo b/br m"]
[{"$nulls":25},"","Colours: Red with purple sash"," purple armbands and white cap"]
[{"$nulls":25},"","Owners: Mrs G J Sullivan & B Sullivan"]
[{"$nulls":25},"","Career:"]
[{"$nulls":25},"","2010-03-04T13:02:00"]
[{"$nulls":25},"","Fast:"]
[{"$nulls":25},"","0:0-0-0"]
[{"$nulls":25},"","6-8 4.0L"," Corowa","2010-11-02"," 1000m"," Dead"," Race 5"," "," BM45",4000,0," A Beer",4," Cd 53.5--2.0",-54," 0:57.88"," ()"," 4/1"," Settled-- 1200-- 800-- Turn--"," 1-Teshi Tallarah 55.5"]
[{"$nulls":25},"","6-7 4.8L"," Wagga","2010-10-02"," 1200m"," Dead"," Race 4"," F&m"," BM45 fm",4000,0," A Bloomfield",3," Cd 58.0-0.0",-54," 1:11.44"," ()"," 5/2E"," Settled-- 1200-- 800-- Turn--"," 1-Rustie Bugles 59.5"]
[{"$nulls":25},"","3-12 1.8L"," Grenfl","2010-09-25"," 1200m"," Good"," Race 4"," "," BM45",3500,-300," A Bloomfield",10," Cd 56.0-0.0",-54," 1:13.44"," ()"," 9/1"," Settled-- 1200-- 800-- Turn--"," 1-Cleary's Creek 57.5"]
[{"$nulls":25},"","8-11 7.0L"," G'burn","2010-09-07"," 1300m"," Dead"," Race 7"," "," BM50",10000,0," R Bensley",4," Cd 54.0-0.0",-54," 1:18.55",-37.39," 20/1"," Settled-8 1200-- 800-- Turn-7"," 1-Monzero 59.0"]
[{"$nulls":25},"","5-12 1.1L"," Narran","2010-08-28"," 1400m"," Dead"," Race 7"," F&m"," BM50 fm",9000,0," A Bloomfield",3," Cd 56.0-0.0",-54," 1:25.77",-37.4," 7/1"," Settled-- 1200-- 800-- Turn--"," 1-Covers 59.5"]
[{"$nulls":25},"","3-12 2.4L"," Narran","2010-08-21"," 1200m"," Dead"," Race 3"," "," BM45",4000,-400," W Pearson",8," Cd 56.5-0.0",-54," 1:12.68",-37.93," 5/1"," Settled-- 1200-- 800-- Turn--"," 1-Awesome Feeling 58.5"]
[{"$nulls":25},"","5-8 4.2L"," Leeton","2010-08-08"," 1000m"," Dead"," Race 7"," "," BM55",9000,0," J Kissick",5," Cd 50.0--4.0",-54," 0:59.40",-35.26," 8/1"," Settled-- 1200-- 800-- Turn--"," 1-Prime Cognac 59.5"]
[{"$nulls":25},"","4-10 3.0L"," Wagga","2010-07-27"," 1000m"," Slow"," Race 7"," "," BM50",9000,0," S G Walsh",8," Cd 55.0-0.0",-54," 0:58.91"," ()"," 20/1"," Settled-- 1200-- 800-- Turn--"," 1-Look At The Rose 58.0"]
[{"$nulls":25},"","11-12 9.1L"," Acton","2010-07-11"," 1080m"," Good"," Race 6"," Hcp"," Cls 2",11000,0," A Bloomfield",12," Cd 54.0-0.0",-54," 1:02.68",-34.61," 25/1"," Settled-11 1200-- 800-- Turn-12"," 1-Plutonic 55.0"]
[{"$nulls":25},"","8-10 3.6L"," Tumut","2010-03-13"," 1200m"," Good"," Race 3"," Hcp"," BM45",5100,0," T Jeffries",1," Cd 56.5--2.0",-54," 1:12.04"," ()"," 13/4"," Settled-- 1200-- 800-- Turn--"," 1-Thatsmyemgee 56.0"]
[{"$nulls":25},""]
[{"$nulls":25},""]
[{"$nulls":25},""]
[{"$nulls":25},""]
[{"$nulls":25},""]
[{"$nulls":25},""]
[{"$nulls":25},""]
[{"$nulls":25},""]
[{"$nulls":25},""]
[{"$nulls":25},""]
[{"$nulls":25},""]
[{"$nulls":25},""]
[{"$nulls":25},""]
[{"$nulls":25},""]
[{"$nulls":25},""]
[{"$nulls":25},""]
[{"$nulls":25},""]
[{"$nulls":25},""]
[{"$nulls":25},""]
[{"$nulls":25},""]
[{"$nulls":25},""]
[{"$nulls":25},""]
[{"$nulls":25},""]
[{"$nulls":25},""]
[{"$nulls":25},""]
[{"$nulls":25},""]
[{"$nulls":25},""]
[{"$nulls":25},{"$f":"IF(AA195=\"\",\"\",IF(ISERROR(MID(AA195,FIND(\" \",AA195,1)+1,FIND(\"(\",AA195,1)-FIND(\" \",AA195,1)-2)),\"\",MID(AA195,FIND(\" \",AA195,1)+1,FIND(\"(\",AA195,1)-FIND(\" \",AA195,1)-2)))","v":""}]
[{"$nulls":25},""]
[{"$nulls":25},""]
[{"$nulls":25},""]
[{"$nulls":25},""]
[{"$nulls":25},""]
[{"$nulls":25},""]
[{"$nulls":25},""]
[{"$nulls":25},""]
[{"$nulls":25},""]
[{"$nulls":25},""]
[{"$nulls":25},""]
[{"$nulls":25},""]
[{"$nulls":25},""]
[{"$nulls":25},""]
[{"$nulls":25},""]
[{"$nulls":25},""]
[{"$nulls":25},""]
[{"$nulls":25},""]
[{"$nulls":25},""]
[{"$nulls":25},""]
[{"$nulls":25},""]
[{"$nulls":25},""]
[{"$nulls":25},""]
[{"$nulls":25},""]
[{"$nulls":25},""]
[{"$nulls":25},""]
[{"$nulls":25},""]
[{"$nulls":25},""]
[{"$nulls":25},""]
[{"$nulls":25},""]
[{"$nulls":25},""]
[{"$nulls":25},""]
[{"$nulls":25},""]
[{"$nulls":25},""]
[{"$nulls":25},""]
[{"$nulls":25},""]
[{"$nulls":25},""]
[{"$nulls":25},""]
[{"$nulls":25},""]
[{"$nulls":25},""]
[{"$nulls":25},""]
[{"$nulls":25},""]
[{"$nulls":25},""]
[{"$nulls":25},""]
[{"$nulls":25},""]
[{"$nulls":25},""]
[{"$nulls":25},""]
[{"$nulls":25},""]
[{"$nulls":25},""]
[{"$nulls":25},""]
[{"$nulls":25},""]
[{"$nulls":25},""]
[{"$nulls":25},""]
[{"$nulls":25},""]
[{"$nulls":25},""]
[{"$nulls":25},""]
[{"$nulls":25},""]
[{"$nulls":25},""]
[{"$nulls":25},""]
[{"$nulls":25},""]
[{"$nulls":25},""]
[{"$nulls":25},""]
[{"$nulls":25},""]
[{"$nulls":25},{"$f":"IF(AA259=\"\",\"\",IF(ISERROR(MID(AA259,FIND(\" \",AA259,1)+1,FIND(\"(\",AA259,1)-FIND(\" \",AA259,1)-2)),\"\",MID(AA259,FIND(\" \",AA259,1)+1,FIND(\"(\",AA259,1)-FIND(\" \",AA259,1)-2)))","v":""}]
[{"$nulls":25},""]
[{"$nulls":25},""]
[{"$nulls":25},""]
[{"$nulls":25},""]
[{"$nulls":25},""]
[{"$nulls":25},""]
[{"$nulls":25},""]
[{"$nulls":25},""]
[{"$nulls":25},""]
[{"$nulls":25},""]
[{"$nulls":25},""]
[{"$nulls":25},""]
[{"$nulls":25},""]
[{"$nulls":25},""]
[{"$nulls":25},""]
[{"$nulls":25},""]
[{"$nulls":25},""]
[{"$nulls":25},""]
[{"$nulls":25},""]
[{"$nulls":25},""]
[{"$nulls":25},""]
[{"$nulls":25},""]
[{"$nulls":25},""]
[{"$nulls":25},""]
[{"$nulls":25},""]
[{"$nulls":25},""]
[{"$nulls":25},""]
[{"$nulls":25},""]
[{"$nulls":25},""]
[{"$nulls":25},""]
[{"$nulls":25},""]
[{"$nulls":25},""]
[{"$nulls":25},""]
[{"$nulls":25},""]
[{"$nulls":25},""]
[{"$nulls":25},""]
[{"$nulls":25},""]
[{"$nulls":25},""]
[{"$nulls":25},""]
[{"$nulls":25},""]
[{"$nulls":25},""]
[{"$nulls":25},""]
[{"$nulls":25},""]
[{"$nulls":25},""]
[{"$nulls":25},""]
[{"$nulls":25},""]
[{"$nulls":25},""]
[{"$nulls":25},""]
[{"$nulls":25},""]
[{"$nulls":25},""]
[{"$nulls":25},""]
[{"$nulls":25},""]
[{"$nulls":25},""]
[{"$nulls":25},""]
[{"$nulls":25},""]
[{"$nulls":25},""]
[{"$nulls":25},""]
[{"$nulls":25},""]
[{"$nulls":25},""]
[{"$nulls":25},""]
[{"$nulls":25},""]
[{"$nulls":25},""]
[{"$nulls":25},""]
[{"$nulls":25},{"$f":"IF(AA323=\"\",\"\",IF(ISERROR(MID(AA323,FIND(\" \",AA323,1)+1,FIND(\"(\",AA323,1)-FIND(\" \",AA323,1)-2)),\"\",MID(AA323,FIND(\" \",AA323,1)+1,FIND(\"(\",AA323,1)-FIND(\" \",AA323,1)-2)))","v":""}]
[{"$nulls":25},""]
[{"$nulls":25},""]
[{"$nulls":25},""]
[{"$nulls":25},""]
[{"$nulls":25},""]
[{"$nulls":25},""]
[{"$nulls":25},""]
[{"$nulls":25},""]
[{"$nulls":25},""]
[{"$nulls":25},""]
[{"$nulls":25},""]
[{"$nulls":25},""]
[{"$nulls":25},""]
[{"$nulls":25},""]
[{"$nulls":25},""]
[{"$nulls":25},""]
[{"$nulls":25},""]
[{"$nulls":25},""]
[{"$nulls":25},""]
[{"$nulls":25},""]
[{"$nulls":25},""]
[{"$nulls":25},""]
[{"$nulls":25},""]
[{"$nulls":25},""]
[{"$nulls":25},""]
[{"$nulls":25},""]
[{"$nulls":25},""]
[{"$nulls":25},""]
[{"$nulls":25},""]
[{"$nulls":25},""]
[{"$nulls":25},""]
[{"$nulls":25},""]
[{"$nulls":25},""]
[{"$nulls":25},""]
[{"$nulls":25},""]
[{"$nulls":25},""]
[{"$nulls":25},""]
[{"$nulls":25},""]
[{"$nulls":25},""]
[{"$nulls":25},""]
[{"$nulls":25},""]
[{"$nulls":25},""]
[{"$nulls":25},""]
[{"$nulls":25},""]
[{"$nulls":25},""]
[{"$nulls":25},""]
[{"$nulls":25},""]
[{"$nulls":25},""]
[{"$nulls":25},""]
[{"$nulls":25},""]
[{"$nulls":25},""]
[{"$nulls":25},""]
[{"$nulls":25},""]
[{"$nulls":25},""]
[{"$nulls":25},""]
[{"$nulls":25},""]
[{"$nulls":25},""]
[{"$nulls":25},""]
[{"$nulls":25},""]
[{"$nulls":25},""]
[{"$nulls":25},""]
[{"$nulls":25},""]
[{"$nulls":25},""]
[{"$nulls":25},{"$f":"IF(AA387=\"\",\"\",IF(ISERROR(MID(AA387,FIND(\" \",AA387,1)+1,FIND(\"(\",AA387,1)-FIND(\" \",AA387,1)-2)),\"\",MID(AA387,FIND(\" \",AA387,1)+1,FIND(\"(\",AA387,1)-FIND(\" \",AA387,1)-2)))","v":""}]
[{"$nulls":25},""]
[{"$nulls":25},""]
[{"$nulls":25},""]
[{"$nulls":25},""]
[{"$nulls":25},""]
[{"$nulls":25},""]
[{"$nulls":25},""]
[{"$nulls":25},""]
[{"$nulls":25},""]
[{"$nulls":25},""]
[{"$nulls":25},""]
[{"$nulls":25},""]
[{"$nulls":25},""]
[{"$nulls":25},""]
[{"$nulls":25},""]
[{"$nulls":25},""]
[{"$nulls":25},""]
[{"$nulls":25},""]
[{"$nulls":25},""]
[{"$nulls":25},""]
[{"$nulls":25},""]
[{"$nulls":25},""]
[{"$nulls":25},""]
[{"$nulls":25},""]
[{"$nulls":25},""]
[{"$nulls":25},""]
[{"$nulls":25},""]
[{"$nulls":25},""]
[{"$nulls":25},""]
[{"$nulls":25},""]
[{"$nulls":25},""]
[{"$nulls":25},""]
[{"$nulls":25},""]
[{"$nulls":25},""]
[{"$nulls":25},""]
[{"$nulls":25},""]
[{"$nulls":25},""]
[{"$nulls":25},""]
[{"$nulls":25},""]
[{"$nulls":25},""]
[{"$nulls":25},""]
[{"$nulls":25},""]
[{"$nulls":25},""]
[{"$nulls":25},""]
[{"$nulls":25},""]
[{"$nulls":25},""]
[{"$nulls":25},""]
[{"$nulls":25},""]
[{"$nulls":25},""]
[{"$nulls":25},""]
[{"$nulls":25},""]
[{"$nulls":25},""]
[{"$nulls":25},""]
[{"$nulls":25},""]
[{"$nulls":25},""]
[{"$nulls":25},""]
[{"$nulls":25},""]
[{"$nulls":25},""]
[{"$nulls":13},{"$f":"IF(M446=\"\",\"\",IF(ISERROR(LEFT(M446,FIND(\"-\",M446)-1)),IF(ISERROR(LEFT(M446,FIND(\" \",M446)-1)),M446,LEFT(M446,FIND(\" \",M446)-1)),LEFT(M446,FIND(\"-\",M446)-1)))","v":""},{"$nulls":11},""]
[{"$nulls":13},"",{"$nulls":11},""]
[{"$nulls":13},"",{"$nulls":11},""]
[{"$nulls":13},"",{"$nulls":11},""]
[{"$nulls":13},"",{"$nulls":11},""]
[{"$nulls":13},"",{"$nulls":11},{"$f":"IF(AA451=\"\",\"\",IF(ISERROR(MID(AA451,FIND(\" \",AA451,1)+1,FIND(\"(\",AA451,1)-FIND(\" \",AA451,1)-2)),\"\",MID(AA451,FIND(\" \",AA451,1)+1,FIND(\"(\",AA451,1)-FIND(\" \",AA451,1)-2)))","v":""}]
[{"$nulls":13},{"$f":"IF(M452=\"\",\"\",IF(ISERROR(LEFT(M452,FIND(\"-\",M452)-1)),IF(ISERROR(LEFT(M452,FIND(\" \",M452)-1)),M452,LEFT(M452,FIND(\" \",M452)-1)),LEFT(M452,FIND(\"-\",M452)-1)))","v":""},{"$nulls":11},""]
[{"$nulls":13},"",{"$nulls":11},""]
[{"$nulls":13},"",{"$nulls":11},""]
[{"$nulls":13},"",{"$nulls":11},""]
[{"$nulls":13},"",{"$nulls":11},""]
[{"$nulls":13},"",{"$nulls":11},""]
[{"$nulls":13},"",{"$nulls":11},""]
[{"$nulls":13},"",{"$nulls":11},""]
[{"$nulls":13},"",{"$nulls":11},""]
[{"$nulls":13},"",{"$nulls":11},""]
[{"$nulls":13},"",{"$nulls":11},""]
[{"$nulls":13},"",{"$nulls":11},""]
[{"$nulls":13},"",{"$nulls":11},""]
[{"$nulls":13},"",{"$nulls":11},""]
[{"$nulls":13},"",{"$nulls":11},""]
[{"$nulls":13},"",{"$nulls":11},""]
[{"$nulls":13},"",{"$nulls":11},""]
[{"$nulls":13},"",{"$nulls":11},""]
[{"$nulls":13},"",{"$nulls":11},""]
[{"$nulls":13},"",{"$nulls":11},""]
[{"$nulls":13},"",{"$nulls":11},""]
[{"$nulls":13},"",{"$nulls":11},""]
[{"$nulls":13},"",{"$nulls":11},""]
[{"$nulls":13},"",{"$nulls":11},""]
[{"$nulls":13},"",{"$nulls":11},""]
[{"$nulls":13},"",{"$nulls":11},""]
[{"$nulls":13},"",{"$nulls":11},""]
[{"$nulls":13},"",{"$nulls":11},""]
[{"$nulls":13},"",{"$nulls":11},""]
[{"$nulls":13},"",{"$nulls":11},""]
[{"$nulls":13},"",{"$nulls":11},""]
[{"$nulls":13},"",{"$nulls":11},""]
[{"$nulls":13},"",{"$nulls":11},""]
[{"$nulls":13},"",{"$nulls":11},""]
[{"$nulls":13},"",{"$nulls":11},""]
[{"$nulls":13},"",{"$nulls":11},""]
[{"$nulls":13},"",{"$nulls":11},""]
[{"$nulls":13},"",{"$nulls":11},""]
[{"$nulls":13},"",{"$nulls":11},""]
[{"$nulls":13},"",{"$nulls":11},""]
[{"$nulls":13},"",{"$nulls":11},""]
[{"$nulls":13},"",{"$nulls":11},""]
[{"$nulls":13},"",{"$nulls":11},""]
[{"$nulls":13},"",{"$nulls":11},""]
[{"$nulls":13},"",{"$nulls":11},""]
[{"$nulls":13},"",{"$nulls":11},""]
[{"$nulls":13},"",{"$nulls":11},""]
[{"$nulls":13},"",{"$nulls":11},""]
[{"$nulls":13},"",{"$nulls":11},""]
[{"$nulls":13},"",{"$nulls":11},""]
[{"$nulls":13},"",{"$nulls":11},""]
[{"$nulls":13},"",{"$nulls":11},""]
[{"$nulls":13},"",{"$nulls":11},""]
[{"$nulls":13},"",{"$nulls":11},""]
[{"$nulls":13},"",{"$nulls":11},""]
[{"$nulls":13},"",{"$nulls":11},""]
[{"$nulls":13},"",{"$nulls":11},""]
[{"$nulls":13},"",{"$nulls":11},""]
[{"$nulls":13},"",{"$nulls":11},""]
[{"$nulls":13},"",{"$nulls":11},""]
[{"$nulls":13},"",{"$nulls":11},""]
[{"$nulls":13},"",{"$nulls":11},""]
[{"$nulls":13},"",{"$nulls":11},""]
[{"$nulls":13},"",{"$nulls":11},{"$f":"IF(AA515=\"\",\"\",IF(ISERROR(MID(AA515,FIND(\" \",AA515,1)+1,FIND(\"(\",AA515,1)-FIND(\" \",AA515,1)-2)),\"\",MID(AA515,FIND(\" \",AA515,1)+1,FIND(\"(\",AA515,1)-FIND(\" \",AA515,1)-2)))","v":""}]
[{"$nulls":13},{"$f":"IF(M516=\"\",\"\",IF(ISERROR(LEFT(M516,FIND(\"-\",M516)-1)),IF(ISERROR(LEFT(M516,FIND(\" \",M516)-1)),M516,LEFT(M516,FIND(\" \",M516)-1)),LEFT(M516,FIND(\"-\",M516)-1)))","v":""},{"$nulls":11},""]
[{"$nulls":13},"",{"$nulls":11},""]
[{"$nulls":13},"",{"$nulls":11},""]
[{"$nulls":13},"",{"$nulls":11},""]
[{"$nulls":13},"",{"$nulls":11},""]
[{"$nulls":13},"",{"$nulls":11},""]
[{"$nulls":13},"",{"$nulls":11},""]
[{"$nulls":13},"",{"$nulls":11},""]
[{"$nulls":13},"",{"$nulls":11},""]
[{"$nulls":13},"",{"$nulls":11},""]
[{"$nulls":13},"",{"$nulls":11},""]
[{"$nulls":13},"",{"$nulls":11},""]
[{"$nulls":13},"",{"$nulls":11},""]
[{"$nulls":13},"",{"$nulls":11},""]
[{"$nulls":13},"",{"$nulls":11},""]
[{"$nulls":13},"",{"$nulls":11},""]
[{"$nulls":13},"",{"$nulls":11},""]
[{"$nulls":13},"",{"$nulls":11},""]
[{"$nulls":13},"",{"$nulls":11},""]
[{"$nulls":13},"",{"$nulls":11},""]
[{"$nulls":13},"",{"$nulls":11},""]
[{"$nulls":13},"",{"$nulls":11},""]
[{"$nulls":13},"",{"$nulls":11},""]
[{"$nulls":13},"",{"$nulls":11},""]
[{"$nulls":13},"",{"$nulls":11},""]
[{"$nulls":13},"",{"$nulls":11},""]
[{"$nulls":13},"",{"$nulls":11},""]
[{"$nulls":13},"",{"$nulls":11},""]
[{"$nulls":13},"",{"$nulls":11},""]
[{"$nulls":13},"",{"$nulls":11},""]
[{"$nulls":13},"",{"$nulls":11},""]
[{"$nulls":13},"",{"$nulls":11},""]
[{"$nulls":13},"",{"$nulls":11},""]
[{"$nulls":13},"",{"$nulls":11},""]
[{"$nulls":13},"",{"$nulls":11},""]
[{"$nulls":13},"",{"$nulls":11},""]
[{"$nulls":13},"",{"$nulls":11},""]
[{"$nulls":13},"",{"$nulls":11},""]
[{"$nulls":13},"",{"$nulls":11},""]
[{"$nulls":13},"",{"$nulls":11},""]
[{"$nulls":13},"",{"$nulls":11},""]
[{"$nulls":13},"",{"$nulls":11},""]
[{"$nulls":13},"",{"$nulls":11},""]
[{"$nulls":13},"",{"$nulls":11},""]
[{"$nulls":13},"",{"$nulls":11},""]
[{"$nulls":13},"",{"$nulls":11},""]
[{"$nulls":13},"",{"$nulls":11},""]
[{"$nulls":13},"",{"$nulls":11},""]
[{"$nulls":13},"",{"$nulls":11},""]
[{"$nulls":13},"",{"$nulls":11},""]
[{"$nulls":13},"",{"$nulls":11},""]
[{"$nulls":13},"",{"$nulls":11},""]
[{"$nulls":13},"",{"$nulls":11},""]
[{"$nulls":13},"",{"$nulls":11},""]
[{"$nulls":13},"",{"$nulls":11},""]
[{"$nulls":13},"",{"$nulls":11},""]
[{"$nulls":13},"",{"$nulls":11},""]
[{"$nulls":13},"",{"$nulls":11},""]
[{"$nulls":13},"",{"$nulls":11},""]
[{"$nulls":13},"",{"$nulls":11},""]
[{"$nulls":13},"",{"$nulls":11},""]
[{"$nulls":13},"",{"$nulls":11},""]
[{"$nulls":13},"",{"$nulls":11},""]
[{"$nulls":13},"",{"$nulls":11},{"$f":"IF(AA579=\"\",\"\",IF(ISERROR(MID(AA579,FIND(\" \",AA579,1)+1,FIND(\"(\",AA579,1)-FIND(\" \",AA579,1)-2)),\"\",MID(AA579,FIND(\" \",AA579,1)+1,FIND(\"(\",AA579,1)-FIND(\" \",AA579,1)-2)))","v":""}]
[{"$nulls":13},{"$f":"IF(M580=\"\",\"\",IF(ISERROR(LEFT(M580,FIND(\"-\",M580)-1)),IF(ISERROR(LEFT(M580,FIND(\" \",M580)-1)),M580,LEFT(M580,FIND(\" \",M580)-1)),LEFT(M580,FIND(\"-\",M580)-1)))","v":""},{"$nulls":11},""]
[{"$nulls":13},"",{"$nulls":11},""]
[{"$nulls":13},"",{"$nulls":11},""]
[{"$nulls":13},"",{"$nulls":11},""]
[{"$nulls":13},"",{"$nulls":11},""]
[{"$nulls":13},"",{"$nulls":11},""]
[{"$nulls":13},"",{"$nulls":11},""]
[{"$nulls":13},"",{"$nulls":11},""]
[{"$nulls":13},"",{"$nulls":11},""]
[{"$nulls":13},"",{"$nulls":11},""]
[{"$nulls":13},"",{"$nulls":11},""]
[{"$nulls":13},"",{"$nulls":11},""]
[{"$nulls":13},"",{"$nulls":11},""]
[{"$nulls":13},"",{"$nulls":11},""]
[{"$nulls":13},"",{"$nulls":11},""]
[{"$nulls":13},"",{"$nulls":11},""]
[{"$nulls":13},"",{"$nulls":11},""]
[{"$nulls":13},"",{"$nulls":11},""]
[{"$nulls":13},"",{"$nulls":11},""]
[{"$nulls":13},"",{"$nulls":11},""]
[{"$nulls":13},"",{"$nulls":11},""]
[{"$nulls":13},"",{"$nulls":11},""]
[{"$nulls":13},"",{"$nulls":11},""]
[{"$nulls":13},"",{"$nulls":11},""]
[{"$nulls":13},"",{"$nulls":11},""]
[{"$nulls":13},"",{"$nulls":11},""]
[{"$nulls":13},"",{"$nulls":11},""]
[{"$nulls":13},"",{"$nulls":11},""]
[{"$nulls":13},"",{"$nulls":11},""]
[{"$nulls":13},"",{"$nulls":11},""]
[{"$nulls":13},"",{"$nulls":11},""]
[{"$nulls":13},"",{"$nulls":11},""]
[{"$nulls":13},"",{"$nulls":11},""]
[{"$nulls":13},"",{"$nulls":11},""]
[{"$nulls":13},"",{"$nulls":11},""]
[{"$nulls":13},"",{"$nulls":11},""]
[{"$nulls":13},"",{"$nulls":11},""]
[{"$nulls":13},"",{"$nulls":11},""]
[{"$nulls":13},"",{"$nulls":11},""]
[{"$nulls":13},"",{"$nulls":11},""]
[{"$nulls":13},"",{"$nulls":11},""]
[{"$nulls":13},"",{"$nulls":11},""]
[{"$nulls":13},"",{"$nulls":11},""]
[{"$nulls":13},"",{"$nulls":11},""]
[{"$nulls":13},"",{"$nulls":11},""]
[{"$nulls":13},"",{"$nulls":11},""]
[{"$nulls":13},"",{"$nulls":11},""]
[{"$nulls":13},"",{"$nulls":11},""]
[{"$nulls":13},"",{"$nulls":11},""]
[{"$nulls":13},"",{"$nulls":11},""]
[{"$nulls":13},"",{"$nulls":11},""]
[{"$nulls":13},"",{"$nulls":11},""]
[{"$nulls":13},"",{"$nulls":11},""]
[{"$nulls":13},"",{"$nulls":11},""]
[{"$nulls":13},"",{"$nulls":11},""]
[{"$nulls":13},"",{"$nulls":11},""]
[{"$nulls":13},"",{"$nulls":11},""]
[{"$nulls":13},"",{"$nulls":11},""]
[{"$nulls":13},"",{"$nulls":11},""]
[{"$nulls":13},"",{"$nulls":11},""]
[{"$nulls":13},"",{"$nulls":11},""]
[{"$nulls":13},"",{"$nulls":11},""]
[{"$nulls":13},"",{"$nulls":11},""]
[{"$nulls":13},"",{"$nulls":11},{"$f":"IF(AA643=\"\",\"\",IF(ISERROR(MID(AA643,FIND(\" \",AA643,1)+1,FIND(\"(\",AA643,1)-FIND(\" \",AA643,1)-2)),\"\",MID(AA643,FIND(\" \",AA643,1)+1,FIND(\"(\",AA643,1)-FIND(\" \",AA643,1)-2)))","v":""}]
[{"$nulls":13},{"$f":"IF(M644=\"\",\"\",IF(ISERROR(LEFT(M644,FIND(\"-\",M644)-1)),IF(ISERROR(LEFT(M644,FIND(\" \",M644)-1)),M644,LEFT(M644,FIND(\" \",M644)-1)),LEFT(M644,FIND(\"-\",M644)-1)))","v":""},{"$nulls":11},""]
[{"$nulls":13},"",{"$nulls":11},""]
[{"$nulls":13},"",{"$nulls":11},""]
[{"$nulls":13},"",{"$nulls":11},""]
[{"$nulls":13},"",{"$nulls":11},""]
[{"$nulls":13},"",{"$nulls":11},""]
[{"$nulls":13},"",{"$nulls":11},""]
[{"$nulls":13},"",{"$nulls":11},""]
[{"$nulls":13},"",{"$nulls":11},""]
[{"$nulls":13},"",{"$nulls":11},""]
[{"$nulls":13},"",{"$nulls":11},""]
[{"$nulls":13},"",{"$nulls":11},""]
[{"$nulls":13},"",{"$nulls":11},""]
[{"$nulls":13},"",{"$nulls":11},""]
[{"$nulls":13},"",{"$nulls":11},""]
[{"$nulls":13},"",{"$nulls":11},""]
[{"$nulls":13},"",{"$nulls":11},""]
[{"$nulls":13},"",{"$nulls":11},""]
[{"$nulls":13},"",{"$nulls":11},""]
[{"$nulls":13},"",{"$nulls":11},""]
[{"$nulls":13},"",{"$nulls":11},""]
[{"$nulls":13},"",{"$nulls":11},""]
[{"$nulls":13},"",{"$nulls":11},""]
[{"$nulls":13},"",{"$nulls":11},""]
[{"$nulls":13},"",{"$nulls":11},""]
[{"$nulls":13},"",{"$nulls":11},""]
[{"$nulls":13},"",{"$nulls":11},""]
[{"$nulls":13},"",{"$nulls":11},""]
[{"$nulls":13},"",{"$nulls":11},""]
[{"$nulls":13},"",{"$nulls":11},""]
[{"$nulls":13},"",{"$nulls":11},""]
[{"$nulls":13},"",{"$nulls":11},""]
[{"$nulls":13},"",{"$nulls":11},""]
[{"$nulls":13},"",{"$nulls":11},""]
[{"$nulls":13},"",{"$nulls":11},""]
[{"$nulls":13},"",{"$nulls":11},""]
[{"$nulls":13},"",{"$nulls":11},""]
[{"$nulls":13},"",{"$nulls":11},""]
[{"$nulls":13},"",{"$nulls":11},""]
[{"$nulls":13},"",{"$nulls":11},""]
[{"$nulls":13},"",{"$nulls":11},""]
[{"$nulls":13},"",{"$nulls":11},""]
[{"$nulls":13},"",{"$nulls":11},""]
[{"$nulls":13},"",{"$nulls":11},""]
[{"$nulls":13},"",{"$nulls":11},""]
[{"$nulls":13},"",{"$nulls":11},""]
[{"$nulls":13},"",{"$nulls":11},""]
[{"$nulls":13},"",{"$nulls":11},""]
[{"$nulls":13},"",{"$nulls":11},""]
[{"$nulls":13},"",{"$nulls":11},""]
[{"$nulls":13},"",{"$nulls":11},""]
[{"$nulls":13},"",{"$nulls":11},""]
[{"$nulls":13},"",{"$nulls":11},""]
[{"$nulls":13},"",{"$nulls":11},""]
[{"$nulls":13},"",{"$nulls":11},""]
[{"$nulls":13},"",{"$nulls":11},""]
[{"$nulls":13},"",{"$nulls":11},""]
[{"$nulls":13},"",{"$nulls":11},""]
[{"$nulls":13},"",{"$nulls":11},""]
[{"$nulls":13},"",{"$nulls":11},""]
[{"$nulls":13},"",{"$nulls":11},""]
[{"$nulls":13},"",{"$nulls":11},""]
[{"$nulls":13},"",{"$nulls":11},""]
[{"$nulls":13},"",{"$nulls":11},{"$f":"IF(AA707=\"\",\"\",IF(ISERROR(MID(AA707,FIND(\" \",AA707,1)+1,FIND(\"(\",AA707,1)-FIND(\" \",AA707,1)-2)),\"\",MID(AA707,FIND(\" \",AA707,1)+1,FIND(\"(\",AA707,1)-FIND(\" \",AA707,1)-2)))","v":""}]
[{"$nulls":13},{"$f":"IF(M708=\"\",\"\",IF(ISERROR(LEFT(M708,FIND(\"-\",M708)-1)),IF(ISERROR(LEFT(M708,FIND(\" \",M708)-1)),M708,LEFT(M708,FIND(\" \",M708)-1)),LEFT(M708,FIND(\"-\",M708)-1)))","v":""},{"$nulls":11},""]
[{"$nulls":13},"",{"$nulls":11},""]
[{"$nulls":13},"",{"$nulls":11},""]
[{"$nulls":13},"",{"$nulls":11},""]
[{"$nulls":13},"",{"$nulls":11},""]
[{"$nulls":13},"",{"$nulls":11},""]
[{"$nulls":13},"",{"$nulls":11},""]
[{"$nulls":13},"",{"$nulls":11},""]
[{"$nulls":13},"",{"$nulls":11},""]
[{"$nulls":13},"",{"$nulls":11},""]
[{"$nulls":13},"",{"$nulls":11},""]
[{"$nulls":13},"",{"$nulls":11},""]
[{"$nulls":13},"",{"$nulls":11},""]
[{"$nulls":13},"",{"$nulls":11},""]
[{"$nulls":13},"",{"$nulls":11},""]
[{"$nulls":13},"",{"$nulls":11},""]
[{"$nulls":13},"",{"$nulls":11},""]
[{"$nulls":13},"",{"$nulls":11},""]
[{"$nulls":13},"",{"$nulls":11},""]
[{"$nulls":13},"",{"$nulls":11},""]
[{"$nulls":13},"",{"$nulls":11},""]
[{"$nulls":13},"",{"$nulls":11},""]
[{"$nulls":13},"",{"$nulls":11},""]
[{"$nulls":13},"",{"$nulls":11},""]
[{"$nulls":13},"",{"$nulls":11},""]
[{"$nulls":13},"",{"$nulls":11},""]
[{"$nulls":13},"",{"$nulls":11},""]
[{"$nulls":13},"",{"$nulls":11},""]
[{"$nulls":13},"",{"$nulls":11},""]
[{"$nulls":13},"",{"$nulls":11},""]
[{"$nulls":13},"",{"$nulls":11},""]
[{"$nulls":13},"",{"$nulls":11},""]
[{"$nulls":13},"",{"$nulls":11},""]
[{"$nulls":13},"",{"$nulls":11},""]
[{"$nulls":13},"",{"$nulls":11},""]
[{"$nulls":13},"",{"$nulls":11},""]
[{"$nulls":13},"",{"$nulls":11},""]
[{"$nulls":13},"",{"$nulls":11},""]
[{"$nulls":13},"",{"$nulls":11},""]
[{"$nulls":13},"",{"$nulls":11},""]
[{"$nulls":13},"",{"$nulls":11},""]
[{"$nulls":13},"",{"$nulls":11},""]
[{"$nulls":13},"",{"$nulls":11},""]
[{"$nulls":13},"",{"$nulls":11},""]
[{"$nulls":13},"",{"$nulls":11},""]
[{"$nulls":13},"",{"$nulls":11},""]
[{"$nulls":13},"",{"$nulls":11},""]
[{"$nulls":13},"",{"$nulls":11},""]
[{"$nulls":13},"",{"$nulls":11},""]
[{"$nulls":13},"",{"$nulls":11},""]
[{"$nulls":13},"",{"$nulls":11},""]
[{"$nulls":13},"",{"$nulls":11},""]
[{"$nulls":13},"",{"$nulls":11},""]
[{"$nulls":13},"",{"$nulls":11},""]
[{"$nulls":13},"",{"$nulls":11},""]
[{"$nulls":13},"",{"$nulls":11},""]
[{"$nulls":13},"",{"$nulls":11},""]
[{"$nulls":13},"",{"$nulls":11},""]
[{"$nulls":13},"",{"$nulls":11},""]
[{"$nulls":13},"",{"$nulls":11},""]
[{"$nulls":13},"",{"$nulls":11},""]
[{"$nulls":13},"",{"$nulls":11},""]
[{"$nulls":13},"",{"$nulls":11},""]
[{"$nulls":13},"",{"$nulls":11},{"$f":"IF(AA771=\"\",\"\",IF(ISERROR(MID(AA771,FIND(\" \",AA771,1)+1,FIND(\"(\",AA771,1)-FIND(\" \",AA771,1)-2)),\"\",MID(AA771,FIND(\" \",AA771,1)+1,FIND(\"(\",AA771,1)-FIND(\" \",AA771,1)-2)))","v":""}]
[{"$nulls":13},{"$f":"IF(M772=\"\",\"\",IF(ISERROR(LEFT(M772,FIND(\"-\",M772)-1)),IF(ISERROR(LEFT(M772,FIND(\" \",M772)-1)),M772,LEFT(M772,FIND(\" \",M772)-1)),LEFT(M772,FIND(\"-\",M772)-1)))","v":""},{"$nulls":11},""]
[{"$nulls":13},"",{"$nulls":11},""]
[{"$nulls":13},"",{"$nulls":11},""]
[{"$nulls":13},"",{"$nulls":11},""]
[{"$nulls":13},"",{"$nulls":11},""]
[{"$nulls":13},"",{"$nulls":11},""]
[{"$nulls":13},"",{"$nulls":11},""]
[{"$nulls":13},"",{"$nulls":11},""]
[{"$nulls":13},"",{"$nulls":11},""]
[{"$nulls":13},"",{"$nulls":11},""]
[{"$nulls":13},"",{"$nulls":11},""]
[{"$nulls":13},"",{"$nulls":11},""]
[{"$nulls":13},"",{"$nulls":11},""]
[{"$nulls":13},"",{"$nulls":11},""]
[{"$nulls":13},"",{"$nulls":11},""]
[{"$nulls":13},"",{"$nulls":11},""]
[{"$nulls":13},"",{"$nulls":11},""]
[{"$nulls":13},"",{"$nulls":11},""]
[{"$nulls":13},"",{"$nulls":11},""]
[{"$nulls":13},"",{"$nulls":11},""]
[{"$nulls":13},"",{"$nulls":11},""]
[{"$nulls":13},"",{"$nulls":11},""]
[{"$nulls":13},"",{"$nulls":11},""]
[{"$nulls":13},"",{"$nulls":11},""]
[{"$nulls":13},"",{"$nulls":11},""]
[{"$nulls":13},"",{"$nulls":11},""]
[{"$nulls":13},"",{"$nulls":11},""]
[{"$nulls":13},"",{"$nulls":11},""]
[{"$nulls":13},"",{"$nulls":11},""]
[{"$nulls":13},"",{"$nulls":11},""]
[{"$nulls":13},"",{"$nulls":11},""]
[{"$nulls":13},"",{"$nulls":11},""]
[{"$nulls":13},"",{"$nulls":11},""]
[{"$nulls":13},"",{"$nulls":11},""]
[{"$nulls":13},"",{"$nulls":11},""]
[{"$nulls":13},"",{"$nulls":11},""]
[{"$nulls":13},"",{"$nulls":11},""]
[{"$nulls":13},"",{"$nulls":11},""]
[{"$nulls":13},"",{"$nulls":11},""]
[{"$nulls":13},"",{"$nulls":11},""]
[{"$nulls":13},"",{"$nulls":11},""]
[{"$nulls":13},"",{"$nulls":11},""]
[{"$nulls":13},"",{"$nulls":11},""]
[{"$nulls":13},"",{"$nulls":11},""]
[{"$nulls":13},"",{"$nulls":11},""]
[{"$nulls":13},"",{"$nulls":11},""]
[{"$nulls":13},"",{"$nulls":11},""]
[{"$nulls":13},"",{"$nulls":11},""]
[{"$nulls":13},"",{"$nulls":11},""]
[{"$nulls":13},"",{"$nulls":11},""]
[{"$nulls":13},"",{"$nulls":11},""]
[{"$nulls":13},"",{"$nulls":11},""]
[{"$nulls":13},"",{"$nulls":11},""]
[{"$nulls":13},"",{"$nulls":11},""]
[{"$nulls":13},"",{"$nulls":11},""]
[{"$nulls":13},"",{"$nulls":11},""]
[{"$nulls":13},"",{"$nulls":11},""]
[{"$nulls":13},"",{"$nulls":11},""]
[{"$nulls":13},"",{"$nulls":11},""]
[{"$nulls":13},"",{"$nulls":11},""]
[{"$nulls":13},"",{"$nulls":11},""]
[{"$nulls":13},"",{"$nulls":11},""]
[{"$nulls":13},"",{"$nulls":11},""]
[{"$nulls":13},"",{"$nulls":11},{"$f":"IF(AA835=\"\",\"\",IF(ISERROR(MID(AA835,FIND(\" \",AA835,1)+1,FIND(\"(\",AA835,1)-FIND(\" \",AA835,1)-2)),\"\",MID(AA835,FIND(\" \",AA835,1)+1,FIND(\"(\",AA835,1)-FIND(\" \",AA835,1)-2)))","v":""}]
[{"$nulls":13},{"$f":"IF(M836=\"\",\"\",IF(ISERROR(LEFT(M836,FIND(\"-\",M836)-1)),IF(ISERROR(LEFT(M836,FIND(\" \",M836)-1)),M836,LEFT(M836,FIND(\" \",M836)-1)),LEFT(M836,FIND(\"-\",M836)-1)))","v":""},{"$nulls":11},""]
[{"$nulls":13},"",{"$nulls":11},""]
[{"$nulls":13},"",{"$nulls":11},""]
[{"$nulls":13},"",{"$nulls":11},""]
[{"$nulls":13},"",{"$nulls":11},""]
[{"$nulls":13},"",{"$nulls":11},""]
[{"$nulls":13},"",{"$nulls":11},""]
[{"$nulls":13},"",{"$nulls":11},""]
[{"$nulls":13},"",{"$nulls":11},""]
[{"$nulls":13},"",{"$nulls":11},""]
[{"$nulls":13},"",{"$nulls":11},""]
[{"$nulls":13},"",{"$nulls":11},""]
[{"$nulls":13},"",{"$nulls":11},""]
[{"$nulls":13},"",{"$nulls":11},""]
[{"$nulls":13},"",{"$nulls":11},""]
[{"$nulls":13},"",{"$nulls":11},""]
[{"$nulls":13},"",{"$nulls":11},""]
[{"$nulls":13},"",{"$nulls":11},""]
[{"$nulls":13},"",{"$nulls":11},""]
[{"$nulls":13},"",{"$nulls":11},""]
[{"$nulls":13},"",{"$nulls":11},""]
[{"$nulls":13},"",{"$nulls":11},""]
[{"$nulls":13},"",{"$nulls":11},""]
[{"$nulls":13},"",{"$nulls":11},""]
[{"$nulls":13},"",{"$nulls":11},""]
[{"$nulls":13},"",{"$nulls":11},""]
[{"$nulls":13},"",{"$nulls":11},""]
[{"$nulls":13},"",{"$nulls":11},""]
[{"$nulls":13},"",{"$nulls":11},""]
[{"$nulls":13},"",{"$nulls":11},""]
[{"$nulls":13},"",{"$nulls":11},""]
[{"$nulls":13},"",{"$nulls":11},""]
[{"$nulls":13},"",{"$nulls":11},""]
[{"$nulls":13},"",{"$nulls":11},""]
[{"$nulls":13},"",{"$nulls":11},""]
[{"$nulls":13},"",{"$nulls":11},""]
[{"$nulls":13},"",{"$nulls":11},""]
[{"$nulls":13},"",{"$nulls":11},""]
[{"$nulls":13},"",{"$nulls":11},""]
[{"$nulls":13},"",{"$nulls":11},""]
[{"$nulls":13},"",{"$nulls":11},""]
[{"$nulls":13},"",{"$nulls":11},""]
[{"$nulls":13},"",{"$nulls":11},""]
[{"$nulls":13},"",{"$nulls":11},""]
[{"$nulls":13},"",{"$nulls":11},""]
[{"$nulls":13},"",{"$nulls":11},""]
[{"$nulls":13},"",{"$nulls":11},""]
[{"$nulls":13},"",{"$nulls":11},""]
[{"$nulls":13},"",{"$nulls":11},""]
[{"$nulls":13},"",{"$nulls":11},""]
[{"$nulls":13},"",{"$nulls":11},""]
[{"$nulls":13},"",{"$nulls":11},""]
[{"$nulls":13},"",{"$nulls":11},""]
[{"$nulls":13},"",{"$nulls":11},""]
[{"$nulls":13},"",{"$nulls":11},""]
[{"$nulls":13},"",{"$nulls":11},""]
[{"$nulls":13},"",{"$nulls":11},""]
[{"$nulls":13},"",{"$nulls":11},""]
[{"$nulls":13},"",{"$nulls":11},""]
[{"$nulls":13},"",{"$nulls":11},""]
[{"$nulls":13},"",{"$nulls":11},""]
[{"$nulls":13},"",{"$nulls":11},""]
[{"$nulls":13},"",{"$nulls":11},""]
[{"$nulls":13},"",{"$nulls":11},{"$f":"IF(AA899=\"\",\"\",IF(ISERROR(MID(AA899,FIND(\" \",AA899,1)+1,FIND(\"(\",AA899,1)-FIND(\" \",AA899,1)-2)),\"\",MID(AA899,FIND(\" \",AA899,1)+1,FIND(\"(\",AA899,1)-FIND(\" \",AA899,1)-2)))","v":""}]
[{"$nulls":13},{"$f":"IF(M900=\"\",\"\",IF(ISERROR(LEFT(M900,FIND(\"-\",M900)-1)),IF(ISERROR(LEFT(M900,FIND(\" \",M900)-1)),M900,LEFT(M900,FIND(\" \",M900)-1)),LEFT(M900,FIND(\"-\",M900)-1)))","v":""},{"$nulls":11},""]
[{"$nulls":13},"",{"$nulls":11},""]
[{"$nulls":13},"",{"$nulls":11},""]
[{"$nulls":13},"",{"$nulls":11},""]
[{"$nulls":13},"",{"$nulls":11},""]
[{"$nulls":13},"",{"$nulls":11},""]
[{"$nulls":13},"",{"$nulls":11},""]
[{"$nulls":13},"",{"$nulls":11},""]
[{"$nulls":13},"",{"$nulls":11},""]
[{"$nulls":13},"",{"$nulls":11},""]
[{"$nulls":13},"",{"$nulls":11},""]
[{"$nulls":13},"",{"$nulls":11},""]
[{"$nulls":13},"",{"$nulls":11},""]
[{"$nulls":13},"",{"$nulls":11},""]
[{"$nulls":13},"",{"$nulls":11},""]
[{"$nulls":13},"",{"$nulls":11},""]
[{"$nulls":13},"",{"$nulls":11},""]
[{"$nulls":13},"",{"$nulls":11},""]
[{"$nulls":13},"",{"$nulls":11},""]
[{"$nulls":13},"",{"$nulls":11},""]
[{"$nulls":13},"",{"$nulls":11},""]
[{"$nulls":13},"",{"$nulls":11},""]
[{"$nulls":13},"",{"$nulls":11},""]
[{"$nulls":13},"",{"$nulls":11},""]
[{"$nulls":13},"",{"$nulls":11},""]
[{"$nulls":13},"",{"$nulls":11},""]
[{"$nulls":13},"",{"$nulls":11},""]
[{"$nulls":13},"",{"$nulls":11},""]
[{"$nulls":13},"",{"$nulls":11},""]
[{"$nulls":13},"",{"$nulls":11},""]
[{"$nulls":13},"",{"$nulls":11},""]
[{"$nulls":13},"",{"$nulls":11},""]
[{"$nulls":13},"",{"$nulls":11},""]
[{"$nulls":13},"",{"$nulls":11},""]
[{"$nulls":13},"",{"$nulls":11},""]
[{"$nulls":13},"",{"$nulls":11},""]
[{"$nulls":13},"",{"$nulls":11},""]
[{"$nulls":13},"",{"$nulls":11},""]
[{"$nulls":13},"",{"$nulls":11},""]
[{"$nulls":13},"",{"$nulls":11},""]
[{"$nulls":13},"",{"$nulls":11},""]
[{"$nulls":13},"",{"$nulls":11},""]
[{"$nulls":13},"",{"$nulls":11},""]
[{"$nulls":13},"",{"$nulls":11},""]
[{"$nulls":13},"",{"$nulls":11},""]
[{"$nulls":13},"",{"$nulls":11},""]
[{"$nulls":13},"",{"$nulls":11},""]
[{"$nulls":13},"",{"$nulls":11},""]
[{"$nulls":13},"",{"$nulls":11},""]
[{"$nulls":13},"",{"$nulls":11},""]
[{"$nulls":13},"",{"$nulls":11},""]
[{"$nulls":13},"",{"$nulls":11},""]
[{"$nulls":13},"",{"$nulls":11},""]
[{"$nulls":13},"",{"$nulls":11},""]
[{"$nulls":13},"",{"$nulls":11},""]
[{"$nulls":13},"",{"$nulls":11},""]
[{"$nulls":13},"",{"$nulls":11},""]
[{"$nulls":13},"",{"$nulls":11},""]
[{"$nulls":13},"",{"$nulls":11},""]
[{"$nulls":13},"",{"$nulls":11},""]
[{"$nulls":13},"",{"$nulls":11},""]
[{"$nulls":13},"",{"$nulls":11},""]
[{"$nulls":13},"",{"$nulls":11},""]
[{"$nulls":13},"",{"$nulls":11},{"$f":"IF(AA963=\"\",\"\",IF(ISERROR(MID(AA963,FIND(\" \",AA963,1)+1,FIND(\"(\",AA963,1)-FIND(\" \",AA963,1)-2)),\"\",MID(AA963,FIND(\" \",AA963,1)+1,FIND(\"(\",AA963,1)-FIND(\" \",AA963,1)-2)))","v":""}]
[{"$nulls":13},{"$f":"IF(M964=\"\",\"\",IF(ISERROR(LEFT(M964,FIND(\"-\",M964)-1)),IF(ISERROR(LEFT(M964,FIND(\" \",M964)-1)),M964,LEFT(M964,FIND(\" \",M964)-1)),LEFT(M964,FIND(\"-\",M964)-1)))","v":""},{"$nulls":11},""]
[{"$nulls":13},"",{"$nulls":11},""]
[{"$nulls":13},"",{"$nulls":11},""]
[{"$nulls":13},"",{"$nulls":11},""]
[{"$nulls":13},"",{"$nulls":11},""]
[{"$nulls":13},"",{"$nulls":11},""]
[{"$nulls":13},"",{"$nulls":11},""]
[{"$nulls":13},"",{"$nulls":11},""]
[{"$nulls":13},"",{"$nulls":11},""]
[{"$nulls":13},"",{"$nulls":11},""]
[{"$nulls":13},"",{"$nulls":11},""]
[{"$nulls":13},"",{"$nulls":11},""]
[{"$nulls":13},"",{"$nulls":11},""]
[{"$nulls":13},"",{"$nulls":11},""]
[{"$nulls":13},"",{"$nulls":11},""]
[{"$nulls":13},"",{"$nulls":11},""]
[{"$nulls":13},"",{"$nulls":11},""]
[{"$nulls":13},"",{"$nulls":11},""]
[{"$nulls":13},"",{"$nulls":11},""]
[{"$nulls":13},"",{"$nulls":11},""]
[{"$nulls":13},"",{"$nulls":11},""]
[{"$nulls":13},"",{"$nulls":11},""]
[{"$nulls":13},"",{"$nulls":11},""]
[{"$nulls":13},"",{"$nulls":11},""]
[{"$nulls":13},"",{"$nulls":11},""]
[{"$nulls":13},"",{"$nulls":11},""]
[{"$nulls":13},"",{"$nulls":11},""]
[{"$nulls":13},"",{"$nulls":11},""]
[{"$nulls":13},"",{"$nulls":11},""]
[{"$nulls":13},"",{"$nulls":11},""]
[{"$nulls":13},"",{"$nulls":11},""]
[{"$nulls":13},"",{"$nulls":11},""]
[{"$nulls":13},"",{"$nulls":11},""]
[{"$nulls":13},"",{"$nulls":11},""]
[{"$nulls":13},"",{"$nulls":11},""]
[{"$nulls":13},"",{"$nulls":11},""]
[{"$nulls":13},"",{"$nulls":11},""]
[{"$nulls":13},"",{"$nulls":11},""]
[{"$nulls":13},"",{"$nulls":11},""]
[{"$nulls":13},"",{"$nulls":11},""]
[{"$nulls":13},"",{"$nulls":11},""]
[{"$nulls":13},"",{"$nulls":11},""]
[{"$nulls":13},"",{"$nulls":11},""]
[{"$nulls":13},"",{"$nulls":11},""]
[{"$nulls":13},"",{"$nulls":11},""]
[{"$nulls":13},"",{"$nulls":11},""]
[{"$nulls":13},"",{"$nulls":11},""]
[{"$nulls":13},"",{"$nulls":11},""]
[{"$nulls":13},"",{"$nulls":11},""]
[{"$nulls":13},"",{"$nulls":11},""]
[{"$nulls":13},"",{"$nulls":11},""]
[{"$nulls":13},"",{"$nulls":11},""]
[{"$nulls":13},"",{"$nulls":11},""]
[{"$nulls":13},"",{"$nulls":11},""]
[{"$nulls":13},"",{"$nulls":11},""]
[{"$nulls":13},"",{"$nulls":11},""]
[{"$nulls":13},"",{"$nulls":11},""]
[{"$nulls":13},"",{"$nulls":11},""]
[{"$nulls":13},"",{"$nulls":11},""]
[{"$nulls":13},"",{"$nulls":11},""]
[{"$nulls":13},"",{"$nulls":11},""]
[{"$nulls":13},"",{"$nulls":11},""]
[{"$nulls":13},"",{"$nulls":11},""]
[{"$nulls":13},"",{"$nulls":11},{"$f":"IF(AA1027=\"\",\"\",IF(ISERROR(MID(AA1027,FIND(\" \",AA1027,1)+1,FIND(\"(\",AA1027,1)-FIND(\" \",AA1027,1)-2)),\"\",MID(AA1027,FIND(\" \",AA1027,1)+1,FIND(\"(\",AA1027,1)-FIND(\" \",AA1027,1)-2)))","v":""}]
[{"$nulls":13},{"$f":"IF(M1028=\"\",\"\",IF(ISERROR(LEFT(M1028,FIND(\"-\",M1028)-1)),IF(ISERROR(LEFT(M1028,FIND(\" \",M1028)-1)),M1028,LEFT(M1028,FIND(\" \",M1028)-1)),LEFT(M1028,FIND(\"-\",M1028)-1)))","v":""},{"$nulls":11},""]
[{"$nulls":13},"",{"$nulls":11},""]
[{"$nulls":13},"",{"$nulls":11},""]
[{"$nulls":13},"",{"$nulls":11},""]
[{"$nulls":13},"",{"$nulls":11},""]
[{"$nulls":13},"",{"$nulls":11},""]
[{"$nulls":13},"",{"$nulls":11},""]
[{"$nulls":13},"",{"$nulls":11},""]
[{"$nulls":13},"",{"$nulls":11},""]
[{"$nulls":13},"",{"$nulls":11},""]
[{"$nulls":13},"",{"$nulls":11},""]
[{"$nulls":13},"",{"$nulls":11},""]
[{"$nulls":13},"",{"$nulls":11},""]
[{"$nulls":13},"",{"$nulls":11},""]
[{"$nulls":13},"",{"$nulls":11},""]
[{"$nulls":13},"",{"$nulls":11},""]
[{"$nulls":13},"",{"$nulls":11},""]
[{"$nulls":13},"",{"$nulls":11},""]
[{"$nulls":13},"",{"$nulls":11},""]
[{"$nulls":13},"",{"$nulls":11},""]
[{"$nulls":13},"",{"$nulls":11},""]
[{"$nulls":13},"",{"$nulls":11},""]
[{"$nulls":13},"",{"$nulls":11},""]
[{"$nulls":13},"",{"$nulls":11},""]
[{"$nulls":13},"",{"$nulls":11},""]
[{"$nulls":13},"",{"$nulls":11},""]
[{"$nulls":13},"",{"$nulls":11},""]
[{"$nulls":13},"",{"$nulls":11},""]
[{"$nulls":13},"",{"$nulls":11},""]
[{"$nulls":13},"",{"$nulls":11},""]
[{"$nulls":13},"",{"$nulls":11},""]
[{"$nulls":13},"",{"$nulls":11},""]
[{"$nulls":13},"",{"$nulls":11},""]
[{"$nulls":13},"",{"$nulls":11},""]
[{"$nulls":13},"",{"$nulls":11},""]
[{"$nulls":13},"",{"$nulls":11},""]
[{"$nulls":13},"",{"$nulls":11},""]
[{"$nulls":13},"",{"$nulls":11},""]
[{"$nulls":13},"",{"$nulls":11},""]
[{"$nulls":13},"",{"$nulls":11},""]
[{"$nulls":13},"",{"$nulls":11},""]
[{"$nulls":13},"",{"$nulls":11},""]
[{"$nulls":13},"",{"$nulls":11},""]
[{"$nulls":13},"",{"$nulls":11},""]
[{"$nulls":13},"",{"$nulls":11},""]
[{"$nulls":13},"",{"$nulls":11},""]
[{"$nulls":13},"",{"$nulls":11},""]
[{"$nulls":13},"",{"$nulls":11},""]
[{"$nulls":13},"",{"$nulls":11},""]
[{"$nulls":13},"",{"$nulls":11},""]
[{"$nulls":13},"",{"$nulls":11},""]
[{"$nulls":13},"",{"$nulls":11},""]
[{"$nulls":13},"",{"$nulls":11},""]
[{"$nulls":13},"",{"$nulls":11},""]
[{"$nulls":13},"",{"$nulls":11},""]
[{"$nulls":13},"",{"$nulls":11},""]
[{"$nulls":13},"",{"$nulls":11},""]
[{"$nulls":13},"",{"$nulls":11},""]
[{"$nulls":13},"",{"$nulls":11},""]
[{"$nulls":13},"",{"$nulls":11},""]
[{"$nulls":13},"",{"$nulls":11},""]
[{"$nulls":13},"",{"$nulls":11},""]
[{"$nulls":13},"",{"$nulls":11},""]
[{"$nulls":13},"",{"$nulls":11},{"$f":"IF(AA1091=\"\",\"\",IF(ISERROR(MID(AA1091,FIND(\" \",AA1091,1)+1,FIND(\"(\",AA1091,1)-FIND(\" \",AA1091,1)-2)),\"\",MID(AA1091,FIND(\" \",AA1091,1)+1,FIND(\"(\",AA1091,1)-FIND(\" \",AA1091,1)-2)))","v":""}]
[{"$nulls":13},{"$f":"IF(M1092=\"\",\"\",IF(ISERROR(LEFT(M1092,FIND(\"-\",M1092)-1)),IF(ISERROR(LEFT(M1092,FIND(\" \",M1092)-1)),M1092,LEFT(M1092,FIND(\" \",M1092)-1)),LEFT(M1092,FIND(\"-\",M1092)-1)))","v":""},{"$nulls":11},""]
[{"$nulls":13},"",{"$nulls":11},""]
[{"$nulls":13},"",{"$nulls":11},""]
[{"$nulls":13},"",{"$nulls":11},""]
[{"$nulls":13},"",{"$nulls":11},""]
[{"$nulls":13},"",{"$nulls":11},""]
[{"$nulls":13},"",{"$nulls":11},""]
[{"$nulls":13},"",{"$nulls":11},""]
[{"$nulls":13},"",{"$nulls":11},""]
[{"$nulls":13},"",{"$nulls":11},""]
[{"$nulls":13},"",{"$nulls":11},""]
[{"$nulls":13},"",{"$nulls":11},""]
[{"$nulls":13},"",{"$nulls":11},""]
[{"$nulls":13},"",{"$nulls":11},""]
[{"$nulls":13},"",{"$nulls":11},""]
[{"$nulls":13},"",{"$nulls":11},""]
[{"$nulls":13},"",{"$nulls":11},""]
[{"$nulls":13},"",{"$nulls":11},""]
[{"$nulls":13},"",{"$nulls":11},""]
[{"$nulls":13},"",{"$nulls":11},""]
[{"$nulls":13},"",{"$nulls":11},""]
[{"$nulls":13},"",{"$nulls":11},""]
[{"$nulls":13},"",{"$nulls":11},""]
[{"$nulls":13},"",{"$nulls":11},""]
[{"$nulls":13},"",{"$nulls":11},""]
[{"$nulls":13},"",{"$nulls":11},""]
[{"$nulls":13},"",{"$nulls":11},""]
[{"$nulls":13},"",{"$nulls":11},""]
[{"$nulls":13},"",{"$nulls":11},""]
[{"$nulls":13},"",{"$nulls":11},""]
[{"$nulls":13},"",{"$nulls":11},""]
[{"$nulls":13},"",{"$nulls":11},""]
[{"$nulls":13},"",{"$nulls":11},""]
[{"$nulls":13},"",{"$nulls":11},""]
[{"$nulls":13},"",{"$nulls":11},""]
[{"$nulls":13},"",{"$nulls":11},""]
[{"$nulls":13},"",{"$nulls":11},""]
[{"$nulls":13},"",{"$nulls":11},""]
[{"$nulls":13},"",{"$nulls":11},""]
[{"$nulls":13},"",{"$nulls":11},""]
[{"$nulls":13},"",{"$nulls":11},""]
[{"$nulls":13},"",{"$nulls":11},""]
[{"$nulls":13},"",{"$nulls":11},""]
[{"$nulls":13},"",{"$nulls":11},""]
[{"$nulls":13},"",{"$nulls":11},""]
[{"$nulls":13},"",{"$nulls":11},""]
[{"$nulls":13},"",{"$nulls":11},""]
[{"$nulls":13},"",{"$nulls":11},""]
[{"$nulls":13},"",{"$nulls":11},""]
[{"$nulls":13},"",{"$nulls":11},""]
[{"$nulls":13},"",{"$nulls":11},""]
[{"$nulls":13},"",{"$nulls":11},""]
[{"$nulls":13},"",{"$nulls":11},""]
[{"$nulls":13},"",{"$nulls":11},""]
[{"$nulls":13},"",{"$nulls":11},""]
[{"$nulls":13},"",{"$nulls":11},""]
[{"$nulls":13},"",{"$nulls":11},""]
[{"$nulls":13},"",{"$nulls":11},""]
[{"$nulls":13},"",{"$nulls":11},""]
[{"$nulls":13},"",{"$nulls":11},""]
[{"$nulls":13},"",{"$nulls":11},""]
[{"$nulls":13},"",{"$nulls":11},""]
[{"$nulls":13},"",{"$nulls":11},""]
[{"$nulls":13},"",{"$nulls":11},{"$f":"IF(AA1155=\"\",\"\",IF(ISERROR(MID(AA1155,FIND(\" \",AA1155,1)+1,FIND(\"(\",AA1155,1)-FIND(\" \",AA1155,1)-2)),\"\",MID(AA1155,FIND(\" \",AA1155,1)+1,FIND(\"(\",AA1155,1)-FIND(\" \",AA1155,1)-2)))","v":""}]
[{"$nulls":13},{"$f":"IF(M1156=\"\",\"\",IF(ISERROR(LEFT(M1156,FIND(\"-\",M1156)-1)),IF(ISERROR(LEFT(M1156,FIND(\" \",M1156)-1)),M1156,LEFT(M1156,FIND(\" \",M1156)-1)),LEFT(M1156,FIND(\"-\",M1156)-1)))","v":""},{"$nulls":11},""]
[{"$nulls":13},"",{"$nulls":11},""]
[{"$nulls":13},"",{"$nulls":11},""]
[{"$nulls":13},"",{"$nulls":11},""]
[{"$nulls":13},"",{"$nulls":11},""]
[{"$nulls":13},"",{"$nulls":11},""]
[{"$nulls":13},"",{"$nulls":11},""]

{"sheet":"Results","index":9,"n_rows":1002,"n_cols":16,"rows_kept":1002,"cut":false,"hidden":false,"merged":[]}
[{"$nulls":7},{"$f":"SUM(H3:H1000)","v":0},{"$f":"SUM(I2:I1000)","v":0},{"$f":"SUM(J2:J1000)","v":0},{"$f":"SUM(K2:K1000)","v":0}]
[{"$nulls":4},"",null,null,{"$f":"IF(AND($A2=\"1st\",$D2>0),$D2,\"\")","v":""},{"$f":"IF(AND($A2=\"2nd\",$D2>0),$D2,\"\")","v":""},{"$f":"IF(AND($A2=\"3rd\",$D2>0),$D2,\"\")","v":""},{"$f":"IF(AND($A2=\"4th\",$D2>0),$D2,\"\")","v":""},null,null,"Selections",{"$f":"COUNTA(C1:C5000)","v":0},{"$f":"SUM(D1:D5000)","v":0}]
[{"$nulls":5},"7",null,null,{"$f":"IF(AND($A3=\"2nd\",$D3>0),$D3,\"\")","v":""},{"$f":"IF(AND($A3=\"3rd\",$D3>0),$D3,\"\")","v":""},{"$f":"IF(AND($A3=\"4th\",$D3>0),$D3,\"\")","v":""}]
[{"$nulls":8},"","",""]
[{"$nulls":8},"","",""]
[{"$nulls":8},"","",""]
[{"$nulls":8},"","",""]
[{"$nulls":4},"",null,null,null,"","",""]
[{"$nulls":8},"","",""]
[{"$nulls":8},"","",""]
[{"$nulls":8},"","",""]
[{"$nulls":8},"","",""]
[{"$nulls":8},"","",""]
[{"$nulls":4},"",null,null,null,"","",""]
[{"$nulls":8},"","",""]
[{"$nulls":8},"","",""]
[{"$nulls":8},"","",""]
[{"$nulls":8},"","",""]
[{"$nulls":8},"","",""]
[{"$nulls":4},"",null,null,null,"","",""]
[{"$nulls":8},"","",""]
[{"$nulls":8},"","",""]
[{"$nulls":8},"","",""]
[{"$nulls":8},"","",""]
[{"$nulls":8},"","",""]
[{"$nulls":4},"",null,null,null,"","",""]
[{"$nulls":8},"","",""]
[{"$nulls":8},"","",""]
[{"$nulls":8},"","",""]
[{"$nulls":8},"","",""]
[{"$nulls":8},"","",""]
[{"$nulls":4},"",null,null,null,"","",""]
[{"$nulls":8},"","",""]
[{"$nulls":8},"","",""]
[{"$nulls":8},"","",""]
[{"$nulls":8},"","",""]
[{"$nulls":8},"","",""]
[{"$nulls":4},"",null,null,null,"","",""]
[{"$nulls":8},"","",""]
[{"$nulls":8},"","",""]
[{"$nulls":8},"","",""]
[{"$nulls":8},"","",""]
[{"$nulls":8},"","",""]
[{"$nulls":4},"",null,null,null,"","",""]
[{"$nulls":8},"","",""]
[{"$nulls":8},"","",""]
[{"$nulls":8},"","",""]
[{"$nulls":8},"","",""]
[{"$nulls":8},"","",""]
[{"$nulls":4},"",null,null,null,"","",""]
[{"$nulls":8},"","",""]
[{"$nulls":8},"","",""]
[{"$nulls":8},"","",""]
[{"$nulls":8},"","",""]
[{"$nulls":8},"","",""]
[{"$nulls":4},"",null,null,null,"","",""]
[{"$nulls":8},"","",""]
[{"$nulls":8},"","",""]
[{"$nulls":8},"","",""]
[{"$nulls":8},"","",""]
[{"$nulls":8},"","",""]
[{"$nulls":4},"",null,null,null,"","",""]
[{"$nulls":8},"","",""]
[{"$nulls":8},"","",""]
[{"$nulls":8},"","",""]
[{"$nulls":8},"","",""]
[{"$nulls":8},{"$f":"IF(AND($A67=\"2nd\",$D67>0),$D67,\"\")","v":""},{"$f":"IF(AND($A67=\"3rd\",$D67>0),$D67,\"\")","v":""},{"$f":"IF(AND($A67=\"4th\",$D67>0),$D67,\"\")","v":""}]
[{"$nulls":4},"",null,null,null,"","",""]
[{"$nulls":8},"","",""]
[{"$nulls":8},"","",""]
[{"$nulls":8},"","",""]
[{"$nulls":8},"","",""]
[{"$nulls":8},"","",""]
[{"$nulls":4},"",null,null,null,"","",""]
[{"$nulls":8},"","",""]
[{"$nulls":8},"","",""]
[{"$nulls":8},"","",""]
[{"$nulls":8},"","",""]
[{"$nulls":8},"","",""]
[{"$nulls":4},"",null,null,null,"","",""]
[{"$nulls":8},"","",""]
[{"$nulls":8},"","",""]
[{"$nulls":8},"","",""]
[{"$nulls":8},"","",""]
[{"$nulls":8},"","",""]
[{"$nulls":8},"","",""]
[{"$nulls":4},"",null,null,null,"","",""]
[{"$nulls":8},"","",""]
[{"$nulls":8},"","",""]
[{"$nulls":8},"","",""]
[{"$nulls":8},"","",""]
[{"$nulls":8},"","",""]
[{"$nulls":4},"1",null,null,null,"","",""]
[{"$nulls":8},"","",""]
[{"$nulls":8},"","",""]
[{"$nulls":8},"","",""]
[{"$nulls":8},"","",""]
[{"$nulls":8},"","",""]
[{"$nulls":4},"2",null,null,null,"","",""]
[{"$nulls":8},"","",""]
[{"$nulls":8},"","",""]
[{"$nulls":8},"","",""]
[{"$nulls":8},"","",""]
[{"$nulls":8},"","",""]
[{"$nulls":4},"3",null,null,null,"","",""]
[{"$nulls":8},"","",""]
[{"$nulls":8},"","",""]
[{"$nulls":8},"","",""]
[{"$nulls":8},"","",""]
[{"$nulls":8},"","",""]
[{"$nulls":4},"4",null,null,null,"","",""]
[{"$nulls":8},"","",""]
[{"$nulls":8},"","",""]
[{"$nulls":8},"","",""]
[{"$nulls":8},"","",""]
[{"$nulls":8},"","",""]
[{"$nulls":4},"5",null,null,null,"","",""]
[{"$nulls":8},"","",""]
[{"$nulls":8},"","",""]
[{"$nulls":8},"","",""]
[{"$nulls":8},"","",""]
[{"$nulls":8},"","",""]
[{"$nulls":4},"6",null,null,null,"","",""]
[{"$nulls":8},"","",""]
[{"$nulls":8},"","",""]
[{"$nulls":8},"","",""]
[{"$nulls":8},"","",""]
[{"$nulls":8},"","",""]
[{"$nulls":4},"",null,null,null,"","",""]
[{"$nulls":8},"","",""]
[{"$nulls":8},{"$f":"IF(AND($A131=\"2nd\",$D131>0),$D131,\"\")","v":""},{"$f":"IF(AND($A131=\"3rd\",$D131>0),$D131,\"\")","v":""},{"$f":"IF(AND($A131=\"4th\",$D131>0),$D131,\"\")","v":""}]
[{"$nulls":8},"","",""]
[{"$nulls":8},"","",""]
[{"$nulls":8},"","",""]
[{"$nulls":8},"","",""]
[{"$nulls":8},"","",""]
[{"$nulls":8},"","",""]
[{"$nulls":8},"","",""]
[{"$nulls":8},"","",""]
[{"$nulls":8},"","",""]
[{"$nulls":8},"","",""]
[{"$nulls":8},"","",""]
[{"$nulls":8},"","",""]
[{"$nulls":8},"","",""]
[{"$nulls":8},"","",""]
[{"$nulls":8},"","",""]
[{"$nulls":8},"","",""]
[{"$nulls":8},"","",""]
[{"$nulls":8},"","",""]
[{"$nulls":8},"","",""]
[{"$nulls":8},"","",""]
[{"$nulls":8},"","",""]
[{"$nulls":8},"","",""]
[{"$nulls":8},"","",""]
[{"$nulls":8},"","",""]
[{"$nulls":8},"","",""]
[{"$nulls":8},"","",""]
[{"$nulls":8},"","",""]
[{"$nulls":8},"","",""]
[{"$nulls":8},"","",""]
[{"$nulls":8},"","",""]
[{"$nulls":8},"","",""]
[{"$nulls":8},"","",""]
[{"$nulls":8},"","",""]
[{"$nulls":8},"","",""]
[{"$nulls":8},"","",""]
[{"$nulls":8},"","",""]
[{"$nulls":8},"","",""]
[{"$nulls":8},"","",""]
[{"$nulls":8},"","",""]
[{"$nulls":8},"","",""]
[{"$nulls":8},"","",""]
[{"$nulls":8},"","",""]
[{"$nulls":8},"","",""]
[{"$nulls":8},"","",""]
[{"$nulls":8},"","",""]
[{"$nulls":8},"","",""]
[{"$nulls":8},"","",""]
[{"$nulls":8},"","",""]
[{"$nulls":8},"","",""]
[{"$nulls":8},"","",""]
[{"$nulls":8},"","",""]
[{"$nulls":8},"","",""]
[{"$nulls":8},"","",""]
[{"$nulls":8},"","",""]
[{"$nulls":8},"","",""]
[{"$nulls":8},"","",""]
[{"$nulls":8},"","",""]
[{"$nulls":8},"","",""]
[{"$nulls":8},"","",""]
[{"$nulls":8},"","",""]
[{"$nulls":8},"","",""]
[{"$nulls":8},"","",""]
[{"$nulls":8},"","",""]
[{"$nulls":8},{"$f":"IF(AND($A195=\"2nd\",$D195>0),$D195,\"\")","v":""},{"$f":"IF(AND($A195=\"3rd\",$D195>0),$D195,\"\")","v":""},{"$f":"IF(AND($A195=\"4th\",$D195>0),$D195,\"\")","v":""}]
[{"$nulls":8},"","",""]
[{"$nulls":8},"","",""]
[{"$nulls":8},"","",""]
[{"$nulls":8},"","",""]
[{"$nulls":8},"","",""]
[{"$nulls":8},"","",""]
[{"$nulls":8},"","",""]
[{"$nulls":8},"","",""]
[{"$nulls":8},"","",""]
[{"$nulls":8},"","",""]
[{"$nulls":8},"","",""]
[{"$nulls":8},"","",""]
[{"$nulls":8},"","",""]
[{"$nulls":8},"","",""]
[{"$nulls":8},"","",""]
[{"$nulls":8},"","",""]
[{"$nulls":8},"","",""]
[{"$nulls":8},"","",""]
[{"$nulls":8},"","",""]
[{"$nulls":8},"","",""]
[{"$nulls":8},"","",""]
[{"$nulls":8},"","",""]
[{"$nulls":8},"","",""]
[{"$nulls":8},"","",""]
[{"$nulls":8},"","",""]
[{"$nulls":8},"","",""]
[{"$nulls":8},"","",""]
[{"$nulls":8},"","",""]
[{"$nulls":8},"","",""]
[{"$nulls":8},"","",""]
[{"$nulls":8},"","",""]
[{"$nulls":8},"","",""]
[{"$nulls":8},"","",""]
[{"$nulls":8},"","",""]
[{"$nulls":8},"","",""]
[{"$nulls":8},"","",""]
[{"$nulls":8},"","",""]
[{"$nulls":8},"","",""]
[{"$nulls":8},"","",""]
[{"$nulls":8},"","",""]
[{"$nulls":8},"","",""]
[{"$nulls":8},"","",""]
[{"$nulls":8},"","",""]
[{"$nulls":8},"","",""]
[{"$nulls":8},"","",""]
[{"$nulls":8},"","",""]
[{"$nulls":8},"","",""]
[{"$nulls":8},"","",""]
[{"$nulls":8},"","",""]
[{"$nulls":8},"","",""]
[{"$nulls":8},"","",""]
[{"$nulls":8},"","",""]
[{"$nulls":8},"","",""]
[{"$nulls":8},"","",""]
[{"$nulls":8},"","",""]
[{"$nulls":8},"","",""]
[{"$nulls":8},"","",""]
[{"$nulls":8},"","",""]
[{"$nulls":8},"","",""]
[{"$nulls":8},"","",""]
[{"$nulls":8},"","",""]
[{"$nulls":8},"","",""]
[{"$nulls":8},"","",""]
[{"$nulls":8},{"$f":"IF(AND($A259=\"2nd\",$D259>0),$D259,\"\")","v":""},{"$f":"IF(AND($A259=\"3rd\",$D259>0),$D259,\"\")","v":""},{"$f":"IF(AND($A259=\"4th\",$D259>0),$D259,\"\")","v":""}]
[{"$nulls":8},"","",""]
[{"$nulls":8},"","",""]
[{"$nulls":8},"","",""]
[{"$nulls":8},"","",""]
[{"$nulls":8},"","",""]
[{"$nulls":8},"","",""]
[{"$nulls":8},"","",""]
[{"$nulls":8},"","",""]
[{"$nulls":8},"","",""]
[{"$nulls":8},"","",""]
[{"$nulls":8},"","",""]
[{"$nulls":8},"","",""]
[{"$nulls":8},"","",""]
[{"$nulls":8},"","",""]
[{"$nulls":8},"","",""]
[{"$nulls":8},"","",""]
[{"$nulls":8},"","",""]
[{"$nulls":8},"","",""]
[{"$nulls":8},"","",""]
[{"$nulls":8},"","",""]
[{"$nulls":8},"","",""]
[{"$nulls":8},"","",""]
[{"$nulls":8},"","",""]
[{"$nulls":8},"","",""]
[{"$nulls":8},"","",""]
[{"$nulls":8},"","",""]
[{"$nulls":8},"","",""]
[{"$nulls":8},"","",""]
[{"$nulls":8},"","",""]
[{"$nulls":8},"","",""]
[{"$nulls":8},"","",""]
[{"$nulls":8},"","",""]
[{"$nulls":8},"","",""]
[{"$nulls":8},"","",""]
[{"$nulls":8},"","",""]
[{"$nulls":8},"","",""]
[{"$nulls":8},"","",""]
[{"$nulls":8},"","",""]
[{"$nulls":8},"","",""]
[{"$nulls":8},"","",""]
[{"$nulls":8},"","",""]
[{"$nulls":8},"","",""]
[{"$nulls":8},"","",""]
[{"$nulls":8},"","",""]
[{"$nulls":8},"","",""]
[{"$nulls":8},"","",""]
[{"$nulls":8},"","",""]
[{"$nulls":8},"","",""]
[{"$nulls":8},"","",""]
[{"$nulls":8},"","",""]
[{"$nulls":8},"","",""]
[{"$nulls":8},"","",""]
[{"$nulls":8},"","",""]
[{"$nulls":8},"","",""]
[{"$nulls":8},"","",""]
[{"$nulls":8},"","",""]
[{"$nulls":8},"","",""]
[{"$nulls":8},"","",""]
[{"$nulls":8},"","",""]
[{"$nulls":8},"","",""]
[{"$nulls":8},"","",""]
[{"$nulls":8},"","",""]
[{"$nulls":8},"","",""]
[{"$nulls":8},{"$f":"IF(AND($A323=\"2nd\",$D323>0),$D323,\"\")","v":""},{"$f":"IF(AND($A323=\"3rd\",$D323>0),$D323,\"\")","v":""},{"$f":"IF(AND($A323=\"4th\",$D323>0),$D323,\"\")","v":""}]
[{"$nulls":8},"","",""]
[{"$nulls":8},"","",""]
[{"$nulls":8},"","",""]
[{"$nulls":8},"","",""]
[{"$nulls":8},"","",""]
[{"$nulls":8},"","",""]
[{"$nulls":8},"","",""]
[{"$nulls":8},"","",""]
[{"$nulls":8},"","",""]
[{"$nulls":8},"","",""]
[{"$nulls":8},"","",""]
[{"$nulls":8},"","",""]
[{"$nulls":8},"","",""]
[{"$nulls":8},"","",""]
[{"$nulls":8},"","",""]
[{"$nulls":8},"","",""]
[{"$nulls":8},"","",""]
[{"$nulls":8},"","",""]
[{"$nulls":8},"","",""]
[{"$nulls":8},"","",""]
[{"$nulls":8},"","",""]
[{"$nulls":8},"","",""]
[{"$nulls":8},"","",""]
[{"$nulls":8},"","",""]
[{"$nulls":8},"","",""]
[{"$nulls":8},"","",""]
[{"$nulls":8},"","",""]
[{"$nulls":8},"","",""]
[{"$nulls":8},"","",""]
[{"$nulls":8},"","",""]
[{"$nulls":8},"","",""]
[{"$nulls":8},"","",""]
[{"$nulls":8},"","",""]
[{"$nulls":8},"","",""]
[{"$nulls":8},"","",""]
[{"$nulls":8},"","",""]
[{"$nulls":8},"","",""]
[{"$nulls":8},"","",""]
[{"$nulls":8},"","",""]
[{"$nulls":8},"","",""]
[{"$nulls":8},"","",""]
[{"$nulls":8},"","",""]
[{"$nulls":8},"","",""]
[{"$nulls":8},"","",""]
[{"$nulls":8},"","",""]
[{"$nulls":8},"","",""]
[{"$nulls":8},"","",""]
[{"$nulls":8},"","",""]
[{"$nulls":8},"","",""]
[{"$nulls":8},"","",""]
[{"$nulls":8},"","",""]
[{"$nulls":8},"","",""]
[{"$nulls":8},"","",""]
[{"$nulls":8},"","",""]
[{"$nulls":8},"","",""]
[{"$nulls":8},"","",""]
[{"$nulls":8},"","",""]
[{"$nulls":8},"","",""]
[{"$nulls":8},"","",""]
[{"$nulls":8},"","",""]
[{"$nulls":8},"","",""]
[{"$nulls":8},"","",""]
[{"$nulls":8},"","",""]
[{"$nulls":8},{"$f":"IF(AND($A387=\"2nd\",$D387>0),$D387,\"\")","v":""},{"$f":"IF(AND($A387=\"3rd\",$D387>0),$D387,\"\")","v":""},{"$f":"IF(AND($A387=\"4th\",$D387>0),$D387,\"\")","v":""}]
[{"$nulls":8},"","",""]
[{"$nulls":8},"","",""]
[{"$nulls":8},"","",""]
[{"$nulls":8},"","",""]
[{"$nulls":8},"","",""]
[{"$nulls":8},"","",""]
[{"$nulls":8},"","",""]
[{"$nulls":8},"","",""]
[{"$nulls":8},"","",""]
[{"$nulls":8},"","",""]
[{"$nulls":8},"","",""]
[{"$nulls":8},"","",""]
[{"$nulls":8},"","",""]
[{"$nulls":8},"","",""]
[{"$nulls":8},"","",""]
[{"$nulls":8},"","",""]
[{"$nulls":8},"","",""]
[{"$nulls":8},"","",""]
[{"$nulls":8},"","",""]
[{"$nulls":8},"","",""]
[{"$nulls":8},"","",""]
[{"$nulls":8},"","",""]
[{"$nulls":8},"","",""]
[{"$nulls":8},"","",""]
[{"$nulls":8},"","",""]
[{"$nulls":8},"","",""]
[{"$nulls":8},"","",""]
[{"$nulls":8},"","",""]
[{"$nulls":8},"","",""]
[{"$nulls":8},"","",""]
[{"$nulls":8},"","",""]
[{"$nulls":8},"","",""]
[{"$nulls":8},"","",""]
[{"$nulls":8},"","",""]
[{"$nulls":8},"","",""]
[{"$nulls":8},"","",""]
[{"$nulls":8},"","",""]
[{"$nulls":8},"","",""]
[{"$nulls":8},"","",""]
[{"$nulls":8},"","",""]
[{"$nulls":8},"","",""]
[{"$nulls":8},"","",""]
[{"$nulls":8},"","",""]
[{"$nulls":8},"","",""]
[{"$nulls":8},"","",""]
[{"$nulls":8},"","",""]
[{"$nulls":8},"","",""]
[{"$nulls":8},"","",""]
[{"$nulls":8},"","",""]
[{"$nulls":8},"","",""]
[{"$nulls":8},"","",""]
[{"$nulls":8},"","",""]
[{"$nulls":8},"","",""]
[{"$nulls":8},"","",""]
[{"$nulls":8},"","",""]
[{"$nulls":8},"","",""]
[{"$nulls":8},"","",""]
[{"$nulls":8},"","",""]
[{"$nulls":8},"","",""]
[{"$nulls":8},"","",""]
[{"$nulls":8},"","",""]
[{"$nulls":8},"","",""]
[{"$nulls":8},"","",""]
[{"$nulls":8},{"$f":"IF(AND($A451=\"2nd\",$D451>0),$D451,\"\")","v":""},{"$f":"IF(AND($A451=\"3rd\",$D451>0),$D451,\"\")","v":""},{"$f":"IF(AND($A451=\"4th\",$D451>0),$D451,\"\")","v":""}]
[{"$nulls":8},"","",""]
[{"$nulls":8},"","",""]
[{"$nulls":8},"","",""]
[{"$nulls":8},"","",""]
[{"$nulls":8},"","",""]
[{"$nulls":8},"","",""]
[{"$nulls":8},"","",""]
[{"$nulls":8},"","",""]
[{"$nulls":8},"","",""]
[{"$nulls":8},"","",""]
[{"$nulls":8},"","",""]
[{"$nulls":8},"","",""]
[{"$nulls":8},"","",""]
[{"$nulls":8},"","",""]
[{"$nulls":8},"","",""]
[{"$nulls":8},"","",""]
[{"$nulls":8},"","",""]
[{"$nulls":8},"","",""]
[{"$nulls":8},"","",""]
[{"$nulls":8},"","",""]
[{"$nulls":8},"","",""]
[{"$nulls":8},"","",""]
[{"$nulls":8},"","",""]
[{"$nulls":8},"","",""]
[{"$nulls":8},"","",""]
[{"$nulls":8},"","",""]
[{"$nulls":8},"","",""]
[{"$nulls":8},"","",""]
[{"$nulls":8},"","",""]
[{"$nulls":8},"","",""]
[{"$nulls":8},"","",""]
[{"$nulls":8},"","",""]
[{"$nulls":8},"","",""]
[{"$nulls":8},"","",""]
[{"$nulls":8},"","",""]
[{"$nulls":8},"","",""]
[{"$nulls":8},"","",""]
[{"$nulls":8},"","",""]
[{"$nulls":8},"","",""]
[{"$nulls":8},"","",""]
[{"$nulls":8},"","",""]
[{"$nulls":8},"","",""]
[{"$nulls":8},"","",""]
[{"$nulls":8},"","",""]
[{"$nulls":8},"","",""]
[{"$nulls":8},"","",""]
[{"$nulls":8},"","",""]
[{"$nulls":8},"","",""]
[{"$nulls":8},"","",""]
[{"$nulls":8},"","",""]
[{"$nulls":8},"","",""]
[{"$nulls":8},"","",""]
[{"$nulls":8},"","",""]
[{"$nulls":8},"","",""]
[{"$nulls":8},"","",""]
[{"$nulls":8},"","",""]
[{"$nulls":8},"","",""]
[{"$nulls":8},"","",""]
[{"$nulls":8},"","",""]
[{"$nulls":8},"","",""]
[{"$nulls":8},"","",""]
[{"$nulls":8},"","",""]
[{"$nulls":8},"","",""]
[{"$nulls":8},{"$f":"IF(AND($A515=\"2nd\",$D515>0),$D515,\"\")","v":""},{"$f":"IF(AND($A515=\"3rd\",$D515>0),$D515,\"\")","v":""},{"$f":"IF(AND($A515=\"4th\",$D515>0),$D515,\"\")","v":""}]
[{"$nulls":8},"","",""]
[{"$nulls":8},"","",""]
[{"$nulls":8},"","",""]
[{"$nulls":8},"","",""]
[{"$nulls":8},"","",""]
[{"$nulls":8},"","",""]
[{"$nulls":8},"","",""]
[{"$nulls":8},"","",""]
[{"$nulls":8},"","",""]
[{"$nulls":8},"","",""]
[{"$nulls":8},"","",""]
[{"$nulls":8},"","",""]
[{"$nulls":8},"","",""]
[{"$nulls":8},"","",""]
[{"$nulls":8},"","",""]
[{"$nulls":8},"","",""]
[{"$nulls":8},"","",""]
[{"$nulls":8},"","",""]
[{"$nulls":8},"","",""]
[{"$nulls":8},"","",""]
[{"$nulls":8},"","",""]
[{"$nulls":8},"","",""]
[{"$nulls":8},"","",""]
[{"$nulls":8},"","",""]
[{"$nulls":8},"","",""]
[{"$nulls":8},"","",""]
[{"$nulls":8},"","",""]
[{"$nulls":8},"","",""]
[{"$nulls":8},"","",""]
[{"$nulls":8},"","",""]
[{"$nulls":8},"","",""]
[{"$nulls":8},"","",""]
[{"$nulls":8},"","",""]
[{"$nulls":8},"","",""]
[{"$nulls":8},"","",""]
[{"$nulls":8},"","",""]
[{"$nulls":8},"","",""]
[{"$nulls":8},"","",""]
[{"$nulls":8},"","",""]
[{"$nulls":8},"","",""]
[{"$nulls":8},"","",""]
[{"$nulls":8},"","",""]
[{"$nulls":8},"","",""]
[{"$nulls":8},"","",""]
[{"$nulls":8},"","",""]
[{"$nulls":8},"","",""]
[{"$nulls":8},"","",""]
[{"$nulls":8},"","",""]
[{"$nulls":8},"","",""]
[{"$nulls":8},"","",""]
[{"$nulls":8},"","",""]
[{"$nulls":8},"","",""]
[{"$nulls":8},"","",""]
[{"$nulls":8},"","",""]
[{"$nulls":8},"","",""]
[{"$nulls":8},"","",""]
[{"$nulls":8},"","",""]
[{"$nulls":8},"","",""]
[{"$nulls":8},"","",""]
[{"$nulls":8},"","",""]
[{"$nulls":8},"","",""]
[{"$nulls":8},"","",""]
[{"$nulls":8},"","",""]
[{"$nulls":8},{"$f":"IF(AND($A579=\"2nd\",$D579>0),$D579,\"\")","v":""},{"$f":"IF(AND($A579=\"3rd\",$D579>0),$D579,\"\")","v":""},{"$f":"IF(AND($A579=\"4th\",$D579>0),$D579,\"\")","v":""}]
[{"$nulls":8},"","",""]
[{"$nulls":8},"","",""]
[{"$nulls":8},"","",""]
[{"$nulls":8},"","",""]
[{"$nulls":8},"","",""]
[{"$nulls":8},"","",""]
[{"$nulls":8},"","",""]
[{"$nulls":8},"","",""]
[{"$nulls":8},"","",""]
[{"$nulls":8},"","",""]
[{"$nulls":8},"","",""]
[{"$nulls":8},"","",""]
[{"$nulls":8},"","",""]
[{"$nulls":8},"","",""]
[{"$nulls":8},"","",""]
[{"$nulls":8},"","",""]
[{"$nulls":8},"","",""]
[{"$nulls":8},"","",""]
[{"$nulls":8},"","",""]
[{"$nulls":8},"","",""]
[{"$nulls":8},"","",""]
[{"$nulls":8},"","",""]
[{"$nulls":8},"","",""]
[{"$nulls":8},"","",""]
[{"$nulls":8},"","",""]
[{"$nulls":8},"","",""]
[{"$nulls":8},"","",""]
[{"$nulls":8},"","",""]
[{"$nulls":8},"","",""]
[{"$nulls":8},"","",""]
[{"$nulls":8},"","",""]
[{"$nulls":8},"","",""]
[{"$nulls":8},"","",""]
[{"$nulls":8},"","",""]
[{"$nulls":8},"","",""]
[{"$nulls":8},"","",""]
[{"$nulls":8},"","",""]
[{"$nulls":8},"","",""]
[{"$nulls":8},"","",""]
[{"$nulls":8},"","",""]
[{"$nulls":8},"","",""]
[{"$nulls":8},"","",""]
[{"$nulls":8},"","",""]
[{"$nulls":8},"","",""]
[{"$nulls":8},"","",""]
[{"$nulls":8},"","",""]
[{"$nulls":8},"","",""]
[{"$nulls":8},"","",""]
[{"$nulls":8},"","",""]
[{"$nulls":8},"","",""]
[{"$nulls":8},"","",""]
[{"$nulls":8},"","",""]
[{"$nulls":8},"","",""]
[{"$nulls":8},"","",""]
[{"$nulls":8},"","",""]
[{"$nulls":8},"","",""]
[{"$nulls":8},"","",""]
[{"$nulls":8},"","",""]
[{"$nulls":8},"","",""]
[{"$nulls":8},"","",""]
[{"$nulls":8},"","",""]
[{"$nulls":8},"","",""]
[{"$nulls":8},"","",""]
[{"$nulls":8},{"$f":"IF(AND($A643=\"2nd\",$D643>0),$D643,\"\")","v":""},{"$f":"IF(AND($A643=\"3rd\",$D643>0),$D643,\"\")","v":""},{"$f":"IF(AND($A643=\"4th\",$D643>0),$D643,\"\")","v":""}]
[{"$nulls":8},"","",""]
[{"$nulls":8},"","",""]
[{"$nulls":8},"","",""]
[{"$nulls":8},"","",""]
[{"$nulls":8},"","",""]
[{"$nulls":8},"","",""]
[{"$nulls":8},"","",""]
[{"$nulls":8},"","",""]
[{"$nulls":8},"","",""]
[{"$nulls":8},"","",""]
[{"$nulls":8},"","",""]
[{"$nulls":8},"","",""]
[{"$nulls":8},"","",""]
[{"$nulls":8},"","",""]
[{"$nulls":8},"","",""]
[{"$nulls":8},"","",""]
[{"$nulls":8},"","",""]
[{"$nulls":8},"","",""]
[{"$nulls":8},"","",""]
[{"$nulls":8},"","",""]
[{"$nulls":8},"","",""]
[{"$nulls":8},"","",""]
[{"$nulls":8},"","",""]
[{"$nulls":8},"","",""]
[{"$nulls":8},"","",""]
[{"$nulls":8},"","",""]
[{"$nulls":8},"","",""]
[{"$nulls":8},"","",""]
[{"$nulls":8},"","",""]
[{"$nulls":8},"","",""]
[{"$nulls":8},"","",""]
[{"$nulls":8},"","",""]
[{"$nulls":8},"","",""]
[{"$nulls":8},"","",""]
[{"$nulls":8},"","",""]
[{"$nulls":8},"","",""]
[{"$nulls":8},"","",""]
[{"$nulls":8},"","",""]
[{"$nulls":8},"","",""]
[{"$nulls":8},"","",""]
[{"$nulls":8},"","",""]
[{"$nulls":8},"","",""]
[{"$nulls":8},"","",""]
[{"$nulls":8},"","",""]
[{"$nulls":8},"","",""]
[{"$nulls":8},"","",""]
[{"$nulls":8},"","",""]
[{"$nulls":8},"","",""]
[{"$nulls":8},"","",""]
[{"$nulls":8},"","",""]
[{"$nulls":8},"","",""]
[{"$nulls":8},"","",""]
[{"$nulls":8},"","",""]
[{"$nulls":8},"","",""]
[{"$nulls":8},"","",""]
[{"$nulls":8},"","",""]
[{"$nulls":8},"","",""]
[{"$nulls":8},"","",""]
[{"$nulls":8},"","",""]
[{"$nulls":8},"","",""]
[{"$nulls":8},"","",""]
[{"$nulls":8},"","",""]
[{"$nulls":8},"","",""]
[{"$nulls":8},{"$f":"IF(AND($A707=\"2nd\",$D707>0),$D707,\"\")","v":""},{"$f":"IF(AND($A707=\"3rd\",$D707>0),$D707,\"\")","v":""},{"$f":"IF(AND($A707=\"4th\",$D707>0),$D707,\"\")","v":""}]
[{"$nulls":8},"","",""]
[{"$nulls":8},"","",""]
[{"$nulls":8},"","",""]
[{"$nulls":8},"","",""]
[{"$nulls":8},"","",""]
[{"$nulls":8},"","",""]
[{"$nulls":8},"","",""]
[{"$nulls":8},"","",""]
[{"$nulls":8},"","",""]
[{"$nulls":8},"","",""]
[{"$nulls":8},"","",""]
[{"$nulls":8},"","",""]
[{"$nulls":8},"","",""]
[{"$nulls":8},"","",""]
[{"$nulls":8},"","",""]
[{"$nulls":8},"","",""]
[{"$nulls":8},"","",""]
[{"$nulls":8},"","",""]
[{"$nulls":8},"","",""]
[{"$nulls":8},"","",""]
[{"$nulls":8},"","",""]
[{"$nulls":8},"","",""]
[{"$nulls":8},"","",""]
[{"$nulls":8},"","",""]
[{"$nulls":8},"","",""]
[{"$nulls":8},"","",""]
[{"$nulls":8},"","",""]
[{"$nulls":8},"","",""]
[{"$nulls":8},"","",""]
[{"$nulls":8},"","",""]
[{"$nulls":8},"","",""]
[{"$nulls":8},"","",""]
[{"$nulls":8},"","",""]
[{"$nulls":8},"","",""]
[{"$nulls":8},"","",""]
[{"$nulls":8},"","",""]
[{"$nulls":8},"","",""]
[{"$nulls":8},"","",""]
[{"$nulls":8},"","",""]
[{"$nulls":8},"","",""]
[{"$nulls":8},"","",""]
[{"$nulls":8},"","",""]
[{"$nulls":8},"","",""]
[{"$nulls":8},"","",""]
[{"$nulls":8},"","",""]
[{"$nulls":8},"","",""]
[{"$nulls":8},"","",""]
[{"$nulls":8},"","",""]
[{"$nulls":8},"","",""]
[{"$nulls":8},"","",""]
[{"$nulls":8},"","",""]
[{"$nulls":8},"","",""]
[{"$nulls":8},"","",""]
[{"$nulls":8},"","",""]
[{"$nulls":8},"","",""]
[{"$nulls":8},"","",""]
[{"$nulls":8},"","",""]
[{"$nulls":8},"","",""]
[{"$nulls":8},"","",""]
[{"$nulls":8},"","",""]
[{"$nulls":8},"","",""]
[{"$nulls":8},"","",""]
[{"$nulls":8},"","",""]
[{"$nulls":8},{"$f":"IF(AND($A771=\"2nd\",$D771>0),$D771,\"\")","v":""},{"$f":"IF(AND($A771=\"3rd\",$D771>0),$D771,\"\")","v":""},{"$f":"IF(AND($A771=\"4th\",$D771>0),$D771,\"\")","v":""}]
[{"$nulls":8},"","",""]
[{"$nulls":8},"","",""]
[{"$nulls":8},"","",""]
[{"$nulls":8},"","",""]
[{"$nulls":8},"","",""]
[{"$nulls":8},"","",""]
[{"$nulls":8},"","",""]
[{"$nulls":8},"","",""]
[{"$nulls":8},"","",""]
[{"$nulls":8},"","",""]
[{"$nulls":8},"","",""]
[{"$nulls":8},"","",""]
[{"$nulls":8},"","",""]
[{"$nulls":8},"","",""]
[{"$nulls":8},"","",""]
[{"$nulls":8},"","",""]
[{"$nulls":8},"","",""]
[{"$nulls":8},"","",""]
[{"$nulls":8},"","",""]
[{"$nulls":8},"","",""]
[{"$nulls":8},"","",""]
[{"$nulls":8},"","",""]
[{"$nulls":8},"","",""]
[{"$nulls":8},"","",""]
[{"$nulls":8},"","",""]
[{"$nulls":8},"","",""]
[{"$nulls":8},"","",""]
[{"$nulls":8},"","",""]
[{"$nulls":8},"","",""]
[{"$nulls":8},"","",""]
[{"$nulls":8},"","",""]
[{"$nulls":8},"","",""]
[{"$nulls":8},"","",""]
[{"$nulls":8},"","",""]
[{"$nulls":8},"","",""]
[{"$nulls":8},"","",""]
[{"$nulls":8},"","",""]
[{"$nulls":8},"","",""]
[{"$nulls":8},"","",""]
[{"$nulls":8},"","",""]
[{"$nulls":8},"","",""]
[{"$nulls":8},"","",""]
[{"$nulls":8},"","",""]
[{"$nulls":8},"","",""]
[{"$nulls":8},"","",""]
[{"$nulls":8},"","",""]
[{"$nulls":8},"","",""]
[{"$nulls":8},"","",""]
[{"$nulls":8},"","",""]
[{"$nulls":8},"","",""]
[{"$nulls":8},"","",""]
[{"$nulls":8},"","",""]
[{"$nulls":8},"","",""]
[{"$nulls":8},"","",""]
[{"$nulls":8},"","",""]
[{"$nulls":8},"","",""]
[{"$nulls":8},"","",""]
[{"$nulls":8},"","",""]
[{"$nulls":8},"","",""]
[{"$nulls":8},"","",""]
[{"$nulls":8},"","",""]
[{"$nulls":8},"","",""]
[{"$nulls":8},"","",""]
[{"$nulls":8},{"$f":"IF(AND($A835=\"2nd\",$D835>0),$D835,\"\")","v":""},{"$f":"IF(AND($A835=\"3rd\",$D835>0),$D835,\"\")","v":""},{"$f":"IF(AND($A835=\"4th\",$D835>0),$D835,\"\")","v":""}]
[{"$nulls":8},"","",""]
[{"$nulls":8},"","",""]
[{"$nulls":8},"","",""]
[{"$nulls":8},"","",""]
[{"$nulls":8},"","",""]
[{"$nulls":8},"","",""]
[{"$nulls":8},"","",""]
[{"$nulls":8},"","",""]
[{"$nulls":8},"","",""]
[{"$nulls":8},"","",""]
[{"$nulls":8},"","",""]
[{"$nulls":8},"","",""]
[{"$nulls":8},"","",""]
[{"$nulls":8},"","",""]
[{"$nulls":8},"","",""]
[{"$nulls":8},"","",""]
[{"$nulls":8},"","",""]
[{"$nulls":8},"","",""]
[{"$nulls":8},"","",""]
[{"$nulls":8},"","",""]
[{"$nulls":8},"","",""]
[{"$nulls":8},"","",""]
[{"$nulls":8},"","",""]
[{"$nulls":8},"","",""]
[{"$nulls":8},"","",""]
[{"$nulls":8},"","",""]
[{"$nulls":8},"","",""]
[{"$nulls":8},"","",""]
[{"$nulls":8},"","",""]
[{"$nulls":8},"","",""]
[{"$nulls":8},"","",""]
[{"$nulls":8},"","",""]
[{"$nulls":8},"","",""]
[{"$nulls":8},"","",""]
[{"$nulls":8},"","",""]
[{"$nulls":8},"","",""]
[{"$nulls":8},"","",""]
[{"$nulls":8},"","",""]
[{"$nulls":8},"","",""]
[{"$nulls":8},"","",""]
[{"$nulls":8},"","",""]
[{"$nulls":8},"","",""]
[{"$nulls":8},"","",""]
[{"$nulls":8},"","",""]
[{"$nulls":8},"","",""]
[{"$nulls":8},"","",""]
[{"$nulls":8},"","",""]
[{"$nulls":8},"","",""]
[{"$nulls":8},"","",""]
[{"$nulls":8},"","",""]
[{"$nulls":8},"","",""]
[{"$nulls":8},"","",""]
[{"$nulls":8},"","",""]
[{"$nulls":8},"","",""]
[{"$nulls":8},"","",""]
[{"$nulls":8},"","",""]
[{"$nulls":8},"","",""]
[{"$nulls":8},"","",""]
[{"$nulls":8},"","",""]
[{"$nulls":8},"","",""]
[{"$nulls":8},"","",""]
[{"$nulls":8},"","",""]
[{"$nulls":8},"","",""]
[{"$nulls":8},{"$f":"IF(AND($A899=\"2nd\",$D899>0),$D899,\"\")","v":""},{"$f":"IF(AND($A899=\"3rd\",$D899>0),$D899,\"\")","v":""},{"$f":"IF(AND($A899=\"4th\",$D899>0),$D899,\"\")","v":""}]
[{"$nulls":8},"","",""]
[{"$nulls":8},"","",""]
[{"$nulls":8},"","",""]
[{"$nulls":8},"","",""]
[{"$nulls":8},"","",""]
[{"$nulls":8},"","",""]
[{"$nulls":8},"","",""]
[{"$nulls":8},"","",""]
[{"$nulls":8},"","",""]
[{"$nulls":8},"","",""]
[{"$nulls":8},"","",""]
[{"$nulls":8},"","",""]
[{"$nulls":8},"","",""]
[{"$nulls":8},"","",""]
[{"$nulls":8},"","",""]
[{"$nulls":8},"","",""]
[{"$nulls":8},"","",""]
[{"$nulls":8},"","",""]
[{"$nulls":8},"","",""]
[{"$nulls":8},"","",""]
[{"$nulls":8},"","",""]
[{"$nulls":8},"","",""]
[{"$nulls":8},"","",""]
[{"$nulls":8},"","",""]
[{"$nulls":8},"","",""]
[{"$nulls":8},"","",""]
[{"$nulls":8},"","",""]
[{"$nulls":8},"","",""]
[{"$nulls":8},"","",""]
[{"$nulls":8},"","",""]
[{"$nulls":8},"","",""]
[{"$nulls":8},"","",""]
[{"$nulls":8},"","",""]
[{"$nulls":8},"","",""]
[{"$nulls":8},"","",""]
[{"$nulls":8},"","",""]
[{"$nulls":8},"","",""]
[{"$nulls":8},"","",""]
[{"$nulls":8},"","",""]
[{"$nulls":8},"","",""]
[{"$nulls":8},"","",""]
[{"$nulls":8},"","",""]
[{"$nulls":8},"","",""]
[{"$nulls":8},"","",""]
[{"$nulls":8},"","",""]
[{"$nulls":8},"","",""]
[{"$nulls":8},"","",""]
[{"$nulls":8},"","",""]
[{"$nulls":8},"","",""]
[{"$nulls":8},"","",""]
[{"$nulls":8},"","",""]
[{"$nulls":8},"","",""]
[{"$nulls":8},"","",""]
[{"$nulls":8},"","",""]
[{"$nulls":8},"","",""]
[{"$nulls":8},"","",""]
[{"$nulls":8},"","",""]
[{"$nulls":8},"","",""]
[{"$nulls":8},"","",""]
[{"$nulls":8},"","",""]
[{"$nulls":8},"","",""]
[{"$nulls":8},"","",""]
[{"$nulls":8},"","",""]
[{"$nulls":8},{"$f":"IF(AND($A963=\"2nd\",$D963>0),$D963,\"\")","v":""},{"$f":"IF(AND($A963=\"3rd\",$D963>0),$D963,\"\")","v":""},{"$f":"IF(AND($A963=\"4th\",$D963>0),$D963,\"\")","v":""}]
[{"$nulls":8},"","",""]
[{"$nulls":8},"","",""]
[{"$nulls":8},"","",""]
[{"$nulls":8},"","",""]
[{"$nulls":8},"","",""]
[{"$nulls":8},"","",""]
[{"$nulls":8},"","",""]
[{"$nulls":8},"","",""]
[{"$nulls":8},"","",""]
[{"$nulls":8},"","",""]
[{"$nulls":8},"","",""]
[{"$nulls":8},"","",""]
[{"$nulls":8},"","",""]
[{"$nulls":8},"","",""]
[{"$nulls":8},"","",""]
[{"$nulls":8},"","",""]
[{"$nulls":8},"","",""]
[{"$nulls":8},"","",""]
[{"$nulls":8},"","",""]
[{"$nulls":8},"","",""]
[{"$nulls":8},"","",""]
[{"$nulls":8},"","",""]
[{"$nulls":8},"","",""]
[{"$nulls":8},"","",""]
[{"$nulls":8},"","",""]
[{"$nulls":8},"","",""]
[{"$nulls":8},"","",""]
[{"$nulls":8},"","",""]
[{"$nulls":8},"","",""]
[{"$nulls":8},"","",""]
[{"$nulls":8},"","",""]
[{"$nulls":8},"","",""]
[{"$nulls":8},"","",""]
[{"$nulls":8},"","",""]
[{"$nulls":8},"","",""]
[{"$nulls":8},"","",""]
[{"$nulls":8},"","",""]
[{"$nulls":8},"","",""]
[{"$nulls":8},"","",""]