{"text_format":"2","workbook":"xlsx","n_sheets":6,"sheets":["Neurals","Data","Instructions","Meetings","Race","Selections"],"not_rendered":{"charts":0,"images":0,"macros":1,"external_links":0,"defined_names":1392,"comments":0,"pivot_tables":0},"unopened":[],"bounds":{"document_bytes":16777216,"sheet_cells":100000,"run_cost":"one","rows_first":2000,"rows_last":500,"rows_between":2000,"halvings":0,"cell_chars":16384,"cell_head_chars":4096},"cells_cut":0,"cells_raw":0,"read":"whole","date_system":"1900"}

{"sheet":"Neurals","index":0,"n_rows":68,"n_cols":32,"rows_kept":68,"cut":false,"hidden":false,"merged":[[2,5,2,7],[1,8,2,10],[2,14,2,15]]}
[{"$nulls":20},{"$f":"IF(Race!D2=\"Paying\",\"Paying\",\"\")","v":"Paying"},{"$f":"SUM(AA1:AA3)","v":4},{"$f":"IF(AA1<>\"\",B3,\"\")","v":""},null,{"$f":"IF(AA1<>\"\",E3,\"\")","v":""},{"$f":"IF(AA1=\"\",\"\",\"Fav\")","v":""},{"$f":"IF(SUM(Y11:Y36)>0,SUM(Y11:Y36),\"\")","v":""},{"$f":"IF(AA1=\"\",\"\",IF(ISNA(CLEAN(TRIM((VLOOKUP(AA1,$Y$11:$Z$36,2,FALSE))))),\"\",CLEAN(TRIM((VLOOKUP(AA1,$Y$11:$Z$36,2,FALSE))))))","v":""},null,null,{"$f":"IF(U1<>\"\",IF(ISNA(VLOOKUP(AB1,Data!$C$3:$E$5,2,FALSE)),\"\",(VLOOKUP(AB1,Data!$C$3:$E$5,2,FALSE))),\"\")","v":""},{"$f":"IF(U1<>\"\",IF(ISNA(VLOOKUP(AB1,Data!$C$3:$E$5,1,FALSE)),\"\",(VLOOKUP(AB1,Data!$C$3:$E$5,3,FALSE))),\"\")","v":""}]
[null,"Race Venue",null,"Race Code","1st Race No","Last Race No",{"$nulls":6},"WT",null,"Min Price",{"$nulls":7},{"$f":"IF(AA2<>\"\",B3,\"\")","v":""},null,{"$f":"IF(AA2<>\"\",E3,\"\")","v":""},{"$f":"IF(AA2=\"\",\"\",\"CP/FR\")","v":""},{"$f":"IF(SUM(Y41:Y67)>0,SUM(Y41:Y67),\"\")","v":""},{"$f":"IF(AA2=\"\",\"\",IF(ISNA(CLEAN(TRIM((VLOOKUP(AA2,$Y$41:$Z$65,2,FALSE))))),\"\",(CLEAN(TRIM((VLOOKUP(AA2,$Y$41:$Z$65,2,FALSE)))))))","v":""},null,null,{"$f":"IF(U1<>\"\",IF(ISNA(VLOOKUP(AB2,Data!$C$3:$E$5,2,FALSE)),\"\",(VLOOKUP(AB2,Data!$C$3:$E$5,2,FALSE))),\"\")","v":""},{"$f":"IF(U1<>\"\",IF(ISNA(VLOOKUP(AB2,Data!$C$3:$E$5,1,FALSE)),\"\",(VLOOKUP(AB2,Data!$C$3:$E$5,3,FALSE))),\"\")","v":""}]
[null,"CANBERRA",null,{"$f":"IF(ISNA(VLOOKUP(B3,$AD$12:$AF$100,3,FALSE)),\"\",VLOOKUP(B3,$AD$12:$AF$100,3,FALSE))","v":"16399"},9,{"$f":"IF(ISNA(VLOOKUP(B3,Data!$F$2:'Data'!$U$100,16,FALSE)),\"\",VLOOKUP(B3,Data!$F$2:'Data'!$U$100,16,FALSE))","v":8},{"$nulls":6},2,null,2,{"$nulls":7},{"$f":"IF(AA3<>\"\",B3,\"\")","v":"CANBERRA"},null,{"$f":"IF(AA3<>\"\",E3,\"\")","v":9},{"$f":"IF(AA3<>\"\",AA39,\"\")","v":3.5},{"$f":"IF(AA39<O3,\"\",IF(AB39<>\"\",AB39,\"\"))","v":4},{"$f":"IF(AA3=\"\",\"\",IF(ISNA(CLEAN(TRIM((VLOOKUP(AA3,$B$36:$C$71,2,FALSE))))),\"\",(CLEAN(TRIM((VLOOKUP(AA3,$B$36:$C$71,2,FALSE)))))))","v":"Bush Brandy"},null,null,{"$f":"IF(U1<>\"\",IF(ISNA(VLOOKUP(AB3,Data!$C$3:$E$5,2,FALSE)),\"\",(VLOOKUP(AB3,Data!$C$3:$E$5,2,FALSE))),\"\")","v":""},{"$f":"IF(U1<>\"\",IF(ISNA(VLOOKUP(AB3,Data!$C$3:$E$5,1,FALSE)),\"\",(VLOOKUP(AB3,Data!$C$3:$E$5,3,FALSE))),\"\")","v":""}]
[]
[]
[]
[]
[null,{"$f":"B3","v":"CANBERRA"},null,"Race",{"$f":"E3","v":9}]
{"$rows_left_out":61}
{"sheet":"Data","index":1,"n_rows":45,"n_cols":24,"rows_kept":45,"cut":false,"hidden":false,"merged":[]}
[{"$f":"Neurals!B3","v":"CANBERRA"},{"$f":"Neurals!E3","v":9},{"$f":"Neurals!U1","v":"Paying"},null,"2011-04-01",null,{"$f":"IF(ISNA(VLOOKUP(A1,F2:Q40,B1+2,FALSE)),\"\",VLOOKUP(A1,F2:Q40,B1+2,FALSE))","v":""},{"$nulls":14},{"$f":"IF(W1<>\"\",IF(ISERROR(CLEAN(TRIM((LEFT(Meetings!W1,FIND(\"-\",Meetings!W1,1)-1))))),CLEAN(TRIM(Meetings!W1)),CLEAN(TRIM(LEFT(Meetings!W1,FIND(\"-\",Meetings!W1,1)-1)))),\"\")","v":""},{"$f":"IF(Meetings!W1=\"\",\"\",getAddress(Meetings!W1))","v":""},{"$f":"IF(W1=\"\",\"\",RIGHT(W1,LEN(W1)-FIND(\"=\",W1,1)))","v":""}]
[{"$nulls":5},{"$f":"IF(G2=\"\",\"\",IF(ISERROR(CLEAN(TRIM((LEFT(G2,FIND(\"(\",G2,1)-1))))),\"\",CLEAN(TRIM(LEFT(G2,FIND(\"(\",G2,1)-1)))))","v":"IPSWICH"},{"$f":"IF(Meetings!B3=\"\",\"\",Meetings!B3)","v":"IPSWICH (BR)"},{"$f":"IF(Meetings!D3=\"\",\"\",getAddress(Meetings!D3))","v":"http://www.tabonline.com.au/2011/04/01/BR01.html"},{"$f":"IF(Meetings!E3=\"\",\"\",getAddress(Meetings!E3))","v":"http://www.tabonline.com.au/2011/04/01/BR02.html"},{"$f":"IF(Meetings!F3=\"\",\"\",getAddress(Meetings!F3))","v":"http://www.tabonline.com.au/2011/04/01/BR03.html"},{"$f":"IF(Meetings!G3=\"\",\"\",getAddress(Meetings!G3))","v":"http://www.tabonline.com.au/2011/04/01/BR04.html"},{"$f":"IF(Meetings!H3=\"\",\"\",getAddress(Meetings!H3))","v":"http://www.tabonline.com.au/2011/04/01/BR05.html"},{"$f":"IF(Meetings!I3=\"\",\"\",getAddress(Meetings!I3))","v":"http://www.tabonline.com.au/2011/04/01/BR06.html"},{"$f":"IF(Meetings!J3=\"\",\"\",getAddress(Meetings!J3))","v":"http://www.tabonline.com.au/2011/04/01/BR07.html"},{"$f":"IF(Meetings!K3=\"\",\"\",getAddress(Meetings!K3))","v":""},{"$f":"IF(Meetings!L3=\"\",\"\",getAddress(Meetings!L3))","v":""},{"$f":"IF(Meetings!M3=\"\",\"\",getAddress(Meetings!M3))","v":""},{"$f":"IF(Meetings!N3=\"\",\"\",getAddress(Meetings!N3))","v":""},{"$f":"IF(Meetings!O3=\"\",\"\",getAddress(Meetings!O3))","v":""},null,{"$f":"COUNTA(Meetings!D3:'Meetings'!O3)","v":7},{"$f":"IF(W2<>\"\",IF(ISERROR(CLEAN(TRIM((LEFT(Meetings!W2,FIND(\"-\",Meetings!W2,1)-1))))),CLEAN(TRIM(Meetings!W2)),CLEAN(TRIM(LEFT(Meetings!W2,FIND(\"-\",Meetings!W2,1)-1)))),\"\")","v":""},{"$f":"IF(Meetings!W2=\"\",\"\",getAddress(Meetings!W2))","v":""},{"$f":"IF(W2=\"\",\"\",RIGHT(W2,LEN(W2)-FIND(\"=\",W2,1)))","v":""}]
[{"$f":"IF(Race!N1<>\"\",(CLEAN(TRIM(Race!C1))),\"\")","v":""},{"$f":"IF(A3<>\"\",Race!I1,\"\")","v":""},{"$f":"IF($C$1<>\"\",CLEAN(TRIM(INDEX(Race!$A$1:$C20,MATCH(\"QN\",Race!$A1:$A$20,0)-4,3))),\"\")","v":"PARAMOUNT PETE"},{"$f":"IF(ISNA(VLOOKUP(C3,Race!$C$2:$E$15,2,FALSE)),\"\",(VLOOKUP(C3,Race!$C$2:$E$15,2,FALSE)))","v":10.7},{"$f":"IF(ISNA(VLOOKUP(C3,Race!$C$2:$E$15,3,FALSE)),\"\",(VLOOKUP(C3,Race!$C$2:$E$15,3,FALSE)))","v":3.3},{"$f":"IF(G3=\"\",\"\",IF(ISERROR(CLEAN(TRIM((LEFT(G3,FIND(\"(\",G3,1)-1))))),\"\",CLEAN(TRIM(LEFT(G3,FIND(\"(\",G3,1)-1)))))","v":"GRAFTON"},{"$f":"IF(Meetings!B4=\"\",\"\",Meetings!B4)","v":"GRAFTON (NR)"},{"$f":"IF(Meetings!D4=\"\",\"\",getAddress(Meetings!D4))","v":"http://www.tabonline.com.au/2011/04/01/NR01.html"},{"$f":"IF(Meetings!E4=\"\",\"\",getAddress(Meetings!E4))","v":"http://www.tabonline.com.au/2011/04/01/NR02.html"},{"$f":"IF(Meetings!F4=\"\",\"\",getAddress(Meetings!F4))","v":"http://www.tabonline.com.au/2011/04/01/NR03.html"},{"$f":"IF(Meetings!G4=\"\",\"\",getAddress(Meetings!G4))","v":"http://www.tabonline.com.au/2011/04/01/NR04.html"},{"$f":"IF(Meetings!H4=\"\",\"\",getAddress(Meetings!H4))","v":"http://www.tabonline.com.au/2011/04/01/NR05.html"},{"$f":"IF(Meetings!I4=\"\",\"\",getAddress(Meetings!I4))","v":"http://www.tabonline.com.au/2011/04/01/NR06.html"},{"$f":"IF(Meetings!J4=\"\",\"\",getAddress(Meetings!J4))","v":"http://www.tabonline.com.au/2011/04/01/NR07.html"},{"$f":"IF(Meetings!K4=\"\",\"\",getAddress(Meetings!K4))","v":"http://www.tabonline.com.au/2011/04/01/NR08.html"},{"$f":"IF(Meetings!L4=\"\",\"\",getAddress(Meetings!L4))","v":"http://www.tabonline.com.au/2011/04/01/NR09.html"},{"$f":"IF(Meetings!M4=\"\",\"\",getAddress(Meetings!M4))","v":"http://www.tabonline.com.au/2011/04/01/NR10.html"},{"$f":"IF(Meetings!N4=\"\",\"\",getAddress(Meetings!N4))","v":""},{"$f":"IF(Meetings!O4=\"\",\"\",getAddress(Meetings!O4))","v":""},null,{"$f":"COUNTA(Meetings!D4:'Meetings'!O4)","v":10},{"$f":"IF(W3<>\"\",IF(ISERROR(CLEAN(TRIM((LEFT(Meetings!W3,FIND(\"-\",Meetings!W3,1)-1))))),CLEAN(TRIM(Meetings!W3)),CLEAN(TRIM(LEFT(Meetings!W3,FIND(\"-\",Meetings!W3,1)-1)))),\"\")","v":""},{"$f":"IF(Meetings!W3=\"\",\"\",getAddress(Meetings!W3))","v":""},""]
[{"$f":"IF(Race!N2<>\"\",(CLEAN(TRIM(Race!C2))),\"\")","v":""},{"$f":"IF(A4<>\"\",Race!N2,\"\")","v":""},{"$f":"IF($C$1<>\"\",CLEAN(TRIM(INDEX(Race!$A$1:$C21,MATCH(\"QN\",Race!$A2:$A$20,0)-2,3))),\"\")","v":"HURRICONI"},{"$f":"IF(ISNA(VLOOKUP(C4,Race!$C$2:$E$15,2,FALSE)),\"\",(VLOOKUP(C4,Race!$C$2:$E$15,2,FALSE)))","v":0},{"$f":"IF(ISNA(VLOOKUP(C4,Race!$C$2:$E$15,3,FALSE)),\"\",(VLOOKUP(C4,Race!$C$2:$E$15,3,FALSE)))","v":2},"MORNINGTON",{"$f":"IF(Meetings!B5=\"\",\"\",Meetings!B5)","v":"MORNINGTON (VR)"},{"$f":"IF(Meetings!D5=\"\",\"\",getAddress(Meetings!D5))","v":"http://www.tabonline.com.au/2011/04/01/VR01.html"},{"$f":"IF(Meetings!E5=\"\",\"\",getAddress(Meetings!E5))","v":"http://www.tabonline.com.au/2011/04/01/VR02.html"},{"$f":"IF(Meetings!F5=\"\",\"\",getAddress(Meetings!F5))","v":"http://www.tabonline.com.au/2011/04/01/VR03.html"},{"$f":"IF(Meetings!G5=\"\",\"\",getAddress(Meetings!G5))","v":"http://www.tabonline.com.au/2011/04/01/VR04.html"},{"$f":"IF(Meetings!H5=\"\",\"\",getAddress(Meetings!H5))","v":"http://www.tabonline.com.au/2011/04/01/VR05.html"},{"$f":"IF(Meetings!I5=\"\",\"\",getAddress(Meetings!I5))","v":"http://www.tabonline.com.au/2011/04/01/VR06.html"},{"$f":"IF(Meetings!J5=\"\",\"\",getAddress(Meetings!J5))","v":"http://www.tabonline.com.au/2011/04/01/VR07.html"},{"$f":"IF(Meetings!K5=\"\",\"\",getAddress(Meetings!K5))","v":"http://www.tabonline.com.au/2011/04/01/VR08.html"},{"$f":"IF(Meetings!L5=\"\",\"\",getAddress(Meetings!L5))","v":"http://www.tabonline.com.au/2011/04/01/VR09.html"},{"$f":"IF(Meetings!M5=\"\",\"\",getAddress(Meetings!M5))","v":""},{"$f":"IF(Meetings!N5=\"\",\"\",getAddress(Meetings!N5))","v":""},{"$f":"IF(Meetings!O5=\"\",\"\",getAddress(Meetings!O5))","v":""},null,{"$f":"COUNTA(Meetings!D5:'Meetings'!O5)","v":9},{"$f":"IF(W4<>\"\",IF(ISERROR(CLEAN(TRIM((LEFT(Meetings!W4,FIND(\"-\",Meetings!W4,1)-1))))),CLEAN(TRIM(Meetings!W4)),CLEAN(TRIM(LEFT(Meetings!W4,FIND(\"-\",Meetings!W4,1)-1)))),\"\")","v":""},{"$f":"IF(Meetings!W4=\"\",\"\",getAddress(Meetings!W4))","v":""},""]
[{"$f":"IF(Race!N3<>\"\",(CLEAN(TRIM(Race!C3))),\"\")","v":""},{"$f":"IF(A5<>\"\",Race!N3,\"\")","v":""},{"$f":"IF($C$1<>\"\",CLEAN(TRIM(INDEX(Race!$A$1:$C22,MATCH(\"QN\",Race!$A3:$A$20,0)-0,3))),\"\")","v":"RED RIVER"},{"$f":"IF(ISNA(VLOOKUP(C5,Race!$C$2:$E$15,2,FALSE)),\"\",(VLOOKUP(C5,Race!$C$2:$E$15,2,FALSE)))","v":0},{"$f":"IF(ISNA(VLOOKUP(C5,Race!$C$2:$E$15,3,FALSE)),\"\",(VLOOKUP(C5,Race!$C$2:$E$15,3,FALSE)))","v":2.2000000000000002},"CANBERRA",{"$f":"IF(Meetings!B6=\"\",\"\",Meetings!B6)","v":"CANBERRA (CR)"},{"$f":"IF(Meetings!D6=\"\",\"\",getAddress(Meetings!D6))","v":"http://www.tabonline.com.au/2011/04/01/CR01.html"},{"$f":"IF(Meetings!E6=\"\",\"\",getAddress(Meetings!E6))","v":"http://www.tabonline.com.au/2011/04/01/CR02.html"},{"$f":"IF(Meetings!F6=\"\",\"\",getAddress(Meetings!F6))","v":"http://www.tabonline.com.au/2011/04/01/CR03.html"},{"$f":"IF(Meetings!G6=\"\",\"\",getAddress(Meetings!G6))","v":"http://www.tabonline.com.au/2011/04/01/CR04.html"},{"$f":"IF(Meetings!H6=\"\",\"\",getAddress(Meetings!H6))","v":"http://www.tabonline.com.au/2011/04/01/CR05.html"},{"$f":"IF(Meetings!I6=\"\",\"\",getAddress(Meetings!I6))","v":"http://www.tabonline.com.au/2011/04/01/CR06.html"},{"$f":"IF(Meetings!J6=\"\",\"\",getAddress(Meetings!J6))","v":"http://www.tabonline.com.au/2011/04/01/CR07.html"},{"$f":"IF(Meetings!K6=\"\",\"\",getAddress(Meetings!K6))","v":"http://www.tabonline.com.au/2011/04/01/CR08.html"},{"$f":"IF(Meetings!L6=\"\",\"\",getAddress(Meetings!L6))","v":""},{"$f":"IF(Meetings!M6=\"\",\"\",getAddress(Meetings!M6))","v":""},{"$f":"IF(Meetings!N6=\"\",\"\",getAddress(Meetings!N6))","v":""},{"$f":"IF(Meetings!O6=\"\",\"\",getAddress(Meetings!O6))","v":""},null,{"$f":"COUNTA(Meetings!D6:'Meetings'!O6)","v":8},{"$f":"IF(W5<>\"\",IF(ISERROR(CLEAN(TRIM((LEFT(Meetings!W5,FIND(\"-\",Meetings!W5,1)-1))))),CLEAN(TRIM(Meetings!W5)),CLEAN(TRIM(LEFT(Meetings!W5,FIND(\"-\",Meetings!W5,1)-1)))),\"\")","v":""},{"$f":"IF(Meetings!W5=\"\",\"\",getAddress(Meetings!W5))","v":""},""]
[{"$f":"IF(Race!N4<>\"\",(CLEAN(TRIM(Race!C4))),\"\")","v":""},{"$f":"IF(A6<>\"\",Race!N4,\"\")","v":""},null,null,null,"KRANJI",{"$f":"IF(Meetings!B7=\"\",\"\",Meetings!B7)","v":"KRANJI (SS)"},{"$f":"IF(Meetings!D7=\"\",\"\",getAddress(Meetings!D7))","v":"http://www.tabonline.com.au/2011/04/01/SS01.html"},{"$f":"IF(Meetings!E7=\"\",\"\",getAddress(Meetings!E7))","v":"http://www.tabonline.com.au/2011/04/01/SS02.html"},{"$f":"IF(Meetings!F7=\"\",\"\",getAddress(Meetings!F7))","v":"http://www.tabonline.com.au/2011/04/01/SS03.html"},{"$f":"IF(Meetings!G7=\"\",\"\",getAddress(Meetings!G7))","v":"http://www.tabonline.com.au/2011/04/01/SS04.html"},{"$f":"IF(Meetings!H7=\"\",\"\",getAddress(Meetings!H7))","v":"http://www.tabonline.com.au/2011/04/01/SS05.html"},{"$f":"IF(Meetings!I7=\"\",\"\",getAddress(Meetings!I7))","v":"http://www.tabonline.com.au/2011/04/01/SS06.html"},{"$f":"IF(Meetings!J7=\"\",\"\",getAddress(Meetings!J7))","v":"http://www.tabonline.com.au/2011/04/01/SS07.html"},{"$f":"IF(Meetings!K7=\"\",\"\",getAddress(Meetings!K7))","v":"http://www.tabonline.com.au/2011/04/01/SS08.html"},{"$f":"IF(Meetings!L7=\"\",\"\",getAddress(Meetings!L7))","v":"http://www.tabonline.com.au/2011/04/01/SS09.html"},{"$f":"IF(Meetings!M7=\"\",\"\",getAddress(Meetings!M7))","v":"http://www.tabonline.com.au/2011/04/01/SS10.html"},{"$f":"IF(Meetings!N7=\"\",\"\",getAddress(Meetings!N7))","v":""},{"$f":"IF(Meetings!O7=\"\",\"\",getAddress(Meetings!O7))","v":""},null,{"$f":"COUNTA(Meetings!D7:'Meetings'!O7)","v":10},{"$f":"IF(W6<>\"\",IF(ISERROR(CLEAN(TRIM((LEFT(Meetings!W6,FIND(\"-\",Meetings!W6,1)-1))))),CLEAN(TRIM(Meetings!W6)),CLEAN(TRIM(LEFT(Meetings!W6,FIND(\"-\",Meetings!W6,1)-1)))),\"\")","v":""},{"$f":"IF(Meetings!W6=\"\",\"\",getAddress(Meetings!W6))","v":""},""]
[{"$f":"IF(Race!N5<>\"\",(CLEAN(TRIM(Race!C5))),\"\")","v":""},{"$f":"IF(A7<>\"\",Race!N5,\"\")","v":""},{"$f":"IF(A7<>\"\",Race!I5,\"\")","v":""},null,null,"FAIRVIEW",{"$f":"IF(Meetings!B8=\"\",\"\",Meetings!B8)","v":"FAIRVIEW (AS)"},{"$f":"IF(Meetings!D8=\"\",\"\",getAddress(Meetings!D8))","v":"http://www.tabonline.com.au/2011/04/01/AS01.html"},{"$f":"IF(Meetings!E8=\"\",\"\",getAddress(Meetings!E8))","v":"http://www.tabonline.com.au/2011/04/01/AS02.html"},{"$f":"IF(Meetings!F8=\"\",\"\",getAddress(Meetings!F8))","v":"http://www.tabonline.com.au/2011/04/01/AS03.html"},{"$f":"IF(Meetings!G8=\"\",\"\",getAddress(Meetings!G8))","v":"http://www.tabonline.com.au/2011/04/01/AS04.html"},{"$f":"IF(Meetings!H8=\"\",\"\",getAddress(Meetings!H8))","v":"http://www.tabonline.com.au/2011/04/01/AS05.html"},{"$f":"IF(Meetings!I8=\"\",\"\",getAddress(Meetings!I8))","v":"http://www.tabonline.com.au/2011/04/01/AS06.html"},{"$f":"IF(Meetings!J8=\"\",\"\",getAddress(Meetings!J8))","v":"http://www.tabonline.com.au/2011/04/01/AS07.html"},{"$f":"IF(Meetings!K8=\"\",\"\",getAddress(Meetings!K8))","v":"http://www.tabonline.com.au/2011/04/01/AS08.html"},{"$f":"IF(Meetings!L8=\"\",\"\",getAddress(Meetings!L8))","v":""},{"$f":"IF(Meetings!M8=\"\",\"\",getAddress(Meetings!M8))","v":""},{"$f":"IF(Meetings!N8=\"\",\"\",getAddress(Meetings!N8))","v":""},{"$f":"IF(Meetings!O8=\"\",\"\",getAddress(Meetings!O8))","v":""},null,{"$f":"COUNTA(Meetings!D8:'Meetings'!O8)","v":8},{"$f":"IF(W7<>\"\",IF(ISERROR(CLEAN(TRIM((LEFT(Meetings!W7,FIND(\"-\",Meetings!W7,1)-1))))),CLEAN(TRIM(Meetings!W7)),CLEAN(TRIM(LEFT(Meetings!W7,FIND(\"-\",Meetings!W7,1)-1)))),\"\")","v":""},{"$f":"IF(Meetings!W7=\"\",\"\",getAddress(Meetings!W7))","v":""},""]
[{"$f":"IF(Race!N6<>\"\",(CLEAN(TRIM(Race!C6))),\"\")","v":""},{"$f":"IF(A8<>\"\",Race!N6,\"\")","v":""},{"$f":"IF(A8<>\"\",Race!I6,\"\")","v":""},null,null,"NEWCASTLE",{"$f":"IF(Meetings!B9=\"\",\"\",Meetings!B9)","v":"NEWCASTLE (CS)"},{"$f":"IF(Meetings!D9=\"\",\"\",getAddress(Meetings!D9))","v":"http://www.tabonline.com.au/2011/04/01/CS01.html"},{"$f":"IF(Meetings!E9=\"\",\"\",getAddress(Meetings!E9))","v":"http://www.tabonline.com.au/2011/04/01/CS02.html"},{"$f":"IF(Meetings!F9=\"\",\"\",getAddress(Meetings!F9))","v":"http://www.tabonline.com.au/2011/04/01/CS03.html"},{"$f":"IF(Meetings!G9=\"\",\"\",getAddress(Meetings!G9))","v":"http://www.tabonline.com.au/2011/04/01/CS04.html"},{"$f":"IF(Meetings!H9=\"\",\"\",getAddress(Meetings!H9))","v":"http://www.tabonline.com.au/2011/04/01/CS05.html"},{"$f":"IF(Meetings!I9=\"\",\"\",getAddress(Meetings!I9))","v":""},{"$f":"IF(Meetings!J9=\"\",\"\",getAddress(Meetings!J9))","v":""},{"$f":"IF(Meetings!K9=\"\",\"\",getAddress(Meetings!K9))","v":""},{"$f":"IF(Meetings!L9=\"\",\"\",getAddress(Meetings!L9))","v":""},{"$f":"IF(Meetings!M9=\"\",\"\",getAddress(Meetings!M9))","v":""},{"$f":"IF(Meetings!N9=\"\",\"\",getAddress(Meetings!N9))","v":""},{"$f":"IF(Meetings!O9=\"\",\"\",getAddress(Meetings!O9))","v":""},null,{"$f":"COUNTA(Meetings!D9:'Meetings'!O9)","v":5},{"$f":"IF(W8<>\"\",IF(ISERROR(CLEAN(TRIM((LEFT(Meetings!W8,FIND(\"-\",Meetings!W8,1)-1))))),CLEAN(TRIM(Meetings!W8)),CLEAN(TRIM(LEFT(Meetings!W8,FIND(\"-\",Meetings!W8,1)-1)))),\"\")","v":""},{"$f":"IF(Meetings!W8=\"\",\"\",getAddress(Meetings!W8))","v":""},""]
{"$rows_left_out":38}
{"sheet":"Instructions","index":2,"n_rows":10,"n_cols":2,"rows_kept":10,"cut":false,"hidden":false,"merged":[]}
[]
[]
[]
[]
[null,"Instructions"]
[]
[]
[null,"On the \"Neurals\" sheet press \"Start\" press \"OK\" for todays date or put in a date, there is a box on the right that has the days races, hightlight a race and press \"Select\"  then press the \"Import\" button,"]
{"$rows_left_out":3}
{"sheet":"Meetings","index":3,"n_rows":153,"n_cols":41,"rows_kept":153,"cut":false,"hidden":false,"merged":[[0,54,150,54],[151,20,151,53],[139,26,139,28],[140,26,140,28],[150,28,150,30],[141,20,145,27],[141,28,141,30],[142,28,142,30],[143,28,143,30],[144,28,144,30],[145,28,145,30],[146,20,150,27],[146,28,146,30],[130,26,130,28],[131,26,131,28],[132,26,132,28],[133,26,133,28],[134,26,134,28],[135,26,135,28],[136,26,136,28],[137,26,137,28],[138,26,138,28],[121,26,121,28],[122,26,122,28],[123,26,123,28],[124,26,124,28],[125,26,125,28],[126,26,126,28],[127,26,127,28],[128,26,128,28],[129,26,129,28],[124,21,124,25],[130,20,130,25],[131,21,131,25],[133,20,133,25],[134,21,134,25],[136,20,136,25],[137,21,137,25],[139,20,139,21],[140,21,140,25],[89,20,89,21],[90,21,90,25],[91,20,91,25],[92,20,92,25],[98,20,98,21],[99,21,99,25],[121,20,121,25],[122,20,122,25],[123,20,123,25],[100,20,100,25],[59,20,59,25],[60,20,60,25],[61,21,61,25],[71,20,71,25],[72,21,72,25],[74,20,74,25],[75,21,75,25],[77,20,77,25],[78,21,78,25],[26,20,26,25],[30,20,30,21],[32,20,32,25],[33,20,33,25],[34,20,34,25],[35,21,35,25],[52,20,52,25],[56,20,56,21],[58,20,58,25],[114,26,114,28],[115,26,115,28],[116,26,116,28],[117,26,117,28],[118,26,118,28],[119,26,119,28],[120,26,120,28],[97,26,97,28],[98,26,98,28],[99,26,99,28],[103,26,103,28],[104,26,104,28],[105,26,105,28],[120,21,120,25],[78,26,78,28],[79,26,79,28],[80,26,80,28],[81,26,81,28],[82,26,82,28],[83,26,83,28],[84,26,84,28],[85,26,85,28],[86,26,86,28],[87,26,87,28],[88,26,88,28],[89,26,89,28],[90,26,90,28],[91,26,91,28],[92,26,92,28],[93,26,93,28],[80,20,80,21],[81,21,81,25],[84,20,84,25],[85,21,85,25],[109,26,109,28],[110,26,110,28],[111,26,111,28],[112,26,112,28],[113,26,113,28],[106,26,106,28],[107,26,107,28],[108,26,108,28],[119,20,119,21],[114,21,114,25],[116,20,116,25],[117,21,117,25],[93,20,93,25],[94,21,94,25],[101,20,101,25],[102,20,102,25],[103,20,103,25],[104,21,104,25],[110,20,110,25],[111,21,111,25],[113,20,113,25],[100,26,100,28],[101,26,101,28],[102,26,102,28],[73,26,73,28],[74,26,74,28],[75,26,75,28],[76,26,76,28],[77,26,77,28],[69,26,69,28],[70,26,70,28],[71,26,71,28],[72,26,72,28],[94,26,94,28],[95,26,95,28],[96,26,96,28],[44,26,44,28],[45,26,45,28],[46,26,46,28],[29,26,30,26],[32,26,33,26],[41,26,42,26],[47,26,47,28],[48,26,48,28],[49,26,49,28],[50,26,50,28],[51,26,51,28],[52,26,52,28],[58,26,58,28],[59,26,59,28],[60,26,60,28],[61,26,61,28],[62,26,62,28],[53,26,53,28],[54,26,54,28],[55,26,55,28],[56,26,56,28],[57,26,57,28],[68,26,68,28],[63,26,63,28],[64,26,64,28],[65,26,65,28],[66,26,66,28],[67,26,67,28],[53,21,53,25],[2,32,4,32],[2,20,2,30],[3,20,3,30],[4,20,4,30],[5,20,5,30],[7,20,7,53],[8,20,8,53],[14,26,14,28],[15,26,15,28],[6,31,6,37],[9,20,9,25],[10,20,10,25],[11,20,11,25],[12,21,12,25],[1,0,1,2],[0,20,0,30],[1,20,1,27],[1,28,1,30],[6,20,6,30],[23,26,23,28],[24,26,24,28],[21,26,21,28],[22,26,22,28],[11,0,11,2],[20,0,20,2],[17,20,17,25],[18,21,18,25],[20,20,20,25],[21,21,21,25],[23,20,23,25],[24,21,24,25],[0,19,150,19],[48,20,48,25],[57,21,57,25],[27,21,27,25],[31,21,31,25],[49,21,49,25],[82,20,82,25],[83,20,83,25]]}
[{"$nulls":20}," ",{"$nulls":10}," "," "," "]
["Races",null,null,1,2,3,4,5,6,7,8,9,10,11,12,{"$nulls":5}," ",{"$nulls":10}," ",null," "]
[null,"IPSWICH (BR)","Fields","3,9,6 F4","6,7,3 F4","4,10,11 F4","8,12,11 F4","4,1,3 F4","4,9,13 F4","4,13,6 F4",{"$nulls":21}," ",null," "]
[null,"GRAFTON (NR)","Fields","2,7,1 ","6,9,4 ","4,3,8 ","4,11,7 ","4,7,12 ","4,6,5 ","7,2,12 F4","3,8,1 F4","4,8,2 F4","5,2,4 F4",{"$nulls":18}," ",null," "]
[null,"MORNINGTON (VR)","Fields","2,8,7 ","5,9,8 ","11,1,12 ","7,6,2 ","1,5,4 ","4,5,13 F4","4,9,1 F4","5,12,7 F4","3,4,8 F4",{"$nulls":19}," ",null," "]
[null,"CANBERRA (CR)","Fields","8,7,5 ","5,1,2 ","1,3,6 ","5,4,9 ","1,5,13 F4","9,5,3 F4","8,3,5 F4","2,1,10 F4",{"$nulls":9}," ",{"$nulls":17},"Username",null,"Password"]
[null,"KRANJI (SS)","Fields","08:20:00","08:50:00","09:20:00","09:50:00","10:20:00","10:50:00","11:20:00","11:50:00","12:25am ","12:55am "]
[null,"FAIRVIEW (AS)","Fields","08:30:00","09:05:00","09:40:00","10:15:00","10:55:00","11:30:00","12:05am ","12:40am "]
{"$rows_left_out":146}
{"sheet":"Race","index":4,"n_rows":43,"n_cols":14,"rows_kept":43,"cut":false,"hidden":false,"merged":[]}
[]
["CANBERRA",null,"CR 8","PAYING"]
[]
["2011-04-01","BM 60 HANDICAP",null,null,"Fixed Price"]
["RADIO TAB","5-2-9-10","IAN HUMPHRIES","5-1-9-10",null,"1400M","FINE","DEAD(4)"]
[]
[{"$nulls":6},"SCR 3 12"]
[2,null,"PARAMOUNT PETE",10.7,3.3]
{"$rows_left_out":36}
{"sheet":"Selections","index":5,"n_rows":82,"n_cols":11,"rows_kept":82,"cut":false,"hidden":false,"merged":[]}
["Venue",null,"Race",null,"No","Runner",null,null,"Win","Place"]
["",null,"","","","",null,null,"",""]
["IPSWICH",null,1,"CP/FR",5,"Spotted Eagle",null,null,"",""]
["",null,"","","","",null,null,"",""]
["IPSWICH",null,3,"Fav",4,"La Mariposa",null,null,1.9,1.3,"x"]
["IPSWICH",null,3,"CP/FR",4,"La Mariposa",null,null,1.9,1.3]
["IPSWICH",null,3,2.4,4,"La Mariposa",null,null,1.9,1.3]
["",null,"","","","",null,null,"",""]
{"$rows_left_out":74}