{"text_format":"2","workbook":"xlsx","n_sheets":6,"sheets":["Neurals","Data","Instructions","Meetings","Race","Selections"],"not_rendered":{"charts":0,"images":0,"macros":1,"external_links":0,"defined_names":1392,"comments":0,"pivot_tables":0},"unopened":[],"bounds":{"document_bytes":16777216,"sheet_cells":100000,"run_cost":"one","rows_first":2000,"rows_last":500,"rows_between":2000,"halvings":0,"cell_chars":16384,"cell_head_chars":4096},"cells_cut":0,"cells_raw":0,"read":"whole","date_system":"1900"}

{"sheet":"Neurals","index":0,"n_rows":68,"n_cols":32,"rows_kept":68,"cut":false,"hidden":false,"merged":[[2,5,2,7],[1,8,2,10],[2,14,2,15]]}
[{"$nulls":20},{"$f":"IF(Race!D2=\"Paying\",\"Paying\",\"\")","v":"Paying"},{"$f":"SUM(AA1:AA3)","v":4},{"$f":"IF(AA1<>\"\",B3,\"\")","v":""},null,{"$f":"IF(AA1<>\"\",E3,\"\")","v":""},{"$f":"IF(AA1=\"\",\"\",\"Fav\")","v":""},{"$f":"IF(SUM(Y11:Y36)>0,SUM(Y11:Y36),\"\")","v":""},{"$f":"IF(AA1=\"\",\"\",IF(ISNA(CLEAN(TRIM((VLOOKUP(AA1,$Y$11:$Z$36,2,FALSE))))),\"\",CLEAN(TRIM((VLOOKUP(AA1,$Y$11:$Z$36,2,FALSE))))))","v":""},null,null,{"$f":"IF(U1<>\"\",IF(ISNA(VLOOKUP(AB1,Data!$C$3:$E$5,2,FALSE)),\"\",(VLOOKUP(AB1,Data!$C$3:$E$5,2,FALSE))),\"\")","v":""},{"$f":"IF(U1<>\"\",IF(ISNA(VLOOKUP(AB1,Data!$C$3:$E$5,1,FALSE)),\"\",(VLOOKUP(AB1,Data!$C$3:$E$5,3,FALSE))),\"\")","v":""}]
[null,"Race Venue",null,"Race Code","1st Race No","Last Race No",{"$nulls":6},"WT",null,"Min Price",{"$nulls":7},{"$f":"IF(AA2<>\"\",B3,\"\")","v":""},null,{"$f":"IF(AA2<>\"\",E3,\"\")","v":""},{"$f":"IF(AA2=\"\",\"\",\"CP/FR\")","v":""},{"$f":"IF(SUM(Y41:Y67)>0,SUM(Y41:Y67),\"\")","v":""},{"$f":"IF(AA2=\"\",\"\",IF(ISNA(CLEAN(TRIM((VLOOKUP(AA2,$Y$41:$Z$65,2,FALSE))))),\"\",(CLEAN(TRIM((VLOOKUP(AA2,$Y$41:$Z$65,2,FALSE)))))))","v":""},null,null,{"$f":"IF(U1<>\"\",IF(ISNA(VLOOKUP(AB2,Data!$C$3:$E$5,2,FALSE)),\"\",(VLOOKUP(AB2,Data!$C$3:$E$5,2,FALSE))),\"\")","v":""},{"$f":"IF(U1<>\"\",IF(ISNA(VLOOKUP(AB2,Data!$C$3:$E$5,1,FALSE)),\"\",(VLOOKUP(AB2,Data!$C$3:$E$5,3,FALSE))),\"\")","v":""}]
[null,"CANBERRA",null,{"$f":"IF(ISNA(VLOOKUP(B3,$AD$12:$AF$100,3,FALSE)),\"\",VLOOKUP(B3,$AD$12:$AF$100,3,FALSE))","v":"16399"},9,{"$f":"IF(ISNA(VLOOKUP(B3,Data!$F$2:'Data'!$U$100,16,FALSE)),\"\",VLOOKUP(B3,Data!$F$2:'Data'!$U$100,16,FALSE))","v":8},{"$nulls":6},2,null,2,{"$nulls":7},{"$f":"IF(AA3<>\"\",B3,\"\")","v":"CANBERRA"},null,{"$f":"IF(AA3<>\"\",E3,\"\")","v":9},{"$f":"IF(AA3<>\"\",AA39,\"\")","v":3.5},{"$f":"IF(AA39<O3,\"\",IF(AB39<>\"\",AB39,\"\"))","v":4},{"$f":"IF(AA3=\"\",\"\",IF(ISNA(CLEAN(TRIM((VLOOKUP(AA3,$B$36:$C$71,2,FALSE))))),\"\",(CLEAN(TRIM((VLOOKUP(AA3,$B$36:$C$71,2,FALSE)))))))","v":"Bush Brandy"},null,null,{"$f":"IF(U1<>\"\",IF(ISNA(VLOOKUP(AB3,Data!$C$3:$E$5,2,FALSE)),\"\",(VLOOKUP(AB3,Data!$C$3:$E$5,2,FALSE))),\"\")","v":""},{"$f":"IF(U1<>\"\",IF(ISNA(VLOOKUP(AB3,Data!$C$3:$E$5,1,FALSE)),\"\",(VLOOKUP(AB3,Data!$C$3:$E$5,3,FALSE))),\"\")","v":""}]
[]
[]
[]
[]
[null,{"$f":"B3","v":"CANBERRA"},null,"Race",{"$f":"E3","v":9}]
[null,null,{"$f":"LARGE(C11:C40,1)","v":164},null,{"$f":"LARGE(E11:E40,1)","v":10},{"$nulls":24},"Todays Venues"]
["TAB","HORSE","NR","HCP","CP","CF","TIM","SCR","JA","TA","JT","BP","WET","CRS","D","$","DLR",{"$nulls":5},"Unitab Rated",null,null,"Runner"]
[1," Hurriconi",145.5,null,9,26,1,0,20,5,13,14,0,16,8,14,20,{"$nulls":4},{"$f":"CLEAN(TRIM(B11))","v":"Hurriconi"},{"$f":"IF(ISNA(VLOOKUP(V11,Data!$A$1:'Data'!$B$200,2,FALSE)),\"\",(VLOOKUP(V11,Data!$A$1:'Data'!$B$200,2,FALSE)))","v":99},null,{"$f":"IF(W11=100,IF(C11=$C$9,A11,\"\"),\"\")","v":""},{"$f":"IF(Y11=\"\",\"\",CLEAN(TRIM(B11)))","v":""}]
[2," Paramount Pete",164,null,10,5,69,0,8,10,8,12,0,3,12,10,18,{"$nulls":4},{"$f":"CLEAN(TRIM(B12))","v":"Paramount Pete"},{"$f":"IF(ISNA(VLOOKUP(V12,Data!$A$1:'Data'!$B$200,2,FALSE)),\"\",(VLOOKUP(V12,Data!$A$1:'Data'!$B$200,2,FALSE)))","v":97},null,"",{"$f":"IF(Y12=\"\",\"\",CLEAN(TRIM(B12)))","v":""},null,null,null,{"$f":"IF(Data!F2=\"\",\"\",CLEAN(TRIM(Data!F2)))","v":"IPSWICH"},null,{"$f":"IF(ISNA(VLOOKUP(AD12,Data!$V$1:'Data'!$X$100,3,FALSE)),\"\",VLOOKUP(AD12,Data!$V$1:'Data'!$X$100,3,FALSE))","v":"16404"}]
[3," Poetic Justice",0,null,0,0,0,1,0,0,0,0,0,0,0,0,0,{"$nulls":4},"Poetic Justice",{"$f":"IF(ISNA(VLOOKUP(V13,Data!$A$1:'Data'!$B$200,2,FALSE)),\"\",(VLOOKUP(V13,Data!$A$1:'Data'!$B$200,2,FALSE)))","v":""},null,"","",null,null,null,{"$f":"IF(Data!F3=\"\",\"\",CLEAN(TRIM(Data!F3)))","v":"GRAFTON"},null,{"$f":"IF(ISNA(VLOOKUP(AD13,Data!$V$1:'Data'!$X$100,3,FALSE)),\"\",VLOOKUP(AD13,Data!$V$1:'Data'!$X$100,3,FALSE))","v":"16402"}]
[4," Bush Brandy",129,null,8,18,29,0,3,18,5,12,0,7,10,4,16,{"$nulls":4},"Bush Brandy",{"$f":"IF(ISNA(VLOOKUP(V14,Data!$A$1:'Data'!$B$200,2,FALSE)),\"\",(VLOOKUP(V14,Data!$A$1:'Data'!$B$200,2,FALSE)))","v":98},null,"","",null,null,null,{"$f":"IF(Data!F4=\"\",\"\",CLEAN(TRIM(Data!F4)))","v":"MORNINGTON"},null,{"$f":"IF(ISNA(VLOOKUP(AD14,Data!$V$1:'Data'!$X$100,3,FALSE)),\"\",VLOOKUP(AD14,Data!$V$1:'Data'!$X$100,3,FALSE))","v":"16405"}]
[5," Angelos Lucky Boy",74.5,null,10,4,1,0,3,3,3,12,0,4,7,14,15,{"$nulls":4},"Angelos Lucky Boy",{"$f":"IF(ISNA(VLOOKUP(V15,Data!$A$1:'Data'!$B$200,2,FALSE)),\"\",(VLOOKUP(V15,Data!$A$1:'Data'!$B$200,2,FALSE)))","v":100},null,"","",null,null,null,{"$f":"IF(Data!F5=\"\",\"\",CLEAN(TRIM(Data!F5)))","v":"CANBERRA"},null,{"$f":"IF(ISNA(VLOOKUP(AD15,Data!$V$1:'Data'!$X$100,3,FALSE)),\"\",VLOOKUP(AD15,Data!$V$1:'Data'!$X$100,3,FALSE))","v":"16399"}]
[6," High Time",75,null,3,1,1,0,8,3,5,10,0,7,15,8,15,{"$nulls":4},"High Time",{"$f":"IF(ISNA(VLOOKUP(V16,Data!$A$1:'Data'!$B$200,2,FALSE)),\"\",(VLOOKUP(V16,Data!$A$1:'Data'!$B$200,2,FALSE)))","v":98},null,"","",null,null,null,{"$f":"IF(Data!F6=\"\",\"\",CLEAN(TRIM(Data!F6)))","v":"KRANJI"},null,{"$f":"IF(ISNA(VLOOKUP(AD16,Data!$V$1:'Data'!$X$100,3,FALSE)),\"\",VLOOKUP(AD16,Data!$V$1:'Data'!$X$100,3,FALSE))","v":"16411"}]
[7," Pin The Tail",61.5,null,1,0,1,0,8,8,8,12,0,9,8,7,1,{"$nulls":4},"Pin The Tail",{"$f":"IF(ISNA(VLOOKUP(V17,Data!$A$1:'Data'!$B$200,2,FALSE)),\"\",(VLOOKUP(V17,Data!$A$1:'Data'!$B$200,2,FALSE)))","v":79},null,"","",null,null,null,{"$f":"IF(Data!F7=\"\",\"\",CLEAN(TRIM(Data!F7)))","v":"FAIRVIEW"},null,{"$f":"IF(ISNA(VLOOKUP(AD17,Data!$V$1:'Data'!$X$100,3,FALSE)),\"\",VLOOKUP(AD17,Data!$V$1:'Data'!$X$100,3,FALSE))","v":"16390"}]
[8," Acquest",84.5,null,8,4,8,0,8,3,3,10,0,6,4,16,16,{"$nulls":4},"Acquest",{"$f":"IF(ISNA(VLOOKUP(V18,Data!$A$1:'Data'!$B$200,2,FALSE)),\"\",(VLOOKUP(V18,Data!$A$1:'Data'!$B$200,2,FALSE)))","v":96},null,"","",null,null,null,{"$f":"IF(Data!F8=\"\",\"\",CLEAN(TRIM(Data!F8)))","v":"NEWCASTLE"},null,{"$f":"IF(ISNA(VLOOKUP(AD18,Data!$V$1:'Data'!$X$100,3,FALSE)),\"\",VLOOKUP(AD18,Data!$V$1:'Data'!$X$100,3,FALSE))","v":""}]
[9," Murials Spirit",129.5,null,7,18,6,0,18,20,10,13,0,4,7,11,16,{"$nulls":4},"Murials Spirit",{"$f":"IF(ISNA(VLOOKUP(V19,Data!$A$1:'Data'!$B$200,2,FALSE)),\"\",(VLOOKUP(V19,Data!$A$1:'Data'!$B$200,2,FALSE)))","v":99},null,"","",null,null,null,{"$f":"IF(Data!F9=\"\",\"\",CLEAN(TRIM(Data!F9)))","v":"ENGLAND"},null,{"$f":"IF(ISNA(VLOOKUP(AD19,Data!$V$1:'Data'!$X$100,3,FALSE)),\"\",VLOOKUP(AD19,Data!$V$1:'Data'!$X$100,3,FALSE))","v":""}]
[10," Red River",96,null,8,7,4,0,5,20,10,12,0,7,2,5,16,{"$nulls":4},"Red River",{"$f":"IF(ISNA(VLOOKUP(V20,Data!$A$1:'Data'!$B$200,2,FALSE)),\"\",(VLOOKUP(V20,Data!$A$1:'Data'!$B$200,2,FALSE)))","v":96},null,"","",null,null,null,{"$f":"IF(Data!F10=\"\",\"\",CLEAN(TRIM(Data!F10)))","v":"WINGATUI"},null,{"$f":"IF(ISNA(VLOOKUP(AD20,Data!$V$1:'Data'!$X$100,3,FALSE)),\"\",VLOOKUP(AD20,Data!$V$1:'Data'!$X$100,3,FALSE))","v":"16413"}]
[11," Lady Mystic",59.5,null,4,3,1,0,3,3,3,12,0,3,5,9,15,{"$nulls":4},"Lady Mystic",{"$f":"IF(ISNA(VLOOKUP(V21,Data!$A$1:'Data'!$B$200,2,FALSE)),\"\",(VLOOKUP(V21,Data!$A$1:'Data'!$B$200,2,FALSE)))","v":95},null,"","",null,null,null,{"$f":"IF(Data!F11=\"\",\"\",CLEAN(TRIM(Data!F11)))","v":""},null,{"$f":"IF(ISNA(VLOOKUP(AD21,Data!$V$1:'Data'!$X$100,3,FALSE)),\"\",VLOOKUP(AD21,Data!$V$1:'Data'!$X$100,3,FALSE))","v":""}]
[12," Savvy Miss",0,null,0,0,0,1,0,0,0,0,0,0,0,0,0,{"$nulls":4},"Savvy Miss",{"$f":"IF(ISNA(VLOOKUP(V22,Data!$A$1:'Data'!$B$200,2,FALSE)),\"\",(VLOOKUP(V22,Data!$A$1:'Data'!$B$200,2,FALSE)))","v":""},null,"","",null,null,null,{"$f":"IF(Data!F12=\"\",\"\",CLEAN(TRIM(Data!F12)))","v":"BANKSTOWN"},null,{"$f":"IF(ISNA(VLOOKUP(AD22,Data!$V$1:'Data'!$X$100,3,FALSE)),\"\",VLOOKUP(AD22,Data!$V$1:'Data'!$X$100,3,FALSE))","v":""}]
[13," Dexter'S Angel",59.5,null,3,3,4,0,8,3,8,13,0,3,2,4,10,{"$nulls":4},"Dexter'S Angel",{"$f":"IF(ISNA(VLOOKUP(V23,Data!$A$1:'Data'!$B$200,2,FALSE)),\"\",(VLOOKUP(V23,Data!$A$1:'Data'!$B$200,2,FALSE)))","v":92},null,"","",null,null,null,{"$f":"IF(Data!F13=\"\",\"\",CLEAN(TRIM(Data!F13)))","v":"MELTON"},null,{"$f":"IF(ISNA(VLOOKUP(AD23,Data!$V$1:'Data'!$X$100,3,FALSE)),\"\",VLOOKUP(AD23,Data!$V$1:'Data'!$X$100,3,FALSE))","v":""}]
[14," Konedobu",69,null,7,0,1,0,5,3,8,11,0,18,9,7,1,{"$nulls":4},"Konedobu",{"$f":"IF(ISNA(VLOOKUP(V24,Data!$A$1:'Data'!$B$200,2,FALSE)),\"\",(VLOOKUP(V24,Data!$A$1:'Data'!$B$200,2,FALSE)))","v":92},null,"","",null,null,null,{"$f":"IF(Data!F14=\"\",\"\",CLEAN(TRIM(Data!F14)))","v":"GOLD COAST"},null,{"$f":"IF(ISNA(VLOOKUP(AD24,Data!$V$1:'Data'!$X$100,3,FALSE)),\"\",VLOOKUP(AD24,Data!$V$1:'Data'!$X$100,3,FALSE))","v":""}]
[15," Planet Ice",81.5,null,3,1,3,0,8,8,8,11,0,7,16,9,9,{"$nulls":7},"","",null,null,null,{"$f":"IF(Data!F15=\"\",\"\",CLEAN(TRIM(Data!F15)))","v":"BATHURST"},null,{"$f":"IF(ISNA(VLOOKUP(AD25,Data!$V$1:'Data'!$X$100,3,FALSE)),\"\",VLOOKUP(AD25,Data!$V$1:'Data'!$X$100,3,FALSE))","v":""}]
[{"$nulls":24},"","",null,null,null,{"$f":"IF(Data!F16=\"\",\"\",CLEAN(TRIM(Data!F16)))","v":"MILDURA"},null,{"$f":"IF(ISNA(VLOOKUP(AD26,Data!$V$1:'Data'!$X$100,3,FALSE)),\"\",VLOOKUP(AD26,Data!$V$1:'Data'!$X$100,3,FALSE))","v":""}]
[{"$nulls":24},"","",null,null,null,{"$f":"IF(Data!F17=\"\",\"\",CLEAN(TRIM(Data!F17)))","v":"GLOBE DERBY"},null,{"$f":"IF(ISNA(VLOOKUP(AD27,Data!$V$1:'Data'!$X$100,3,FALSE)),\"\",VLOOKUP(AD27,Data!$V$1:'Data'!$X$100,3,FALSE))","v":""}]
[{"$nulls":24},"","",null,null,null,{"$f":"IF(Data!F18=\"\",\"\",CLEAN(TRIM(Data!F18)))","v":"GLOUCESTER PARK"},null,{"$f":"IF(ISNA(VLOOKUP(AD28,Data!$V$1:'Data'!$X$100,3,FALSE)),\"\",VLOOKUP(AD28,Data!$V$1:'Data'!$X$100,3,FALSE))","v":""}]
[{"$nulls":24},"","",null,null,null,{"$f":"IF(Data!F19=\"\",\"\",CLEAN(TRIM(Data!F19)))","v":"ALEXANDRA PARK"},null,{"$f":"IF(ISNA(VLOOKUP(AD29,Data!$V$1:'Data'!$X$100,3,FALSE)),\"\",VLOOKUP(AD29,Data!$V$1:'Data'!$X$100,3,FALSE))","v":""}]
[{"$nulls":24},"","",null,null,null,{"$f":"IF(Data!F20=\"\",\"\",CLEAN(TRIM(Data!F20)))","v":""},null,{"$f":"IF(ISNA(VLOOKUP(AD30,Data!$V$1:'Data'!$X$100,3,FALSE)),\"\",VLOOKUP(AD30,Data!$V$1:'Data'!$X$100,3,FALSE))","v":""}]
[{"$nulls":24},"","",null,null,null,{"$f":"IF(Data!F21=\"\",\"\",CLEAN(TRIM(Data!F21)))","v":"ALBION PARK"},null,{"$f":"IF(ISNA(VLOOKUP(AD31,Data!$V$1:'Data'!$X$100,3,FALSE)),\"\",VLOOKUP(AD31,Data!$V$1:'Data'!$X$100,3,FALSE))","v":""}]
[{"$nulls":24},"","",null,null,null,{"$f":"IF(Data!F22=\"\",\"\",CLEAN(TRIM(Data!F22)))","v":"WENTWORTH PARK"},null,{"$f":"IF(ISNA(VLOOKUP(AD32,Data!$V$1:'Data'!$X$100,3,FALSE)),\"\",VLOOKUP(AD32,Data!$V$1:'Data'!$X$100,3,FALSE))","v":""}]
[{"$nulls":24},"","",null,null,null,{"$f":"IF(Data!F23=\"\",\"\",CLEAN(TRIM(Data!F23)))","v":"BALLARAT"},null,{"$f":"IF(ISNA(VLOOKUP(AD33,Data!$V$1:'Data'!$X$100,3,FALSE)),\"\",VLOOKUP(AD33,Data!$V$1:'Data'!$X$100,3,FALSE))","v":"16421"}]
[{"$nulls":24},"","",null,null,null,{"$f":"IF(Data!F24=\"\",\"\",CLEAN(TRIM(Data!F24)))","v":"THE GARDENS"},null,{"$f":"IF(ISNA(VLOOKUP(AD34,Data!$V$1:'Data'!$X$100,3,FALSE)),\"\",VLOOKUP(AD34,Data!$V$1:'Data'!$X$100,3,FALSE))","v":""}]
[{"$nulls":24},"","",null,null,null,{"$f":"IF(Data!F25=\"\",\"\",CLEAN(TRIM(Data!F25)))","v":"TRARALGON"},null,{"$f":"IF(ISNA(VLOOKUP(AD35,Data!$V$1:'Data'!$X$100,3,FALSE)),\"\",VLOOKUP(AD35,Data!$V$1:'Data'!$X$100,3,FALSE))","v":""}]
[{"$nulls":24},"","",null,null,null,{"$f":"IF(Data!F26=\"\",\"\",CLEAN(TRIM(Data!F26)))","v":"CASINO"},null,{"$f":"IF(ISNA(VLOOKUP(AD36,Data!$V$1:'Data'!$X$100,3,FALSE)),\"\",VLOOKUP(AD36,Data!$V$1:'Data'!$X$100,3,FALSE))","v":""}]
[]
[]
[{"$nulls":14},{"$f":"LARGE(O41:O70,1)","v":34},{"$nulls":11},{"$f":"SMALL(R41:R70,1)","v":3.5},{"$f":"LARGE(AB41:AB71,1)","v":4}]
["INC","TAB","HORSE","RFS","DLS","12m","BRR","SCR","FORM","COND","CONS","BP","JOCK","JC","FR","EM","PER","DIV","DInc",null,null,null,"Barrier",null,null,"Runner"]
[null,1," Hurriconi ",5,8,33,null,0,{"$nulls":5},0,29,5,4,26,null,null,null,{"$f":"CLEAN(TRIM(C41))","v":"Hurriconi"},{"$f":"IF(V41=\"\",\"\",IF(ISNA(VLOOKUP(V41,Data!$A$1:'Data'!$C$200,3,FALSE)),\"\",(VLOOKUP(V41,Data!$A$1:'Data'!$C$200,3,FALSE))))","v":6},null,{"$f":"IF(W41=\"\",\"\",IF(W41>4,IF(AND(E11=$E$9,O41=$O$39),B41,\"\"),\"\"))","v":""},{"$f":"IF(Y41=\"\",\"\",CLEAN(TRIM(C41)))","v":""},{"$f":"IF(R41=$AA$39,R41,\"\")","v":""},{"$f":"IF(AA41<>\"\",B41,\"\")","v":""}]
[null,2," Paramount Pete ",7,9,35,null,0,{"$nulls":5},0,27,7,1.43,71,null,null,null,{"$f":"CLEAN(TRIM(C42))","v":"Paramount Pete"},{"$f":"IF(V42=\"\",\"\",IF(ISNA(VLOOKUP(V42,Data!$A$1:'Data'!$C$200,3,FALSE)),\"\",(VLOOKUP(V42,Data!$A$1:'Data'!$C$200,3,FALSE))))","v":5},null,{"$f":"IF(W42=\"\",\"\",IF(W42>4,IF(AND(E12=$E$9,O42=$O$39),B42,\"\"),\"\"))","v":""},{"$f":"IF(Y42=\"\",\"\",CLEAN(TRIM(C42)))","v":""},{"$f":"IF(R42=$AA$39,R42,\"\")","v":""},{"$f":"IF(AA42<>\"\",B42,\"\")","v":""}]
[null,3," Poetic Justice ",6,7,36.5,null,1,{"$nulls":5},0,null,null,null,"scr",null,null,null,"Poetic Justice",{"$f":"IF(V43=\"\",\"\",IF(ISNA(VLOOKUP(V43,Data!$A$1:'Data'!$C$200,3,FALSE)),\"\",(VLOOKUP(V43,Data!$A$1:'Data'!$C$200,3,FALSE))))","v":""},null,"","","",""]
[null,4," Bush Brandy ",3,14,31.5,null,0,{"$nulls":5},1.5,34,0,28.57,3.5,null,null,null,"Bush Brandy",{"$f":"IF(V44=\"\",\"\",IF(ISNA(VLOOKUP(V44,Data!$A$1:'Data'!$C$200,3,FALSE)),\"\",(VLOOKUP(V44,Data!$A$1:'Data'!$C$200,3,FALSE))))","v":9},null,"","",3.5,4]
[null,5," Angelos Lucky Boy ",3,19,30.5,null,0,{"$nulls":5},0,32.5,1.5,19.14,5,null,null,null,"Angelos Lucky Boy",{"$f":"IF(V45=\"\",\"\",IF(ISNA(VLOOKUP(V45,Data!$A$1:'Data'!$C$200,3,FALSE)),\"\",(VLOOKUP(V45,Data!$A$1:'Data'!$C$200,3,FALSE))))","v":3},null,"","","",""]
[null,6," High Time ",6,21,33,null,0,{"$nulls":5},0,27.5,6.5,1.71,61,null,null,null,"High Time",{"$f":"IF(V46=\"\",\"\",IF(ISNA(VLOOKUP(V46,Data!$A$1:'Data'!$C$200,3,FALSE)),\"\",(VLOOKUP(V46,Data!$A$1:'Data'!$C$200,3,FALSE))))","v":13},null,"","","",""]
[null,7," Pin The Tail ","FU ",264,5,null,0,{"$nulls":5},0,1,33,0.28999999999999998,301,null,null,null,"Pin The Tail",{"$f":"IF(V47=\"\",\"\",IF(ISNA(VLOOKUP(V47,Data!$A$1:'Data'!$C$200,3,FALSE)),\"\",(VLOOKUP(V47,Data!$A$1:'Data'!$C$200,3,FALSE))))","v":11},null,"","","",""]
[null,8," Acquest ",4,14,31,null,0,{"$nulls":5},0,28,6,2.29,41,null,null,null,"Acquest",{"$f":"IF(V48=\"\",\"\",IF(ISNA(VLOOKUP(V48,Data!$A$1:'Data'!$C$200,3,FALSE)),\"\",(VLOOKUP(V48,Data!$A$1:'Data'!$C$200,3,FALSE))))","v":2},null,"","","",""]
[null,9," Murials Spirit ",5,14,31.5,null,0,{"$nulls":5},3,33.5,0.5,25.71,3.9,null,null,null,"Murials Spirit",{"$f":"IF(V49=\"\",\"\",IF(ISNA(VLOOKUP(V49,Data!$A$1:'Data'!$C$200,3,FALSE)),\"\",(VLOOKUP(V49,Data!$A$1:'Data'!$C$200,3,FALSE))))","v":7},null,"","","",""]
[null,10," Red River ",3,14,32,null,0,{"$nulls":5},0,28,6,2.29,41,null,null,null,"Red River",{"$f":"IF(V50=\"\",\"\",IF(ISNA(VLOOKUP(V50,Data!$A$1:'Data'!$C$200,3,FALSE)),\"\",(VLOOKUP(V50,Data!$A$1:'Data'!$C$200,3,FALSE))))","v":4},null,"",{"$f":"IF(Y50=\"\",\"\",CLEAN(TRIM(C50)))","v":""},"",""]
[null,11," Lady Mystic ","SU ",21,32,null,0,{"$nulls":5},0,27.5,6.5,1.71,61,null,null,null,"Lady Mystic",{"$f":"IF(V51=\"\",\"\",IF(ISNA(VLOOKUP(V51,Data!$A$1:'Data'!$C$200,3,FALSE)),\"\",(VLOOKUP(V51,Data!$A$1:'Data'!$C$200,3,FALSE))))","v":14},null,"","","",""]
[null,12," Savvy Miss ",6,20,33.5,null,1,{"$nulls":5},0,null,null,null,"scr",null,null,null,"Savvy Miss",{"$f":"IF(V52=\"\",\"\",IF(ISNA(VLOOKUP(V52,Data!$A$1:'Data'!$C$200,3,FALSE)),\"\",(VLOOKUP(V52,Data!$A$1:'Data'!$C$200,3,FALSE))))","v":""},null,"","","",""]
[null,13," Dexter'S Angel ",8,41,28.5,null,0,{"$nulls":5},0,26,8,0.86,101,null,null,null,"Dexter'S Angel",{"$f":"IF(V53=\"\",\"\",IF(ISNA(VLOOKUP(V53,Data!$A$1:'Data'!$C$200,3,FALSE)),\"\",(VLOOKUP(V53,Data!$A$1:'Data'!$C$200,3,FALSE))))","v":8},null,"","","",""]
[null,14," Konedobu ","FU ",84,35,null,0,{"$nulls":5},0,27,7,1.43,71,null,null,null,"Konedobu",{"$f":"IF(V54=\"\",\"\",IF(ISNA(VLOOKUP(V54,Data!$A$1:'Data'!$C$200,3,FALSE)),\"\",(VLOOKUP(V54,Data!$A$1:'Data'!$C$200,3,FALSE))))","v":10},null,"","","",""]
[null,15," Planet Ice ",9,44,36,null,0,{"$nulls":5},0,20,14,0.28999999999999998,301,null,null,null,"Planet Ice",{"$f":"IF(V55=\"\",\"\",IF(ISNA(VLOOKUP(V55,Data!$A$1:'Data'!$C$200,3,FALSE)),\"\",(VLOOKUP(V55,Data!$A$1:'Data'!$C$200,3,FALSE))))","v":12},null,"",{"$f":"IF(Y55=\"\",\"\",CLEAN(TRIM(C55)))","v":""},"",""]
[{"$nulls":6},"Clear","Clear","Clear","Clear","Clear","Clear",{"$nulls":9},"",{"$f":"IF(V56=\"\",\"\",IF(ISNA(VLOOKUP(V56,Data!$A$1:'Data'!$C$200,3,FALSE)),\"\",(VLOOKUP(V56,Data!$A$1:'Data'!$C$200,3,FALSE))))","v":""},null,"","","",""]
[{"$nulls":21},"",{"$f":"IF(V57=\"\",\"\",IF(ISNA(VLOOKUP(V57,Data!$A$1:'Data'!$C$200,3,FALSE)),\"\",(VLOOKUP(V57,Data!$A$1:'Data'!$C$200,3,FALSE))))","v":""},null,"","","",""]
[{"$nulls":21},"",{"$f":"IF(V58=\"\",\"\",IF(ISNA(VLOOKUP(V58,Data!$A$1:'Data'!$C$200,3,FALSE)),\"\",(VLOOKUP(V58,Data!$A$1:'Data'!$C$200,3,FALSE))))","v":""},null,"","","",""]
[{"$nulls":21},"",{"$f":"IF(V59=\"\",\"\",IF(ISNA(VLOOKUP(V59,Data!$A$1:'Data'!$C$200,3,FALSE)),\"\",(VLOOKUP(V59,Data!$A$1:'Data'!$C$200,3,FALSE))))","v":""},null,"","","",""]
[{"$nulls":21},"",{"$f":"IF(V60=\"\",\"\",IF(ISNA(VLOOKUP(V60,Data!$A$1:'Data'!$C$200,3,FALSE)),\"\",(VLOOKUP(V60,Data!$A$1:'Data'!$C$200,3,FALSE))))","v":""},null,"","","",""]
[{"$nulls":21},"",{"$f":"IF(V61=\"\",\"\",IF(ISNA(VLOOKUP(V61,Data!$A$1:'Data'!$C$200,3,FALSE)),\"\",(VLOOKUP(V61,Data!$A$1:'Data'!$C$200,3,FALSE))))","v":""},null,"","","",""]
[{"$nulls":21},"",{"$f":"IF(V62=\"\",\"\",IF(ISNA(VLOOKUP(V62,Data!$A$1:'Data'!$C$200,3,FALSE)),\"\",(VLOOKUP(V62,Data!$A$1:'Data'!$C$200,3,FALSE))))","v":""},null,"","","",""]
[{"$nulls":21},"",{"$f":"IF(V63=\"\",\"\",IF(ISNA(VLOOKUP(V63,Data!$A$1:'Data'!$C$200,3,FALSE)),\"\",(VLOOKUP(V63,Data!$A$1:'Data'!$C$200,3,FALSE))))","v":""},null,"","","",""]
[{"$nulls":21},"",{"$f":"IF(V64=\"\",\"\",IF(ISNA(VLOOKUP(V64,Data!$A$1:'Data'!$C$200,3,FALSE)),\"\",(VLOOKUP(V64,Data!$A$1:'Data'!$C$200,3,FALSE))))","v":""},null,"",{"$f":"IF(Y64=\"\",\"\",CLEAN(TRIM(C64)))","v":""},"",""]
[{"$nulls":21},"",{"$f":"IF(V65=\"\",\"\",IF(ISNA(VLOOKUP(V65,Data!$A$1:'Data'!$C$200,3,FALSE)),\"\",(VLOOKUP(V65,Data!$A$1:'Data'!$C$200,3,FALSE))))","v":""},null,"","","",""]
[{"$nulls":21},"",{"$f":"IF(V66=\"\",\"\",IF(ISNA(VLOOKUP(V66,Data!$A$1:'Data'!$C$200,3,FALSE)),\"\",(VLOOKUP(V66,Data!$A$1:'Data'!$C$200,3,FALSE))))","v":""},null,"","","",""]
[{"$nulls":24},"","","",""]
[{"$nulls":24},"","","",""]

{"sheet":"Data","index":1,"n_rows":45,"n_cols":24,"rows_kept":45,"cut":false,"hidden":false,"merged":[]}
[{"$f":"Neurals!B3","v":"CANBERRA"},{"$f":"Neurals!E3","v":9},{"$f":"Neurals!U1","v":"Paying"},null,"2011-04-01",null,{"$f":"IF(ISNA(VLOOKUP(A1,F2:Q40,B1+2,FALSE)),\"\",VLOOKUP(A1,F2:Q40,B1+2,FALSE))","v":""},{"$nulls":14},{"$f":"IF(W1<>\"\",IF(ISERROR(CLEAN(TRIM((LEFT(Meetings!W1,FIND(\"-\",Meetings!W1,1)-1))))),CLEAN(TRIM(Meetings!W1)),CLEAN(TRIM(LEFT(Meetings!W1,FIND(\"-\",Meetings!W1,1)-1)))),\"\")","v":""},{"$f":"IF(Meetings!W1=\"\",\"\",getAddress(Meetings!W1))","v":""},{"$f":"IF(W1=\"\",\"\",RIGHT(W1,LEN(W1)-FIND(\"=\",W1,1)))","v":""}]
[{"$nulls":5},{"$f":"IF(G2=\"\",\"\",IF(ISERROR(CLEAN(TRIM((LEFT(G2,FIND(\"(\",G2,1)-1))))),\"\",CLEAN(TRIM(LEFT(G2,FIND(\"(\",G2,1)-1)))))","v":"IPSWICH"},{"$f":"IF(Meetings!B3=\"\",\"\",Meetings!B3)","v":"IPSWICH (BR)"},{"$f":"IF(Meetings!D3=\"\",\"\",getAddress(Meetings!D3))","v":"http://www.tabonline.com.au/2011/04/01/BR01.html"},{"$f":"IF(Meetings!E3=\"\",\"\",getAddress(Meetings!E3))","v":"http://www.tabonline.com.au/2011/04/01/BR02.html"},{"$f":"IF(Meetings!F3=\"\",\"\",getAddress(Meetings!F3))","v":"http://www.tabonline.com.au/2011/04/01/BR03.html"},{"$f":"IF(Meetings!G3=\"\",\"\",getAddress(Meetings!G3))","v":"http://www.tabonline.com.au/2011/04/01/BR04.html"},{"$f":"IF(Meetings!H3=\"\",\"\",getAddress(Meetings!H3))","v":"http://www.tabonline.com.au/2011/04/01/BR05.html"},{"$f":"IF(Meetings!I3=\"\",\"\",getAddress(Meetings!I3))","v":"http://www.tabonline.com.au/2011/04/01/BR06.html"},{"$f":"IF(Meetings!J3=\"\",\"\",getAddress(Meetings!J3))","v":"http://www.tabonline.com.au/2011/04/01/BR07.html"},{"$f":"IF(Meetings!K3=\"\",\"\",getAddress(Meetings!K3))","v":""},{"$f":"IF(Meetings!L3=\"\",\"\",getAddress(Meetings!L3))","v":""},{"$f":"IF(Meetings!M3=\"\",\"\",getAddress(Meetings!M3))","v":""},{"$f":"IF(Meetings!N3=\"\",\"\",getAddress(Meetings!N3))","v":""},{"$f":"IF(Meetings!O3=\"\",\"\",getAddress(Meetings!O3))","v":""},null,{"$f":"COUNTA(Meetings!D3:'Meetings'!O3)","v":7},{"$f":"IF(W2<>\"\",IF(ISERROR(CLEAN(TRIM((LEFT(Meetings!W2,FIND(\"-\",Meetings!W2,1)-1))))),CLEAN(TRIM(Meetings!W2)),CLEAN(TRIM(LEFT(Meetings!W2,FIND(\"-\",Meetings!W2,1)-1)))),\"\")","v":""},{"$f":"IF(Meetings!W2=\"\",\"\",getAddress(Meetings!W2))","v":""},{"$f":"IF(W2=\"\",\"\",RIGHT(W2,LEN(W2)-FIND(\"=\",W2,1)))","v":""}]
[{"$f":"IF(Race!N1<>\"\",(CLEAN(TRIM(Race!C1))),\"\")","v":""},{"$f":"IF(A3<>\"\",Race!I1,\"\")","v":""},{"$f":"IF($C$1<>\"\",CLEAN(TRIM(INDEX(Race!$A$1:$C20,MATCH(\"QN\",Race!$A1:$A$20,0)-4,3))),\"\")","v":"PARAMOUNT PETE"},{"$f":"IF(ISNA(VLOOKUP(C3,Race!$C$2:$E$15,2,FALSE)),\"\",(VLOOKUP(C3,Race!$C$2:$E$15,2,FALSE)))","v":10.7},{"$f":"IF(ISNA(VLOOKUP(C3,Race!$C$2:$E$15,3,FALSE)),\"\",(VLOOKUP(C3,Race!$C$2:$E$15,3,FALSE)))","v":3.3},{"$f":"IF(G3=\"\",\"\",IF(ISERROR(CLEAN(TRIM((LEFT(G3,FIND(\"(\",G3,1)-1))))),\"\",CLEAN(TRIM(LEFT(G3,FIND(\"(\",G3,1)-1)))))","v":"GRAFTON"},{"$f":"IF(Meetings!B4=\"\",\"\",Meetings!B4)","v":"GRAFTON (NR)"},{"$f":"IF(Meetings!D4=\"\",\"\",getAddress(Meetings!D4))","v":"http://www.tabonline.com.au/2011/04/01/NR01.html"},{"$f":"IF(Meetings!E4=\"\",\"\",getAddress(Meetings!E4))","v":"http://www.tabonline.com.au/2011/04/01/NR02.html"},{"$f":"IF(Meetings!F4=\"\",\"\",getAddress(Meetings!F4))","v":"http://www.tabonline.com.au/2011/04/01/NR03.html"},{"$f":"IF(Meetings!G4=\"\",\"\",getAddress(Meetings!G4))","v":"http://www.tabonline.com.au/2011/04/01/NR04.html"},{"$f":"IF(Meetings!H4=\"\",\"\",getAddress(Meetings!H4))","v":"http://www.tabonline.com.au/2011/04/01/NR05.html"},{"$f":"IF(Meetings!I4=\"\",\"\",getAddress(Meetings!I4))","v":"http://www.tabonline.com.au/2011/04/01/NR06.html"},{"$f":"IF(Meetings!J4=\"\",\"\",getAddress(Meetings!J4))","v":"http://www.tabonline.com.au/2011/04/01/NR07.html"},{"$f":"IF(Meetings!K4=\"\",\"\",getAddress(Meetings!K4))","v":"http://www.tabonline.com.au/2011/04/01/NR08.html"},{"$f":"IF(Meetings!L4=\"\",\"\",getAddress(Meetings!L4))","v":"http://www.tabonline.com.au/2011/04/01/NR09.html"},{"$f":"IF(Meetings!M4=\"\",\"\",getAddress(Meetings!M4))","v":"http://www.tabonline.com.au/2011/04/01/NR10.html"},{"$f":"IF(Meetings!N4=\"\",\"\",getAddress(Meetings!N4))","v":""},{"$f":"IF(Meetings!O4=\"\",\"\",getAddress(Meetings!O4))","v":""},null,{"$f":"COUNTA(Meetings!D4:'Meetings'!O4)","v":10},{"$f":"IF(W3<>\"\",IF(ISERROR(CLEAN(TRIM((LEFT(Meetings!W3,FIND(\"-\",Meetings!W3,1)-1))))),CLEAN(TRIM(Meetings!W3)),CLEAN(TRIM(LEFT(Meetings!W3,FIND(\"-\",Meetings!W3,1)-1)))),\"\")","v":""},{"$f":"IF(Meetings!W3=\"\",\"\",getAddress(Meetings!W3))","v":""},""]
[{"$f":"IF(Race!N2<>\"\",(CLEAN(TRIM(Race!C2))),\"\")","v":""},{"$f":"IF(A4<>\"\",Race!N2,\"\")","v":""},{"$f":"IF($C$1<>\"\",CLEAN(TRIM(INDEX(Race!$A$1:$C21,MATCH(\"QN\",Race!$A2:$A$20,0)-2,3))),\"\")","v":"HURRICONI"},{"$f":"IF(ISNA(VLOOKUP(C4,Race!$C$2:$E$15,2,FALSE)),\"\",(VLOOKUP(C4,Race!$C$2:$E$15,2,FALSE)))","v":0},{"$f":"IF(ISNA(VLOOKUP(C4,Race!$C$2:$E$15,3,FALSE)),\"\",(VLOOKUP(C4,Race!$C$2:$E$15,3,FALSE)))","v":2},"MORNINGTON",{"$f":"IF(Meetings!B5=\"\",\"\",Meetings!B5)","v":"MORNINGTON (VR)"},{"$f":"IF(Meetings!D5=\"\",\"\",getAddress(Meetings!D5))","v":"http://www.tabonline.com.au/2011/04/01/VR01.html"},{"$f":"IF(Meetings!E5=\"\",\"\",getAddress(Meetings!E5))","v":"http://www.tabonline.com.au/2011/04/01/VR02.html"},{"$f":"IF(Meetings!F5=\"\",\"\",getAddress(Meetings!F5))","v":"http://www.tabonline.com.au/2011/04/01/VR03.html"},{"$f":"IF(Meetings!G5=\"\",\"\",getAddress(Meetings!G5))","v":"http://www.tabonline.com.au/2011/04/01/VR04.html"},{"$f":"IF(Meetings!H5=\"\",\"\",getAddress(Meetings!H5))","v":"http://www.tabonline.com.au/2011/04/01/VR05.html"},{"$f":"IF(Meetings!I5=\"\",\"\",getAddress(Meetings!I5))","v":"http://www.tabonline.com.au/2011/04/01/VR06.html"},{"$f":"IF(Meetings!J5=\"\",\"\",getAddress(Meetings!J5))","v":"http://www.tabonline.com.au/2011/04/01/VR07.html"},{"$f":"IF(Meetings!K5=\"\",\"\",getAddress(Meetings!K5))","v":"http://www.tabonline.com.au/2011/04/01/VR08.html"},{"$f":"IF(Meetings!L5=\"\",\"\",getAddress(Meetings!L5))","v":"http://www.tabonline.com.au/2011/04/01/VR09.html"},{"$f":"IF(Meetings!M5=\"\",\"\",getAddress(Meetings!M5))","v":""},{"$f":"IF(Meetings!N5=\"\",\"\",getAddress(Meetings!N5))","v":""},{"$f":"IF(Meetings!O5=\"\",\"\",getAddress(Meetings!O5))","v":""},null,{"$f":"COUNTA(Meetings!D5:'Meetings'!O5)","v":9},{"$f":"IF(W4<>\"\",IF(ISERROR(CLEAN(TRIM((LEFT(Meetings!W4,FIND(\"-\",Meetings!W4,1)-1))))),CLEAN(TRIM(Meetings!W4)),CLEAN(TRIM(LEFT(Meetings!W4,FIND(\"-\",Meetings!W4,1)-1)))),\"\")","v":""},{"$f":"IF(Meetings!W4=\"\",\"\",getAddress(Meetings!W4))","v":""},""]
[{"$f":"IF(Race!N3<>\"\",(CLEAN(TRIM(Race!C3))),\"\")","v":""},{"$f":"IF(A5<>\"\",Race!N3,\"\")","v":""},{"$f":"IF($C$1<>\"\",CLEAN(TRIM(INDEX(Race!$A$1:$C22,MATCH(\"QN\",Race!$A3:$A$20,0)-0,3))),\"\")","v":"RED RIVER"},{"$f":"IF(ISNA(VLOOKUP(C5,Race!$C$2:$E$15,2,FALSE)),\"\",(VLOOKUP(C5,Race!$C$2:$E$15,2,FALSE)))","v":0},{"$f":"IF(ISNA(VLOOKUP(C5,Race!$C$2:$E$15,3,FALSE)),\"\",(VLOOKUP(C5,Race!$C$2:$E$15,3,FALSE)))","v":2.2000000000000002},"CANBERRA",{"$f":"IF(Meetings!B6=\"\",\"\",Meetings!B6)","v":"CANBERRA (CR)"},{"$f":"IF(Meetings!D6=\"\",\"\",getAddress(Meetings!D6))","v":"http://www.tabonline.com.au/2011/04/01/CR01.html"},{"$f":"IF(Meetings!E6=\"\",\"\",getAddress(Meetings!E6))","v":"http://www.tabonline.com.au/2011/04/01/CR02.html"},{"$f":"IF(Meetings!F6=\"\",\"\",getAddress(Meetings!F6))","v":"http://www.tabonline.com.au/2011/04/01/CR03.html"},{"$f":"IF(Meetings!G6=\"\",\"\",getAddress(Meetings!G6))","v":"http://www.tabonline.com.au/2011/04/01/CR04.html"},{"$f":"IF(Meetings!H6=\"\",\"\",getAddress(Meetings!H6))","v":"http://www.tabonline.com.au/2011/04/01/CR05.html"},{"$f":"IF(Meetings!I6=\"\",\"\",getAddress(Meetings!I6))","v":"http://www.tabonline.com.au/2011/04/01/CR06.html"},{"$f":"IF(Meetings!J6=\"\",\"\",getAddress(Meetings!J6))","v":"http://www.tabonline.com.au/2011/04/01/CR07.html"},{"$f":"IF(Meetings!K6=\"\",\"\",getAddress(Meetings!K6))","v":"http://www.tabonline.com.au/2011/04/01/CR08.html"},{"$f":"IF(Meetings!L6=\"\",\"\",getAddress(Meetings!L6))","v":""},{"$f":"IF(Meetings!M6=\"\",\"\",getAddress(Meetings!M6))","v":""},{"$f":"IF(Meetings!N6=\"\",\"\",getAddress(Meetings!N6))","v":""},{"$f":"IF(Meetings!O6=\"\",\"\",getAddress(Meetings!O6))","v":""},null,{"$f":"COUNTA(Meetings!D6:'Meetings'!O6)","v":8},{"$f":"IF(W5<>\"\",IF(ISERROR(CLEAN(TRIM((LEFT(Meetings!W5,FIND(\"-\",Meetings!W5,1)-1))))),CLEAN(TRIM(Meetings!W5)),CLEAN(TRIM(LEFT(Meetings!W5,FIND(\"-\",Meetings!W5,1)-1)))),\"\")","v":""},{"$f":"IF(Meetings!W5=\"\",\"\",getAddress(Meetings!W5))","v":""},""]
[{"$f":"IF(Race!N4<>\"\",(CLEAN(TRIM(Race!C4))),\"\")","v":""},{"$f":"IF(A6<>\"\",Race!N4,\"\")","v":""},null,null,null,"KRANJI",{"$f":"IF(Meetings!B7=\"\",\"\",Meetings!B7)","v":"KRANJI (SS)"},{"$f":"IF(Meetings!D7=\"\",\"\",getAddress(Meetings!D7))","v":"http://www.tabonline.com.au/2011/04/01/SS01.html"},{"$f":"IF(Meetings!E7=\"\",\"\",getAddress(Meetings!E7))","v":"http://www.tabonline.com.au/2011/04/01/SS02.html"},{"$f":"IF(Meetings!F7=\"\",\"\",getAddress(Meetings!F7))","v":"http://www.tabonline.com.au/2011/04/01/SS03.html"},{"$f":"IF(Meetings!G7=\"\",\"\",getAddress(Meetings!G7))","v":"http://www.tabonline.com.au/2011/04/01/SS04.html"},{"$f":"IF(Meetings!H7=\"\",\"\",getAddress(Meetings!H7))","v":"http://www.tabonline.com.au/2011/04/01/SS05.html"},{"$f":"IF(Meetings!I7=\"\",\"\",getAddress(Meetings!I7))","v":"http://www.tabonline.com.au/2011/04/01/SS06.html"},{"$f":"IF(Meetings!J7=\"\",\"\",getAddress(Meetings!J7))","v":"http://www.tabonline.com.au/2011/04/01/SS07.html"},{"$f":"IF(Meetings!K7=\"\",\"\",getAddress(Meetings!K7))","v":"http://www.tabonline.com.au/2011/04/01/SS08.html"},{"$f":"IF(Meetings!L7=\"\",\"\",getAddress(Meetings!L7))","v":"http://www.tabonline.com.au/2011/04/01/SS09.html"},{"$f":"IF(Meetings!M7=\"\",\"\",getAddress(Meetings!M7))","v":"http://www.tabonline.com.au/2011/04/01/SS10.html"},{"$f":"IF(Meetings!N7=\"\",\"\",getAddress(Meetings!N7))","v":""},{"$f":"IF(Meetings!O7=\"\",\"\",getAddress(Meetings!O7))","v":""},null,{"$f":"COUNTA(Meetings!D7:'Meetings'!O7)","v":10},{"$f":"IF(W6<>\"\",IF(ISERROR(CLEAN(TRIM((LEFT(Meetings!W6,FIND(\"-\",Meetings!W6,1)-1))))),CLEAN(TRIM(Meetings!W6)),CLEAN(TRIM(LEFT(Meetings!W6,FIND(\"-\",Meetings!W6,1)-1)))),\"\")","v":""},{"$f":"IF(Meetings!W6=\"\",\"\",getAddress(Meetings!W6))","v":""},""]
[{"$f":"IF(Race!N5<>\"\",(CLEAN(TRIM(Race!C5))),\"\")","v":""},{"$f":"IF(A7<>\"\",Race!N5,\"\")","v":""},{"$f":"IF(A7<>\"\",Race!I5,\"\")","v":""},null,null,"FAIRVIEW",{"$f":"IF(Meetings!B8=\"\",\"\",Meetings!B8)","v":"FAIRVIEW (AS)"},{"$f":"IF(Meetings!D8=\"\",\"\",getAddress(Meetings!D8))","v":"http://www.tabonline.com.au/2011/04/01/AS01.html"},{"$f":"IF(Meetings!E8=\"\",\"\",getAddress(Meetings!E8))","v":"http://www.tabonline.com.au/2011/04/01/AS02.html"},{"$f":"IF(Meetings!F8=\"\",\"\",getAddress(Meetings!F8))","v":"http://www.tabonline.com.au/2011/04/01/AS03.html"},{"$f":"IF(Meetings!G8=\"\",\"\",getAddress(Meetings!G8))","v":"http://www.tabonline.com.au/2011/04/01/AS04.html"},{"$f":"IF(Meetings!H8=\"\",\"\",getAddress(Meetings!H8))","v":"http://www.tabonline.com.au/2011/04/01/AS05.html"},{"$f":"IF(Meetings!I8=\"\",\"\",getAddress(Meetings!I8))","v":"http://www.tabonline.com.au/2011/04/01/AS06.html"},{"$f":"IF(Meetings!J8=\"\",\"\",getAddress(Meetings!J8))","v":"http://www.tabonline.com.au/2011/04/01/AS07.html"},{"$f":"IF(Meetings!K8=\"\",\"\",getAddress(Meetings!K8))","v":"http://www.tabonline.com.au/2011/04/01/AS08.html"},{"$f":"IF(Meetings!L8=\"\",\"\",getAddress(Meetings!L8))","v":""},{"$f":"IF(Meetings!M8=\"\",\"\",getAddress(Meetings!M8))","v":""},{"$f":"IF(Meetings!N8=\"\",\"\",getAddress(Meetings!N8))","v":""},{"$f":"IF(Meetings!O8=\"\",\"\",getAddress(Meetings!O8))","v":""},null,{"$f":"COUNTA(Meetings!D8:'Meetings'!O8)","v":8},{"$f":"IF(W7<>\"\",IF(ISERROR(CLEAN(TRIM((LEFT(Meetings!W7,FIND(\"-\",Meetings!W7,1)-1))))),CLEAN(TRIM(Meetings!W7)),CLEAN(TRIM(LEFT(Meetings!W7,FIND(\"-\",Meetings!W7,1)-1)))),\"\")","v":""},{"$f":"IF(Meetings!W7=\"\",\"\",getAddress(Meetings!W7))","v":""},""]
[{"$f":"IF(Race!N6<>\"\",(CLEAN(TRIM(Race!C6))),\"\")","v":""},{"$f":"IF(A8<>\"\",Race!N6,\"\")","v":""},{"$f":"IF(A8<>\"\",Race!I6,\"\")","v":""},null,null,"NEWCASTLE",{"$f":"IF(Meetings!B9=\"\",\"\",Meetings!B9)","v":"NEWCASTLE (CS)"},{"$f":"IF(Meetings!D9=\"\",\"\",getAddress(Meetings!D9))","v":"http://www.tabonline.com.au/2011/04/01/CS01.html"},{"$f":"IF(Meetings!E9=\"\",\"\",getAddress(Meetings!E9))","v":"http://www.tabonline.com.au/2011/04/01/CS02.html"},{"$f":"IF(Meetings!F9=\"\",\"\",getAddress(Meetings!F9))","v":"http://www.tabonline.com.au/2011/04/01/CS03.html"},{"$f":"IF(Meetings!G9=\"\",\"\",getAddress(Meetings!G9))","v":"http://www.tabonline.com.au/2011/04/01/CS04.html"},{"$f":"IF(Meetings!H9=\"\",\"\",getAddress(Meetings!H9))","v":"http://www.tabonline.com.au/2011/04/01/CS05.html"},{"$f":"IF(Meetings!I9=\"\",\"\",getAddress(Meetings!I9))","v":""},{"$f":"IF(Meetings!J9=\"\",\"\",getAddress(Meetings!J9))","v":""},{"$f":"IF(Meetings!K9=\"\",\"\",getAddress(Meetings!K9))","v":""},{"$f":"IF(Meetings!L9=\"\",\"\",getAddress(Meetings!L9))","v":""},{"$f":"IF(Meetings!M9=\"\",\"\",getAddress(Meetings!M9))","v":""},{"$f":"IF(Meetings!N9=\"\",\"\",getAddress(Meetings!N9))","v":""},{"$f":"IF(Meetings!O9=\"\",\"\",getAddress(Meetings!O9))","v":""},null,{"$f":"COUNTA(Meetings!D9:'Meetings'!O9)","v":5},{"$f":"IF(W8<>\"\",IF(ISERROR(CLEAN(TRIM((LEFT(Meetings!W8,FIND(\"-\",Meetings!W8,1)-1))))),CLEAN(TRIM(Meetings!W8)),CLEAN(TRIM(LEFT(Meetings!W8,FIND(\"-\",Meetings!W8,1)-1)))),\"\")","v":""},{"$f":"IF(Meetings!W8=\"\",\"\",getAddress(Meetings!W8))","v":""},""]
[{"$f":"IF(Race!N7<>\"\",(CLEAN(TRIM(Race!C7))),\"\")","v":""},{"$f":"IF(A9<>\"\",Race!N7,\"\")","v":""},{"$f":"IF(A9<>\"\",Race!I7,\"\")","v":""},null,null,"ENGLAND",{"$f":"IF(Meetings!B10=\"\",\"\",Meetings!B10)","v":"ENGLAND (ES)"},{"$f":"IF(Meetings!D10=\"\",\"\",getAddress(Meetings!D10))","v":"http://www.tabonline.com.au/2011/04/01/ES01.html"},{"$f":"IF(Meetings!E10=\"\",\"\",getAddress(Meetings!E10))","v":"http://www.tabonline.com.au/2011/04/01/ES02.html"},{"$f":"IF(Meetings!F10=\"\",\"\",getAddress(Meetings!F10))","v":"http://www.tabonline.com.au/2011/04/01/ES03.html"},{"$f":"IF(Meetings!G10=\"\",\"\",getAddress(Meetings!G10))","v":"http://www.tabonline.com.au/2011/04/01/ES04.html"},{"$f":"IF(Meetings!H10=\"\",\"\",getAddress(Meetings!H10))","v":"http://www.tabonline.com.au/2011/04/01/ES05.html"},{"$f":"IF(Meetings!I10=\"\",\"\",getAddress(Meetings!I10))","v":""},{"$f":"IF(Meetings!J10=\"\",\"\",getAddress(Meetings!J10))","v":""},{"$f":"IF(Meetings!K10=\"\",\"\",getAddress(Meetings!K10))","v":""},{"$f":"IF(Meetings!L10=\"\",\"\",getAddress(Meetings!L10))","v":""},{"$f":"IF(Meetings!M10=\"\",\"\",getAddress(Meetings!M10))","v":""},{"$f":"IF(Meetings!N10=\"\",\"\",getAddress(Meetings!N10))","v":""},{"$f":"IF(Meetings!O10=\"\",\"\",getAddress(Meetings!O10))","v":""},null,{"$f":"COUNTA(Meetings!D10:'Meetings'!O10)","v":5},{"$f":"IF(W9<>\"\",IF(ISERROR(CLEAN(TRIM((LEFT(Meetings!W9,FIND(\"-\",Meetings!W9,1)-1))))),CLEAN(TRIM(Meetings!W9)),CLEAN(TRIM(LEFT(Meetings!W9,FIND(\"-\",Meetings!W9,1)-1)))),\"\")","v":""},{"$f":"IF(Meetings!W9=\"\",\"\",getAddress(Meetings!W9))","v":""},""]
[{"$f":"IF(Race!N8<>\"\",(CLEAN(TRIM(Race!C8))),\"\")","v":""},{"$f":"IF(A10<>\"\",Race!N8,\"\")","v":""},{"$f":"IF(A10<>\"\",Race!I8,\"\")","v":""},null,null,"WINGATUI",{"$f":"IF(Meetings!B11=\"\",\"\",Meetings!B11)","v":"WINGATUI (ZS)"},{"$f":"IF(Meetings!D11=\"\",\"\",getAddress(Meetings!D11))","v":"http://www.tabonline.com.au/2011/04/01/ZS01.html"},{"$f":"IF(Meetings!E11=\"\",\"\",getAddress(Meetings!E11))","v":"http://www.tabonline.com.au/2011/04/01/ZS02.html"},{"$f":"IF(Meetings!F11=\"\",\"\",getAddress(Meetings!F11))","v":"http://www.tabonline.com.au/2011/04/01/ZS03.html"},{"$f":"IF(Meetings!G11=\"\",\"\",getAddress(Meetings!G11))","v":"http://www.tabonline.com.au/2011/04/01/ZS04.html"},{"$f":"IF(Meetings!H11=\"\",\"\",getAddress(Meetings!H11))","v":"http://www.tabonline.com.au/2011/04/01/ZS05.html"},{"$f":"IF(Meetings!I11=\"\",\"\",getAddress(Meetings!I11))","v":"http://www.tabonline.com.au/2011/04/01/ZS06.html"},{"$f":"IF(Meetings!J11=\"\",\"\",getAddress(Meetings!J11))","v":"http://www.tabonline.com.au/2011/04/01/ZS07.html"},{"$f":"IF(Meetings!K11=\"\",\"\",getAddress(Meetings!K11))","v":"http://www.tabonline.com.au/2011/04/01/ZS08.html"},{"$f":"IF(Meetings!L11=\"\",\"\",getAddress(Meetings!L11))","v":"http://www.tabonline.com.au/2011/04/01/ZS09.html"},{"$f":"IF(Meetings!M11=\"\",\"\",getAddress(Meetings!M11))","v":"http://www.tabonline.com.au/2011/04/01/ZS10.html"},{"$f":"IF(Meetings!N11=\"\",\"\",getAddress(Meetings!N11))","v":""},{"$f":"IF(Meetings!O11=\"\",\"\",getAddress(Meetings!O11))","v":""},null,{"$f":"COUNTA(Meetings!D11:'Meetings'!O11)","v":10},{"$f":"IF(W10<>\"\",IF(ISERROR(CLEAN(TRIM((LEFT(Meetings!W10,FIND(\"-\",Meetings!W10,1)-1))))),CLEAN(TRIM(Meetings!W10)),CLEAN(TRIM(LEFT(Meetings!W10,FIND(\"-\",Meetings!W10,1)-1)))),\"\")","v":""},{"$f":"IF(Meetings!W10=\"\",\"\",getAddress(Meetings!W10))","v":""},""]
[{"$f":"IF(Race!N9<>\"\",(CLEAN(TRIM(Race!C9))),\"\")","v":""},{"$f":"IF(A11<>\"\",Race!N9,\"\")","v":""},{"$f":"IF(A11<>\"\",Race!I9,\"\")","v":""},null,null,"",{"$f":"IF(Meetings!B12=\"\",\"\",Meetings!B12)","v":""},{"$f":"IF(Meetings!D12=\"\",\"\",getAddress(Meetings!D12))","v":{"$error":"#VALUE!"}},{"$f":"IF(Meetings!E12=\"\",\"\",getAddress(Meetings!E12))","v":{"$error":"#VALUE!"}},{"$f":"IF(Meetings!F12=\"\",\"\",getAddress(Meetings!F12))","v":{"$error":"#VALUE!"}},{"$f":"IF(Meetings!G12=\"\",\"\",getAddress(Meetings!G12))","v":{"$error":"#VALUE!"}},{"$f":"IF(Meetings!H12=\"\",\"\",getAddress(Meetings!H12))","v":{"$error":"#VALUE!"}},{"$f":"IF(Meetings!I12=\"\",\"\",getAddress(Meetings!I12))","v":{"$error":"#VALUE!"}},{"$f":"IF(Meetings!J12=\"\",\"\",getAddress(Meetings!J12))","v":{"$error":"#VALUE!"}},{"$f":"IF(Meetings!K12=\"\",\"\",getAddress(Meetings!K12))","v":{"$error":"#VALUE!"}},{"$f":"IF(Meetings!L12=\"\",\"\",getAddress(Meetings!L12))","v":{"$error":"#VALUE!"}},{"$f":"IF(Meetings!M12=\"\",\"\",getAddress(Meetings!M12))","v":{"$error":"#VALUE!"}},{"$f":"IF(Meetings!N12=\"\",\"\",getAddress(Meetings!N12))","v":{"$error":"#VALUE!"}},{"$f":"IF(Meetings!O12=\"\",\"\",getAddress(Meetings!O12))","v":{"$error":"#VALUE!"}},null,{"$f":"COUNTA(Meetings!D12:'Meetings'!O12)","v":12},{"$f":"IF(W11<>\"\",IF(ISERROR(CLEAN(TRIM((LEFT(Meetings!W11,FIND(\"-\",Meetings!W11,1)-1))))),CLEAN(TRIM(Meetings!W11)),CLEAN(TRIM(LEFT(Meetings!W11,FIND(\"-\",Meetings!W11,1)-1)))),\"\")","v":""},{"$f":"IF(Meetings!W11=\"\",\"\",getAddress(Meetings!W11))","v":""},""]
[{"$f":"IF(Race!N10<>\"\",(CLEAN(TRIM(Race!C10))),\"\")","v":""},{"$f":"IF(A12<>\"\",Race!N10,\"\")","v":""},{"$f":"IF(A12<>\"\",Race!I10,\"\")","v":""},null,null,"BANKSTOWN",{"$f":"IF(Meetings!B13=\"\",\"\",Meetings!B13)","v":"BANKSTOWN (ST)"},{"$f":"IF(Meetings!D13=\"\",\"\",getAddress(Meetings!D13))","v":"http://www.tabonline.com.au/2011/04/01/ST01.html"},{"$f":"IF(Meetings!E13=\"\",\"\",getAddress(Meetings!E13))","v":"http://www.tabonline.com.au/2011/04/01/ST02.html"},{"$f":"IF(Meetings!F13=\"\",\"\",getAddress(Meetings!F13))","v":"http://www.tabonline.com.au/2011/04/01/ST03.html"},{"$f":"IF(Meetings!G13=\"\",\"\",getAddress(Meetings!G13))","v":"http://www.tabonline.com.au/2011/04/01/ST04.html"},{"$f":"IF(Meetings!H13=\"\",\"\",getAddress(Meetings!H13))","v":"http://www.tabonline.com.au/2011/04/01/ST05.html"},{"$f":"IF(Meetings!I13=\"\",\"\",getAddress(Meetings!I13))","v":"http://www.tabonline.com.au/2011/04/01/ST06.html"},{"$f":"IF(Meetings!J13=\"\",\"\",getAddress(Meetings!J13))","v":"http://www.tabonline.com.au/2011/04/01/ST07.html"},{"$f":"IF(Meetings!K13=\"\",\"\",getAddress(Meetings!K13))","v":"http://www.tabonline.com.au/2011/04/01/ST08.html"},{"$f":"IF(Meetings!L13=\"\",\"\",getAddress(Meetings!L13))","v":""},{"$f":"IF(Meetings!M13=\"\",\"\",getAddress(Meetings!M13))","v":""},{"$f":"IF(Meetings!N13=\"\",\"\",getAddress(Meetings!N13))","v":""},{"$f":"IF(Meetings!O13=\"\",\"\",getAddress(Meetings!O13))","v":""},null,{"$f":"COUNTA(Meetings!D13:'Meetings'!O13)","v":8},{"$f":"IF(W12<>\"\",IF(ISERROR(CLEAN(TRIM((LEFT(Meetings!W12,FIND(\"-\",Meetings!W12,1)-1))))),CLEAN(TRIM(Meetings!W12)),CLEAN(TRIM(LEFT(Meetings!W12,FIND(\"-\",Meetings!W12,1)-1)))),\"\")","v":""},{"$f":"IF(Meetings!W12=\"\",\"\",getAddress(Meetings!W12))","v":""},""]
[{"$f":"IF(Race!N11<>\"\",(CLEAN(TRIM(Race!C11))),\"\")","v":""},{"$f":"IF(A13<>\"\",Race!N11,\"\")","v":""},{"$f":"IF(A13<>\"\",Race!I11,\"\")","v":""},null,null,"MELTON",{"$f":"IF(Meetings!B14=\"\",\"\",Meetings!B14)","v":"MELTON (MT)"},{"$f":"IF(Meetings!D14=\"\",\"\",getAddress(Meetings!D14))","v":"http://www.tabonline.com.au/2011/04/01/MT01.html"},{"$f":"IF(Meetings!E14=\"\",\"\",getAddress(Meetings!E14))","v":"http://www.tabonline.com.au/2011/04/01/MT02.html"},{"$f":"IF(Meetings!F14=\"\",\"\",getAddress(Meetings!F14))","v":"http://www.tabonline.com.au/2011/04/01/MT03.html"},{"$f":"IF(Meetings!G14=\"\",\"\",getAddress(Meetings!G14))","v":"http://www.tabonline.com.au/2011/04/01/MT04.html"},{"$f":"IF(Meetings!H14=\"\",\"\",getAddress(Meetings!H14))","v":"http://www.tabonline.com.au/2011/04/01/MT05.html"},{"$f":"IF(Meetings!I14=\"\",\"\",getAddress(Meetings!I14))","v":"http://www.tabonline.com.au/2011/04/01/MT06.html"},{"$f":"IF(Meetings!J14=\"\",\"\",getAddress(Meetings!J14))","v":"http://www.tabonline.com.au/2011/04/01/MT07.html"},{"$f":"IF(Meetings!K14=\"\",\"\",getAddress(Meetings!K14))","v":"http://www.tabonline.com.au/2011/04/01/MT08.html"},{"$f":"IF(Meetings!L14=\"\",\"\",getAddress(Meetings!L14))","v":""},{"$f":"IF(Meetings!M14=\"\",\"\",getAddress(Meetings!M14))","v":""},{"$f":"IF(Meetings!N14=\"\",\"\",getAddress(Meetings!N14))","v":""},{"$f":"IF(Meetings!O14=\"\",\"\",getAddress(Meetings!O14))","v":""},null,{"$f":"COUNTA(Meetings!D14:'Meetings'!O14)","v":8},{"$f":"IF(W13<>\"\",IF(ISERROR(CLEAN(TRIM((LEFT(Meetings!W13,FIND(\"-\",Meetings!W13,1)-1))))),CLEAN(TRIM(Meetings!W13)),CLEAN(TRIM(LEFT(Meetings!W13,FIND(\"-\",Meetings!W13,1)-1)))),\"\")","v":""},{"$f":"IF(Meetings!W13=\"\",\"\",getAddress(Meetings!W13))","v":""},""]
[{"$f":"IF(Race!N12<>\"\",(CLEAN(TRIM(Race!C12))),\"\")","v":""},{"$f":"IF(A14<>\"\",Race!N12,\"\")","v":""},{"$f":"IF(A14<>\"\",Race!I12,\"\")","v":""},null,null,"GOLD COAST",{"$f":"IF(Meetings!B15=\"\",\"\",Meetings!B15)","v":"GOLD COAST (QT)"},{"$f":"IF(Meetings!D15=\"\",\"\",getAddress(Meetings!D15))","v":"http://www.tabonline.com.au/2011/04/01/QT01.html"},{"$f":"IF(Meetings!E15=\"\",\"\",getAddress(Meetings!E15))","v":"http://www.tabonline.com.au/2011/04/01/QT02.html"},{"$f":"IF(Meetings!F15=\"\",\"\",getAddress(Meetings!F15))","v":"http://www.tabonline.com.au/2011/04/01/QT03.html"},{"$f":"IF(Meetings!G15=\"\",\"\",getAddress(Meetings!G15))","v":"http://www.tabonline.com.au/2011/04/01/QT04.html"},{"$f":"IF(Meetings!H15=\"\",\"\",getAddress(Meetings!H15))","v":"http://www.tabonline.com.au/2011/04/01/QT05.html"},{"$f":"IF(Meetings!I15=\"\",\"\",getAddress(Meetings!I15))","v":"http://www.tabonline.com.au/2011/04/01/QT06.html"},{"$f":"IF(Meetings!J15=\"\",\"\",getAddress(Meetings!J15))","v":"http://www.tabonline.com.au/2011/04/01/QT07.html"},{"$f":"IF(Meetings!K15=\"\",\"\",getAddress(Meetings!K15))","v":""},{"$f":"IF(Meetings!L15=\"\",\"\",getAddress(Meetings!L15))","v":""},{"$f":"IF(Meetings!M15=\"\",\"\",getAddress(Meetings!M15))","v":""},{"$f":"IF(Meetings!N15=\"\",\"\",getAddress(Meetings!N15))","v":""},{"$f":"IF(Meetings!O15=\"\",\"\",getAddress(Meetings!O15))","v":""},null,{"$f":"COUNTA(Meetings!D15:'Meetings'!O15)","v":7},{"$f":"IF(W14<>\"\",IF(ISERROR(CLEAN(TRIM((LEFT(Meetings!W14,FIND(\"-\",Meetings!W14,1)-1))))),CLEAN(TRIM(Meetings!W14)),CLEAN(TRIM(LEFT(Meetings!W14,FIND(\"-\",Meetings!W14,1)-1)))),\"\")","v":"Grafton"},{"$f":"IF(Meetings!W14=\"\",\"\",getAddress(Meetings!W14))","v":"http://www.racingandsports.com.au/form-guide/meeting.asp?meeting=16402"},"16402"]
[{"$f":"IF(Race!N13<>\"\",(CLEAN(TRIM(Race!C13))),\"\")","v":""},{"$f":"IF(A15<>\"\",Race!N13,\"\")","v":""},{"$f":"IF(A15<>\"\",Race!I13,\"\")","v":""},null,null,"BATHURST",{"$f":"IF(Meetings!B16=\"\",\"\",Meetings!B16)","v":"BATHURST (NT)"},{"$f":"IF(Meetings!D16=\"\",\"\",getAddress(Meetings!D16))","v":"http://www.tabonline.com.au/2011/04/01/NT01.html"},{"$f":"IF(Meetings!E16=\"\",\"\",getAddress(Meetings!E16))","v":"http://www.tabonline.com.au/2011/04/01/NT02.html"},{"$f":"IF(Meetings!F16=\"\",\"\",getAddress(Meetings!F16))","v":"http://www.tabonline.com.au/2011/04/01/NT03.html"},{"$f":"IF(Meetings!G16=\"\",\"\",getAddress(Meetings!G16))","v":"http://www.tabonline.com.au/2011/04/01/NT04.html"},{"$f":"IF(Meetings!H16=\"\",\"\",getAddress(Meetings!H16))","v":"http://www.tabonline.com.au/2011/04/01/NT05.html"},{"$f":"IF(Meetings!I16=\"\",\"\",getAddress(Meetings!I16))","v":"http://www.tabonline.com.au/2011/04/01/NT06.html"},{"$f":"IF(Meetings!J16=\"\",\"\",getAddress(Meetings!J16))","v":"http://www.tabonline.com.au/2011/04/01/NT07.html"},{"$f":"IF(Meetings!K16=\"\",\"\",getAddress(Meetings!K16))","v":"http://www.tabonline.com.au/2011/04/01/NT08.html"},{"$f":"IF(Meetings!L16=\"\",\"\",getAddress(Meetings!L16))","v":""},{"$f":"IF(Meetings!M16=\"\",\"\",getAddress(Meetings!M16))","v":""},{"$f":"IF(Meetings!N16=\"\",\"\",getAddress(Meetings!N16))","v":""},{"$f":"IF(Meetings!O16=\"\",\"\",getAddress(Meetings!O16))","v":""},null,{"$f":"COUNTA(Meetings!D16:'Meetings'!O16)","v":8},{"$f":"IF(W15<>\"\",IF(ISERROR(CLEAN(TRIM((LEFT(Meetings!W15,FIND(\"-\",Meetings!W15,1)-1))))),CLEAN(TRIM(Meetings!W15)),CLEAN(TRIM(LEFT(Meetings!W15,FIND(\"-\",Meetings!W15,1)-1)))),\"\")","v":"Ipswich"},{"$f":"IF(Meetings!W15=\"\",\"\",getAddress(Meetings!W15))","v":"http://www.racingandsports.com.au/form-guide/meeting.asp?meeting=16404"},"16404"]
[{"$f":"IF(Race!N14<>\"\",(CLEAN(TRIM(Race!C14))),\"\")","v":""},{"$f":"IF(A16<>\"\",Race!N14,\"\")","v":""},{"$f":"IF(A16<>\"\",Race!I14,\"\")","v":""},null,null,"MILDURA",{"$f":"IF(Meetings!B17=\"\",\"\",Meetings!B17)","v":"MILDURA (VT)"},{"$f":"IF(Meetings!D17=\"\",\"\",getAddress(Meetings!D17))","v":"http://www.tabonline.com.au/2011/04/01/VT01.html"},{"$f":"IF(Meetings!E17=\"\",\"\",getAddress(Meetings!E17))","v":"http://www.tabonline.com.au/2011/04/01/VT02.html"},{"$f":"IF(Meetings!F17=\"\",\"\",getAddress(Meetings!F17))","v":"http://www.tabonline.com.au/2011/04/01/VT03.html"},{"$f":"IF(Meetings!G17=\"\",\"\",getAddress(Meetings!G17))","v":"http://www.tabonline.com.au/2011/04/01/VT04.html"},{"$f":"IF(Meetings!H17=\"\",\"\",getAddress(Meetings!H17))","v":"http://www.tabonline.com.au/2011/04/01/VT05.html"},{"$f":"IF(Meetings!I17=\"\",\"\",getAddress(Meetings!I17))","v":"http://www.tabonline.com.au/2011/04/01/VT06.html"},{"$f":"IF(Meetings!J17=\"\",\"\",getAddress(Meetings!J17))","v":"http://www.tabonline.com.au/2011/04/01/VT07.html"},{"$f":"IF(Meetings!K17=\"\",\"\",getAddress(Meetings!K17))","v":"http://www.tabonline.com.au/2011/04/01/VT08.html"},{"$f":"IF(Meetings!L17=\"\",\"\",getAddress(Meetings!L17))","v":"http://www.tabonline.com.au/2011/04/01/VT09.html"},{"$f":"IF(Meetings!M17=\"\",\"\",getAddress(Meetings!M17))","v":""},{"$f":"IF(Meetings!N17=\"\",\"\",getAddress(Meetings!N17))","v":""},{"$f":"IF(Meetings!O17=\"\",\"\",getAddress(Meetings!O17))","v":""},null,{"$f":"COUNTA(Meetings!D17:'Meetings'!O17)","v":9},{"$f":"IF(W16<>\"\",IF(ISERROR(CLEAN(TRIM((LEFT(Meetings!W16,FIND(\"-\",Meetings!W16,1)-1))))),CLEAN(TRIM(Meetings!W16)),CLEAN(TRIM(LEFT(Meetings!W16,FIND(\"-\",Meetings!W16,1)-1)))),\"\")","v":"Canberra"},{"$f":"IF(Meetings!W16=\"\",\"\",getAddress(Meetings!W16))","v":"http://www.racingandsports.com.au/form-guide/meeting.asp?meeting=16399"},"16399"]
[{"$f":"IF(Race!N15<>\"\",(CLEAN(TRIM(Race!C15))),\"\")","v":""},{"$f":"IF(A17<>\"\",Race!N15,\"\")","v":""},{"$f":"IF(A17<>\"\",Race!I15,\"\")","v":""},null,null,"GLOBE DERBY",{"$f":"IF(Meetings!B18=\"\",\"\",Meetings!B18)","v":"GLOBE DERBY (AT)"},{"$f":"IF(Meetings!D18=\"\",\"\",getAddress(Meetings!D18))","v":"http://www.tabonline.com.au/2011/04/01/AT01.html"},{"$f":"IF(Meetings!E18=\"\",\"\",getAddress(Meetings!E18))","v":"http://www.tabonline.com.au/2011/04/01/AT02.html"},{"$f":"IF(Meetings!F18=\"\",\"\",getAddress(Meetings!F18))","v":"http://www.tabonline.com.au/2011/04/01/AT03.html"},{"$f":"IF(Meetings!G18=\"\",\"\",getAddress(Meetings!G18))","v":"http://www.tabonline.com.au/2011/04/01/AT04.html"},{"$f":"IF(Meetings!H18=\"\",\"\",getAddress(Meetings!H18))","v":"http://www.tabonline.com.au/2011/04/01/AT05.html"},{"$f":"IF(Meetings!I18=\"\",\"\",getAddress(Meetings!I18))","v":"http://www.tabonline.com.au/2011/04/01/AT06.html"},{"$f":"IF(Meetings!J18=\"\",\"\",getAddress(Meetings!J18))","v":"http://www.tabonline.com.au/2011/04/01/AT07.html"},{"$f":"IF(Meetings!K18=\"\",\"\",getAddress(Meetings!K18))","v":"http://www.tabonline.com.au/2011/04/01/AT08.html"},{"$f":"IF(Meetings!L18=\"\",\"\",getAddress(Meetings!L18))","v":""},{"$f":"IF(Meetings!M18=\"\",\"\",getAddress(Meetings!M18))","v":""},{"$f":"IF(Meetings!N18=\"\",\"\",getAddress(Meetings!N18))","v":""},{"$f":"IF(Meetings!O18=\"\",\"\",getAddress(Meetings!O18))","v":""},null,{"$f":"COUNTA(Meetings!D18:'Meetings'!O18)","v":8},{"$f":"IF(W17<>\"\",IF(ISERROR(CLEAN(TRIM((LEFT(Meetings!W17,FIND(\"-\",Meetings!W17,1)-1))))),CLEAN(TRIM(Meetings!W17)),CLEAN(TRIM(LEFT(Meetings!W17,FIND(\"-\",Meetings!W17,1)-1)))),\"\")","v":"Mornington"},{"$f":"IF(Meetings!W17=\"\",\"\",getAddress(Meetings!W17))","v":"http://www.racingandsports.com.au/form-guide/meeting.asp?meeting=16405"},"16405"]
[{"$f":"IF(Race!N16<>\"\",(CLEAN(TRIM(Race!C16))),\"\")","v":""},{"$f":"IF(A18<>\"\",Race!N16,\"\")","v":""},{"$f":"IF(A18<>\"\",Race!I16,\"\")","v":""},null,null,"GLOUCESTER PARK",{"$f":"IF(Meetings!B19=\"\",\"\",Meetings!B19)","v":"GLOUCESTER PARK (PT)"},{"$f":"IF(Meetings!D19=\"\",\"\",getAddress(Meetings!D19))","v":"http://www.tabonline.com.au/2011/04/01/PT01.html"},{"$f":"IF(Meetings!E19=\"\",\"\",getAddress(Meetings!E19))","v":"http://www.tabonline.com.au/2011/04/01/PT02.html"},{"$f":"IF(Meetings!F19=\"\",\"\",getAddress(Meetings!F19))","v":"http://www.tabonline.com.au/2011/04/01/PT03.html"},{"$f":"IF(Meetings!G19=\"\",\"\",getAddress(Meetings!G19))","v":"http://www.tabonline.com.au/2011/04/01/PT04.html"},{"$f":"IF(Meetings!H19=\"\",\"\",getAddress(Meetings!H19))","v":"http://www.tabonline.com.au/2011/04/01/PT05.html"},{"$f":"IF(Meetings!I19=\"\",\"\",getAddress(Meetings!I19))","v":"http://www.tabonline.com.au/2011/04/01/PT06.html"},{"$f":"IF(Meetings!J19=\"\",\"\",getAddress(Meetings!J19))","v":"http://www.tabonline.com.au/2011/04/01/PT07.html"},{"$f":"IF(Meetings!K19=\"\",\"\",getAddress(Meetings!K19))","v":"http://www.tabonline.com.au/2011/04/01/PT08.html"},{"$f":"IF(Meetings!L19=\"\",\"\",getAddress(Meetings!L19))","v":"http://www.tabonline.com.au/2011/04/01/PT09.html"},{"$f":"IF(Meetings!M19=\"\",\"\",getAddress(Meetings!M19))","v":"http://www.tabonline.com.au/2011/04/01/PT10.html"},{"$f":"IF(Meetings!N19=\"\",\"\",getAddress(Meetings!N19))","v":""},{"$f":"IF(Meetings!O19=\"\",\"\",getAddress(Meetings!O19))","v":""},null,{"$f":"COUNTA(Meetings!D19:'Meetings'!O19)","v":10},{"$f":"IF(W18<>\"\",IF(ISERROR(CLEAN(TRIM((LEFT(Meetings!W18,FIND(\"-\",Meetings!W18,1)-1))))),CLEAN(TRIM(Meetings!W18)),CLEAN(TRIM(LEFT(Meetings!W18,FIND(\"-\",Meetings!W18,1)-1)))),\"\")","v":""},{"$f":"IF(Meetings!W18=\"\",\"\",getAddress(Meetings!W18))","v":""},""]
[{"$f":"IF(Race!N17<>\"\",(CLEAN(TRIM(Race!C17))),\"\")","v":""},{"$f":"IF(A19<>\"\",Race!N17,\"\")","v":""},{"$f":"IF(A19<>\"\",Race!I17,\"\")","v":""},null,null,"ALEXANDRA PARK",{"$f":"IF(Meetings!B20=\"\",\"\",Meetings!B20)","v":"ALEXANDRA PARK (ZT)"},{"$f":"IF(Meetings!D20=\"\",\"\",getAddress(Meetings!D20))","v":"http://www.tabonline.com.au/2011/04/01/ZT01.html"},{"$f":"IF(Meetings!E20=\"\",\"\",getAddress(Meetings!E20))","v":"http://www.tabonline.com.au/2011/04/01/ZT02.html"},{"$f":"IF(Meetings!F20=\"\",\"\",getAddress(Meetings!F20))","v":"http://www.tabonline.com.au/2011/04/01/ZT03.html"},{"$f":"IF(Meetings!G20=\"\",\"\",getAddress(Meetings!G20))","v":"http://www.tabonline.com.au/2011/04/01/ZT04.html"},{"$f":"IF(Meetings!H20=\"\",\"\",getAddress(Meetings!H20))","v":"http://www.tabonline.com.au/2011/04/01/ZT05.html"},{"$f":"IF(Meetings!I20=\"\",\"\",getAddress(Meetings!I20))","v":"http://www.tabonline.com.au/2011/04/01/ZT06.html"},{"$f":"IF(Meetings!J20=\"\",\"\",getAddress(Meetings!J20))","v":"http://www.tabonline.com.au/2011/04/01/ZT07.html"},{"$f":"IF(Meetings!K20=\"\",\"\",getAddress(Meetings!K20))","v":"http://www.tabonline.com.au/2011/04/01/ZT08.html"},{"$f":"IF(Meetings!L20=\"\",\"\",getAddress(Meetings!L20))","v":"http://www.tabonline.com.au/2011/04/01/ZT09.html"},{"$f":"IF(Meetings!M20=\"\",\"\",getAddress(Meetings!M20))","v":"http://www.tabonline.com.au/2011/04/01/ZT10.html"},{"$f":"IF(Meetings!N20=\"\",\"\",getAddress(Meetings!N20))","v":""},{"$f":"IF(Meetings!O20=\"\",\"\",getAddress(Meetings!O20))","v":""},null,{"$f":"COUNTA(Meetings!D20:'Meetings'!O20)","v":10},{"$f":"IF(W19<>\"\",IF(ISERROR(CLEAN(TRIM((LEFT(Meetings!W19,FIND(\"-\",Meetings!W19,1)-1))))),CLEAN(TRIM(Meetings!W19)),CLEAN(TRIM(LEFT(Meetings!W19,FIND(\"-\",Meetings!W19,1)-1)))),\"\")","v":""},{"$f":"IF(Meetings!W19=\"\",\"\",getAddress(Meetings!W19))","v":""},""]
[{"$f":"IF(Race!N18<>\"\",(CLEAN(TRIM(Race!C18))),\"\")","v":"Name"},{"$f":"IF(A20<>\"\",Race!N18,\"\")","v":"Rtng"},{"$f":"IF(A20<>\"\",Race!I18,\"\")","v":"Bar"},null,null,"",{"$f":"IF(Meetings!B21=\"\",\"\",Meetings!B21)","v":""},{"$f":"IF(Meetings!D21=\"\",\"\",getAddress(Meetings!D21))","v":{"$error":"#VALUE!"}},{"$f":"IF(Meetings!E21=\"\",\"\",getAddress(Meetings!E21))","v":{"$error":"#VALUE!"}},{"$f":"IF(Meetings!F21=\"\",\"\",getAddress(Meetings!F21))","v":{"$error":"#VALUE!"}},{"$f":"IF(Meetings!G21=\"\",\"\",getAddress(Meetings!G21))","v":{"$error":"#VALUE!"}},{"$f":"IF(Meetings!H21=\"\",\"\",getAddress(Meetings!H21))","v":{"$error":"#VALUE!"}},{"$f":"IF(Meetings!I21=\"\",\"\",getAddress(Meetings!I21))","v":{"$error":"#VALUE!"}},{"$f":"IF(Meetings!J21=\"\",\"\",getAddress(Meetings!J21))","v":{"$error":"#VALUE!"}},{"$f":"IF(Meetings!K21=\"\",\"\",getAddress(Meetings!K21))","v":{"$error":"#VALUE!"}},{"$f":"IF(Meetings!L21=\"\",\"\",getAddress(Meetings!L21))","v":{"$error":"#VALUE!"}},{"$f":"IF(Meetings!M21=\"\",\"\",getAddress(Meetings!M21))","v":{"$error":"#VALUE!"}},{"$f":"IF(Meetings!N21=\"\",\"\",getAddress(Meetings!N21))","v":{"$error":"#VALUE!"}},{"$f":"IF(Meetings!O21=\"\",\"\",getAddress(Meetings!O21))","v":{"$error":"#VALUE!"}},null,{"$f":"COUNTA(Meetings!D21:'Meetings'!O21)","v":12},{"$f":"IF(W20<>\"\",IF(ISERROR(CLEAN(TRIM((LEFT(Meetings!W20,FIND(\"-\",Meetings!W20,1)-1))))),CLEAN(TRIM(Meetings!W20)),CLEAN(TRIM(LEFT(Meetings!W20,FIND(\"-\",Meetings!W20,1)-1)))),\"\")","v":"Wingatui"},{"$f":"IF(Meetings!W20=\"\",\"\",getAddress(Meetings!W20))","v":"http://www.racingandsports.com.au/form-guide/meeting.asp?meeting=16413"},"16413"]
[{"$f":"IF(Race!N19<>\"\",(CLEAN(TRIM(Race!C19))),\"\")","v":"HURRICONI"},{"$f":"IF(A21<>\"\",Race!N19,\"\")","v":99},{"$f":"IF(A21<>\"\",Race!I19,\"\")","v":6},null,null,"ALBION PARK",{"$f":"IF(Meetings!B22=\"\",\"\",Meetings!B22)","v":"ALBION PARK (BG)"},{"$f":"IF(Meetings!D22=\"\",\"\",getAddress(Meetings!D22))","v":"http://www.tabonline.com.au/2011/04/01/BG01.html"},{"$f":"IF(Meetings!E22=\"\",\"\",getAddress(Meetings!E22))","v":"http://www.tabonline.com.au/2011/04/01/BG02.html"},{"$f":"IF(Meetings!F22=\"\",\"\",getAddress(Meetings!F22))","v":"http://www.tabonline.com.au/2011/04/01/BG03.html"},{"$f":"IF(Meetings!G22=\"\",\"\",getAddress(Meetings!G22))","v":"http://www.tabonline.com.au/2011/04/01/BG04.html"},{"$f":"IF(Meetings!H22=\"\",\"\",getAddress(Meetings!H22))","v":"http://www.tabonline.com.au/2011/04/01/BG05.html"},{"$f":"IF(Meetings!I22=\"\",\"\",getAddress(Meetings!I22))","v":"http://www.tabonline.com.au/2011/04/01/BG06.html"},{"$f":"IF(Meetings!J22=\"\",\"\",getAddress(Meetings!J22))","v":"http://www.tabonline.com.au/2011/04/01/BG07.html"},{"$f":"IF(Meetings!K22=\"\",\"\",getAddress(Meetings!K22))","v":"http://www.tabonline.com.au/2011/04/01/BG08.html"},{"$f":"IF(Meetings!L22=\"\",\"\",getAddress(Meetings!L22))","v":"http://www.tabonline.com.au/2011/04/01/BG09.html"},{"$f":"IF(Meetings!M22=\"\",\"\",getAddress(Meetings!M22))","v":"http://www.tabonline.com.au/2011/04/01/BG10.html"},{"$f":"IF(Meetings!N22=\"\",\"\",getAddress(Meetings!N22))","v":""},{"$f":"IF(Meetings!O22=\"\",\"\",getAddress(Meetings!O22))","v":""},null,{"$f":"COUNTA(Meetings!D22:'Meetings'!O22)","v":10},{"$f":"IF(W21<>\"\",IF(ISERROR(CLEAN(TRIM((LEFT(Meetings!W21,FIND(\"-\",Meetings!W21,1)-1))))),CLEAN(TRIM(Meetings!W21)),CLEAN(TRIM(LEFT(Meetings!W21,FIND(\"-\",Meetings!W21,1)-1)))),\"\")","v":""},{"$f":"IF(Meetings!W21=\"\",\"\",getAddress(Meetings!W21))","v":""},""]
[{"$f":"IF(Race!N20<>\"\",(CLEAN(TRIM(Race!C20))),\"\")","v":"PARAMOUNT PETE"},{"$f":"IF(A22<>\"\",Race!N20,\"\")","v":97},{"$f":"IF(A22<>\"\",Race!I20,\"\")","v":5},null,null,"WENTWORTH PARK",{"$f":"IF(Meetings!B23=\"\",\"\",Meetings!B23)","v":"WENTWORTH PARK (SG)"},{"$f":"IF(Meetings!D23=\"\",\"\",getAddress(Meetings!D23))","v":"http://www.tabonline.com.au/2011/04/01/SG01.html"},{"$f":"IF(Meetings!E23=\"\",\"\",getAddress(Meetings!E23))","v":"http://www.tabonline.com.au/2011/04/01/SG02.html"},{"$f":"IF(Meetings!F23=\"\",\"\",getAddress(Meetings!F23))","v":"http://www.tabonline.com.au/2011/04/01/SG03.html"},{"$f":"IF(Meetings!G23=\"\",\"\",getAddress(Meetings!G23))","v":"http://www.tabonline.com.au/2011/04/01/SG04.html"},{"$f":"IF(Meetings!H23=\"\",\"\",getAddress(Meetings!H23))","v":"http://www.tabonline.com.au/2011/04/01/SG05.html"},{"$f":"IF(Meetings!I23=\"\",\"\",getAddress(Meetings!I23))","v":"http://www.tabonline.com.au/2011/04/01/SG06.html"},{"$f":"IF(Meetings!J23=\"\",\"\",getAddress(Meetings!J23))","v":"http://www.tabonline.com.au/2011/04/01/SG07.html"},{"$f":"IF(Meetings!K23=\"\",\"\",getAddress(Meetings!K23))","v":"http://www.tabonline.com.au/2011/04/01/SG08.html"},{"$f":"IF(Meetings!L23=\"\",\"\",getAddress(Meetings!L23))","v":"http://www.tabonline.com.au/2011/04/01/SG09.html"},{"$f":"IF(Meetings!M23=\"\",\"\",getAddress(Meetings!M23))","v":"http://www.tabonline.com.au/2011/04/01/SG10.html"},{"$f":"IF(Meetings!N23=\"\",\"\",getAddress(Meetings!N23))","v":""},{"$f":"IF(Meetings!O23=\"\",\"\",getAddress(Meetings!O23))","v":""},null,{"$f":"COUNTA(Meetings!D23:'Meetings'!O23)","v":10},{"$f":"IF(W22<>\"\",IF(ISERROR(CLEAN(TRIM((LEFT(Meetings!W22,FIND(\"-\",Meetings!W22,1)-1))))),CLEAN(TRIM(Meetings!W22)),CLEAN(TRIM(LEFT(Meetings!W22,FIND(\"-\",Meetings!W22,1)-1)))),\"\")","v":""},{"$f":"IF(Meetings!W22=\"\",\"\",getAddress(Meetings!W22))","v":""},""]
[{"$f":"IF(Race!N21<>\"\",(CLEAN(TRIM(Race!C21))),\"\")","v":""},{"$f":"IF(A23<>\"\",Race!N21,\"\")","v":""},{"$f":"IF(A23<>\"\",Race!I21,\"\")","v":""},null,null,"BALLARAT",{"$f":"IF(Meetings!B24=\"\",\"\",Meetings!B24)","v":"BALLARAT (MG)"},{"$f":"IF(Meetings!D24=\"\",\"\",getAddress(Meetings!D24))","v":"http://www.tabonline.com.au/2011/04/01/MG01.html"},{"$f":"IF(Meetings!E24=\"\",\"\",getAddress(Meetings!E24))","v":"http://www.tabonline.com.au/2011/04/01/MG02.html"},{"$f":"IF(Meetings!F24=\"\",\"\",getAddress(Meetings!F24))","v":"http://www.tabonline.com.au/2011/04/01/MG03.html"},{"$f":"IF(Meetings!G24=\"\",\"\",getAddress(Meetings!G24))","v":"http://www.tabonline.com.au/2011/04/01/MG04.html"},{"$f":"IF(Meetings!H24=\"\",\"\",getAddress(Meetings!H24))","v":"http://www.tabonline.com.au/2011/04/01/MG05.html"},{"$f":"IF(Meetings!I24=\"\",\"\",getAddress(Meetings!I24))","v":"http://www.tabonline.com.au/2011/04/01/MG06.html"},{"$f":"IF(Meetings!J24=\"\",\"\",getAddress(Meetings!J24))","v":"http://www.tabonline.com.au/2011/04/01/MG07.html"},{"$f":"IF(Meetings!K24=\"\",\"\",getAddress(Meetings!K24))","v":"http://www.tabonline.com.au/2011/04/01/MG08.html"},{"$f":"IF(Meetings!L24=\"\",\"\",getAddress(Meetings!L24))","v":"http://www.tabonline.com.au/2011/04/01/MG09.html"},{"$f":"IF(Meetings!M24=\"\",\"\",getAddress(Meetings!M24))","v":"http://www.tabonline.com.au/2011/04/01/MG10.html"},{"$f":"IF(Meetings!N24=\"\",\"\",getAddress(Meetings!N24))","v":"http://www.tabonline.com.au/2011/04/01/MG11.html"},{"$f":"IF(Meetings!O24=\"\",\"\",getAddress(Meetings!O24))","v":"http://www.tabonline.com.au/2011/04/01/MG12.html"},null,{"$f":"COUNTA(Meetings!D24:'Meetings'!O24)","v":12},{"$f":"IF(W23<>\"\",IF(ISERROR(CLEAN(TRIM((LEFT(Meetings!W23,FIND(\"-\",Meetings!W23,1)-1))))),CLEAN(TRIM(Meetings!W23)),CLEAN(TRIM(LEFT(Meetings!W23,FIND(\"-\",Meetings!W23,1)-1)))),\"\")","v":"Kranji"},{"$f":"IF(Meetings!W23=\"\",\"\",getAddress(Meetings!W23))","v":"http://www.racingandsports.com.au/form-guide/meeting.asp?meeting=16411"},"16411"]
[{"$f":"IF(Race!N22<>\"\",(CLEAN(TRIM(Race!C22))),\"\")","v":"BUSH BRANDY"},{"$f":"IF(A24<>\"\",Race!N22,\"\")","v":98},{"$f":"IF(A24<>\"\",Race!I22,\"\")","v":9},null,null,"THE GARDENS",{"$f":"IF(Meetings!B25=\"\",\"\",Meetings!B25)","v":"THE GARDENS (NG)"},{"$f":"IF(Meetings!D25=\"\",\"\",getAddress(Meetings!D25))","v":"http://www.tabonline.com.au/2011/04/01/NG01.html"},{"$f":"IF(Meetings!E25=\"\",\"\",getAddress(Meetings!E25))","v":"http://www.tabonline.com.au/2011/04/01/NG02.html"},{"$f":"IF(Meetings!F25=\"\",\"\",getAddress(Meetings!F25))","v":"http://www.tabonline.com.au/2011/04/01/NG03.html"},{"$f":"IF(Meetings!G25=\"\",\"\",getAddress(Meetings!G25))","v":"http://www.tabonline.com.au/2011/04/01/NG04.html"},{"$f":"IF(Meetings!H25=\"\",\"\",getAddress(Meetings!H25))","v":"http://www.tabonline.com.au/2011/04/01/NG05.html"},{"$f":"IF(Meetings!I25=\"\",\"\",getAddress(Meetings!I25))","v":"http://www.tabonline.com.au/2011/04/01/NG06.html"},{"$f":"IF(Meetings!J25=\"\",\"\",getAddress(Meetings!J25))","v":"http://www.tabonline.com.au/2011/04/01/NG07.html"},{"$f":"IF(Meetings!K25=\"\",\"\",getAddress(Meetings!K25))","v":"http://www.tabonline.com.au/2011/04/01/NG08.html"},{"$f":"IF(Meetings!L25=\"\",\"\",getAddress(Meetings!L25))","v":"http://www.tabonline.com.au/2011/04/01/NG09.html"},{"$f":"IF(Meetings!M25=\"\",\"\",getAddress(Meetings!M25))","v":"http://www.tabonline.com.au/2011/04/01/NG10.html"},{"$f":"IF(Meetings!N25=\"\",\"\",getAddress(Meetings!N25))","v":""},{"$f":"IF(Meetings!O25=\"\",\"\",getAddress(Meetings!O25))","v":""},null,{"$f":"COUNTA(Meetings!D25:'Meetings'!O25)","v":10},{"$f":"IF(W24<>\"\",IF(ISERROR(CLEAN(TRIM((LEFT(Meetings!W24,FIND(\"-\",Meetings!W24,1)-1))))),CLEAN(TRIM(Meetings!W24)),CLEAN(TRIM(LEFT(Meetings!W24,FIND(\"-\",Meetings!W24,1)-1)))),\"\")","v":""},{"$f":"IF(Meetings!W24=\"\",\"\",getAddress(Meetings!W24))","v":""},""]
[{"$f":"IF(Race!N23<>\"\",(CLEAN(TRIM(Race!C23))),\"\")","v":"ANGELOS LUCKY BOY"},{"$f":"IF(A25<>\"\",Race!N23,\"\")","v":100},{"$f":"IF(A25<>\"\",Race!I23,\"\")","v":3},null,null,"TRARALGON",{"$f":"IF(Meetings!B26=\"\",\"\",Meetings!B26)","v":"TRARALGON (VG)"},{"$f":"IF(Meetings!D26=\"\",\"\",getAddress(Meetings!D26))","v":"http://www.tabonline.com.au/2011/04/01/VG01.html"},{"$f":"IF(Meetings!E26=\"\",\"\",getAddress(Meetings!E26))","v":"http://www.tabonline.com.au/2011/04/01/VG02.html"},{"$f":"IF(Meetings!F26=\"\",\"\",getAddress(Meetings!F26))","v":"http://www.tabonline.com.au/2011/04/01/VG03.html"},{"$f":"IF(Meetings!G26=\"\",\"\",getAddress(Meetings!G26))","v":"http://www.tabonline.com.au/2011/04/01/VG04.html"},{"$f":"IF(Meetings!H26=\"\",\"\",getAddress(Meetings!H26))","v":"http://www.tabonline.com.au/2011/04/01/VG05.html"},{"$f":"IF(Meetings!I26=\"\",\"\",getAddress(Meetings!I26))","v":"http://www.tabonline.com.au/2011/04/01/VG06.html"},{"$f":"IF(Meetings!J26=\"\",\"\",getAddress(Meetings!J26))","v":"http://www.tabonline.com.au/2011/04/01/VG07.html"},{"$f":"IF(Meetings!K26=\"\",\"\",getAddress(Meetings!K26))","v":"http://www.tabonline.com.au/2011/04/01/VG08.html"},{"$f":"IF(Meetings!L26=\"\",\"\",getAddress(Meetings!L26))","v":"http://www.tabonline.com.au/2011/04/01/VG09.html"},{"$f":"IF(Meetings!M26=\"\",\"\",getAddress(Meetings!M26))","v":"http://www.tabonline.com.au/2011/04/01/VG10.html"},{"$f":"IF(Meetings!N26=\"\",\"\",getAddress(Meetings!N26))","v":""},{"$f":"IF(Meetings!O26=\"\",\"\",getAddress(Meetings!O26))","v":""},null,{"$f":"COUNTA(Meetings!D26:'Meetings'!O26)","v":10},{"$f":"IF(W25<>\"\",IF(ISERROR(CLEAN(TRIM((LEFT(Meetings!W25,FIND(\"-\",Meetings!W25,1)-1))))),CLEAN(TRIM(Meetings!W25)),CLEAN(TRIM(LEFT(Meetings!W25,FIND(\"-\",Meetings!W25,1)-1)))),\"\")","v":""},{"$f":"IF(Meetings!W25=\"\",\"\",getAddress(Meetings!W25))","v":""},""]
[{"$f":"IF(Race!N24<>\"\",(CLEAN(TRIM(Race!C24))),\"\")","v":"HIGH TIME"},{"$f":"IF(A26<>\"\",Race!N24,\"\")","v":98},{"$f":"IF(A26<>\"\",Race!I24,\"\")","v":13},null,null,"CASINO",{"$f":"IF(Meetings!B27=\"\",\"\",Meetings!B27)","v":"CASINO (CG)"},{"$f":"IF(Meetings!D27=\"\",\"\",getAddress(Meetings!D27))","v":"http://www.tabonline.com.au/2011/04/01/CG01.html"},{"$f":"IF(Meetings!E27=\"\",\"\",getAddress(Meetings!E27))","v":"http://www.tabonline.com.au/2011/04/01/CG02.html"},{"$f":"IF(Meetings!F27=\"\",\"\",getAddress(Meetings!F27))","v":"http://www.tabonline.com.au/2011/04/01/CG03.html"},{"$f":"IF(Meetings!G27=\"\",\"\",getAddress(Meetings!G27))","v":"http://www.tabonline.com.au/2011/04/01/CG04.html"},{"$f":"IF(Meetings!H27=\"\",\"\",getAddress(Meetings!H27))","v":"http://www.tabonline.com.au/2011/04/01/CG05.html"},{"$f":"IF(Meetings!I27=\"\",\"\",getAddress(Meetings!I27))","v":"http://www.tabonline.com.au/2011/04/01/CG06.html"},{"$f":"IF(Meetings!J27=\"\",\"\",getAddress(Meetings!J27))","v":"http://www.tabonline.com.au/2011/04/01/CG07.html"},{"$f":"IF(Meetings!K27=\"\",\"\",getAddress(Meetings!K27))","v":"http://www.tabonline.com.au/2011/04/01/CG08.html"},{"$f":"IF(Meetings!L27=\"\",\"\",getAddress(Meetings!L27))","v":"http://www.tabonline.com.au/2011/04/01/CG09.html"},{"$f":"IF(Meetings!M27=\"\",\"\",getAddress(Meetings!M27))","v":"http://www.tabonline.com.au/2011/04/01/CG10.html"},{"$f":"IF(Meetings!N27=\"\",\"\",getAddress(Meetings!N27))","v":"http://www.tabonline.com.au/2011/04/01/CG11.html"},{"$f":"IF(Meetings!O27=\"\",\"\",getAddress(Meetings!O27))","v":"http://www.tabonline.com.au/2011/04/01/CG12.html"},null,{"$f":"COUNTA(Meetings!D27:'Meetings'!O27)","v":12},{"$f":"IF(W26<>\"\",IF(ISERROR(CLEAN(TRIM((LEFT(Meetings!W26,FIND(\"-\",Meetings!W26,1)-1))))),CLEAN(TRIM(Meetings!W26)),CLEAN(TRIM(LEFT(Meetings!W26,FIND(\"-\",Meetings!W26,1)-1)))),\"\")","v":"Fairview"},{"$f":"IF(Meetings!W26=\"\",\"\",getAddress(Meetings!W26))","v":"http://www.racingandsports.com.au/form-guide/meeting.asp?meeting=16390"},"16390"]
[{"$f":"IF(Race!N25<>\"\",(CLEAN(TRIM(Race!C25))),\"\")","v":"PIN THE TAIL"},{"$f":"IF(A27<>\"\",Race!N25,\"\")","v":79},{"$f":"IF(A27<>\"\",Race!I25,\"\")","v":11},null,null,"MANDURAH",{"$f":"IF(Meetings!B28=\"\",\"\",Meetings!B28)","v":"MANDURAH (PG)"},{"$f":"IF(Meetings!D28=\"\",\"\",getAddress(Meetings!D28))","v":"http://www.tabonline.com.au/2011/04/01/PG01.html"},{"$f":"IF(Meetings!E28=\"\",\"\",getAddress(Meetings!E28))","v":"http://www.tabonline.com.au/2011/04/01/PG02.html"},{"$f":"IF(Meetings!F28=\"\",\"\",getAddress(Meetings!F28))","v":"http://www.tabonline.com.au/2011/04/01/PG03.html"},{"$f":"IF(Meetings!G28=\"\",\"\",getAddress(Meetings!G28))","v":"http://www.tabonline.com.au/2011/04/01/PG04.html"},{"$f":"IF(Meetings!H28=\"\",\"\",getAddress(Meetings!H28))","v":"http://www.tabonline.com.au/2011/04/01/PG05.html"},{"$f":"IF(Meetings!I28=\"\",\"\",getAddress(Meetings!I28))","v":"http://www.tabonline.com.au/2011/04/01/PG06.html"},{"$f":"IF(Meetings!J28=\"\",\"\",getAddress(Meetings!J28))","v":"http://www.tabonline.com.au/2011/04/01/PG07.html"},{"$f":"IF(Meetings!K28=\"\",\"\",getAddress(Meetings!K28))","v":"http://www.tabonline.com.au/2011/04/01/PG08.html"},{"$f":"IF(Meetings!L28=\"\",\"\",getAddress(Meetings!L28))","v":"http://www.tabonline.com.au/2011/04/01/PG09.html"},{"$f":"IF(Meetings!M28=\"\",\"\",getAddress(Meetings!M28))","v":"http://www.tabonline.com.au/2011/04/01/PG10.html"},{"$f":"IF(Meetings!N28=\"\",\"\",getAddress(Meetings!N28))","v":"http://www.tabonline.com.au/2011/04/01/PG11.html"},{"$f":"IF(Meetings!O28=\"\",\"\",getAddress(Meetings!O28))","v":"http://www.tabonline.com.au/2011/04/01/PG12.html"},null,{"$f":"COUNTA(Meetings!D28:'Meetings'!O28)","v":12},{"$f":"IF(W27<>\"\",IF(ISERROR(CLEAN(TRIM((LEFT(Meetings!W27,FIND(\"-\",Meetings!W27,1)-1))))),CLEAN(TRIM(Meetings!W27)),CLEAN(TRIM(LEFT(Meetings!W27,FIND(\"-\",Meetings!W27,1)-1)))),\"\")","v":""},{"$f":"IF(Meetings!W27=\"\",\"\",getAddress(Meetings!W27))","v":""},""]
[{"$f":"IF(Race!N26<>\"\",(CLEAN(TRIM(Race!C26))),\"\")","v":"ACQUEST"},{"$f":"IF(A28<>\"\",Race!N26,\"\")","v":96},{"$f":"IF(A28<>\"\",Race!I26,\"\")","v":2},null,null,"ADDINGTON",{"$f":"IF(Meetings!B29=\"\",\"\",Meetings!B29)","v":"ADDINGTON (OG)"},{"$f":"IF(Meetings!D29=\"\",\"\",getAddress(Meetings!D29))","v":"http://www.tabonline.com.au/2011/04/01/OG01.html"},{"$f":"IF(Meetings!E29=\"\",\"\",getAddress(Meetings!E29))","v":"http://www.tabonline.com.au/2011/04/01/OG02.html"},{"$f":"IF(Meetings!F29=\"\",\"\",getAddress(Meetings!F29))","v":"http://www.tabonline.com.au/2011/04/01/OG03.html"},{"$f":"IF(Meetings!G29=\"\",\"\",getAddress(Meetings!G29))","v":"http://www.tabonline.com.au/2011/04/01/OG04.html"},{"$f":"IF(Meetings!H29=\"\",\"\",getAddress(Meetings!H29))","v":"http://www.tabonline.com.au/2011/04/01/OG05.html"},{"$f":"IF(Meetings!I29=\"\",\"\",getAddress(Meetings!I29))","v":"http://www.tabonline.com.au/2011/04/01/OG06.html"},{"$f":"IF(Meetings!J29=\"\",\"\",getAddress(Meetings!J29))","v":"http://www.tabonline.com.au/2011/04/01/OG07.html"},{"$f":"IF(Meetings!K29=\"\",\"\",getAddress(Meetings!K29))","v":"http://www.tabonline.com.au/2011/04/01/OG08.html"},{"$f":"IF(Meetings!L29=\"\",\"\",getAddress(Meetings!L29))","v":"http://www.tabonline.com.au/2011/04/01/OG09.html"},{"$f":"IF(Meetings!M29=\"\",\"\",getAddress(Meetings!M29))","v":"http://www.tabonline.com.au/2011/04/01/OG10.html"},{"$f":"IF(Meetings!N29=\"\",\"\",getAddress(Meetings!N29))","v":"http://www.tabonline.com.au/2011/04/01/OG11.html"},{"$f":"IF(Meetings!O29=\"\",\"\",getAddress(Meetings!O29))","v":"http://www.tabonline.com.au/2011/04/01/OG12.html"},null,{"$f":"COUNTA(Meetings!D29:'Meetings'!O29)","v":12},{"$f":"IF(W28<>\"\",IF(ISERROR(CLEAN(TRIM((LEFT(Meetings!W28,FIND(\"-\",Meetings!W28,1)-1))))),CLEAN(TRIM(Meetings!W28)),CLEAN(TRIM(LEFT(Meetings!W28,FIND(\"-\",Meetings!W28,1)-1)))),\"\")","v":""},{"$f":"IF(Meetings!W28=\"\",\"\",getAddress(Meetings!W28))","v":""},""]
[{"$f":"IF(Race!N27<>\"\",(CLEAN(TRIM(Race!C27))),\"\")","v":"MURIALS SPIRIT"},{"$f":"IF(A29<>\"\",Race!N27,\"\")","v":99},{"$f":"IF(A29<>\"\",Race!I27,\"\")","v":7},null,null,"HATRICK",{"$f":"IF(Meetings!B30=\"\",\"\",Meetings!B30)","v":"HATRICK (ZG)"},{"$f":"IF(Meetings!D30=\"\",\"\",getAddress(Meetings!D30))","v":"http://www.tabonline.com.au/2011/04/01/ZG01.html"},{"$f":"IF(Meetings!E30=\"\",\"\",getAddress(Meetings!E30))","v":"http://www.tabonline.com.au/2011/04/01/ZG02.html"},{"$f":"IF(Meetings!F30=\"\",\"\",getAddress(Meetings!F30))","v":"http://www.tabonline.com.au/2011/04/01/ZG03.html"},{"$f":"IF(Meetings!G30=\"\",\"\",getAddress(Meetings!G30))","v":"http://www.tabonline.com.au/2011/04/01/ZG04.html"},{"$f":"IF(Meetings!H30=\"\",\"\",getAddress(Meetings!H30))","v":"http://www.tabonline.com.au/2011/04/01/ZG05.html"},{"$f":"IF(Meetings!I30=\"\",\"\",getAddress(Meetings!I30))","v":"http://www.tabonline.com.au/2011/04/01/ZG06.html"},{"$f":"IF(Meetings!J30=\"\",\"\",getAddress(Meetings!J30))","v":"http://www.tabonline.com.au/2011/04/01/ZG07.html"},{"$f":"IF(Meetings!K30=\"\",\"\",getAddress(Meetings!K30))","v":"http://www.tabonline.com.au/2011/04/01/ZG08.html"},{"$f":"IF(Meetings!L30=\"\",\"\",getAddress(Meetings!L30))","v":"http://www.tabonline.com.au/2011/04/01/ZG09.html"},{"$f":"IF(Meetings!M30=\"\",\"\",getAddress(Meetings!M30))","v":"http://www.tabonline.com.au/2011/04/01/ZG10.html"},{"$f":"IF(Meetings!N30=\"\",\"\",getAddress(Meetings!N30))","v":"http://www.tabonline.com.au/2011/04/01/ZG11.html"},{"$f":"IF(Meetings!O30=\"\",\"\",getAddress(Meetings!O30))","v":"http://www.tabonline.com.au/2011/04/01/ZG12.html"},null,{"$f":"COUNTA(Meetings!D30:'Meetings'!O30)","v":12},{"$f":"IF(W29<>\"\",IF(ISERROR(CLEAN(TRIM((LEFT(Meetings!W29,FIND(\"-\",Meetings!W29,1)-1))))),CLEAN(TRIM(Meetings!W29)),CLEAN(TRIM(LEFT(Meetings!W29,FIND(\"-\",Meetings!W29,1)-1)))),\"\")","v":"Wolverhampton"},{"$f":"IF(Meetings!W29=\"\",\"\",getAddress(Meetings!W29))","v":"http://www.racingandsports.com.au/form-guide/meeting.asp?meeting=16442"},"16442"]
[{"$f":"IF(Race!N28<>\"\",(CLEAN(TRIM(Race!C28))),\"\")","v":"RED RIVER"},{"$f":"IF(A30<>\"\",Race!N28,\"\")","v":96},{"$f":"IF(A30<>\"\",Race!I28,\"\")","v":4},null,null,"WINNELLIE PARK",{"$f":"IF(Meetings!B31=\"\",\"\",Meetings!B31)","v":"WINNELLIE PARK (DG)"},{"$f":"IF(Meetings!D31=\"\",\"\",getAddress(Meetings!D31))","v":"http://www.tabonline.com.au/2011/04/01/DG01.html"},{"$f":"IF(Meetings!E31=\"\",\"\",getAddress(Meetings!E31))","v":"http://www.tabonline.com.au/2011/04/01/DG02.html"},{"$f":"IF(Meetings!F31=\"\",\"\",getAddress(Meetings!F31))","v":"http://www.tabonline.com.au/2011/04/01/DG03.html"},{"$f":"IF(Meetings!G31=\"\",\"\",getAddress(Meetings!G31))","v":"http://www.tabonline.com.au/2011/04/01/DG04.html"},{"$f":"IF(Meetings!H31=\"\",\"\",getAddress(Meetings!H31))","v":"http://www.tabonline.com.au/2011/04/01/DG05.html"},{"$f":"IF(Meetings!I31=\"\",\"\",getAddress(Meetings!I31))","v":"http://www.tabonline.com.au/2011/04/01/DG06.html"},{"$f":"IF(Meetings!J31=\"\",\"\",getAddress(Meetings!J31))","v":"http://www.tabonline.com.au/2011/04/01/DG07.html"},{"$f":"IF(Meetings!K31=\"\",\"\",getAddress(Meetings!K31))","v":""},{"$f":"IF(Meetings!L31=\"\",\"\",getAddress(Meetings!L31))","v":""},{"$f":"IF(Meetings!M31=\"\",\"\",getAddress(Meetings!M31))","v":""},{"$f":"IF(Meetings!N31=\"\",\"\",getAddress(Meetings!N31))","v":""},{"$f":"IF(Meetings!O31=\"\",\"\",getAddress(Meetings!O31))","v":""},null,{"$f":"COUNTA(Meetings!D31:'Meetings'!O31)","v":7},{"$f":"IF(W30<>\"\",IF(ISERROR(CLEAN(TRIM((LEFT(Meetings!W30,FIND(\"-\",Meetings!W30,1)-1))))),CLEAN(TRIM(Meetings!W30)),CLEAN(TRIM(LEFT(Meetings!W30,FIND(\"-\",Meetings!W30,1)-1)))),\"\")","v":"Musselburgh"},{"$f":"IF(Meetings!W30=\"\",\"\",getAddress(Meetings!W30))","v":"http://www.racingandsports.com.au/form-guide/meeting.asp?meeting=16439"},"16439"]
[{"$f":"IF(Race!N29<>\"\",(CLEAN(TRIM(Race!C29))),\"\")","v":"LADY MYSTIC"},{"$f":"IF(A31<>\"\",Race!N29,\"\")","v":95},{"$f":"IF(A31<>\"\",Race!I29,\"\")","v":14},null,null,"",{"$f":"IF(Meetings!B32=\"\",\"\",Meetings!B32)","v":""},{"$f":"IF(Meetings!D32=\"\",\"\",getAddress(Meetings!D32))","v":""},{"$f":"IF(Meetings!E32=\"\",\"\",getAddress(Meetings!E32))","v":""},{"$f":"IF(Meetings!F32=\"\",\"\",getAddress(Meetings!F32))","v":""},{"$f":"IF(Meetings!G32=\"\",\"\",getAddress(Meetings!G32))","v":""},{"$f":"IF(Meetings!H32=\"\",\"\",getAddress(Meetings!H32))","v":""},{"$f":"IF(Meetings!I32=\"\",\"\",getAddress(Meetings!I32))","v":""},{"$f":"IF(Meetings!J32=\"\",\"\",getAddress(Meetings!J32))","v":""},{"$f":"IF(Meetings!K32=\"\",\"\",getAddress(Meetings!K32))","v":""},{"$f":"IF(Meetings!L32=\"\",\"\",getAddress(Meetings!L32))","v":""},{"$f":"IF(Meetings!M32=\"\",\"\",getAddress(Meetings!M32))","v":""},{"$f":"IF(Meetings!N32=\"\",\"\",getAddress(Meetings!N32))","v":""},{"$f":"IF(Meetings!O32=\"\",\"\",getAddress(Meetings!O32))","v":""},null,{"$f":"COUNTA(Meetings!D32:'Meetings'!O32)","v":0},{"$f":"IF(W31<>\"\",IF(ISERROR(CLEAN(TRIM((LEFT(Meetings!W31,FIND(\"-\",Meetings!W31,1)-1))))),CLEAN(TRIM(Meetings!W31)),CLEAN(TRIM(LEFT(Meetings!W31,FIND(\"-\",Meetings!W31,1)-1)))),\"\")","v":""},{"$f":"IF(Meetings!W31=\"\",\"\",getAddress(Meetings!W31))","v":""},""]
[{"$f":"IF(Race!N30<>\"\",(CLEAN(TRIM(Race!C30))),\"\")","v":""},{"$f":"IF(A32<>\"\",Race!N30,\"\")","v":""},{"$f":"IF(A32<>\"\",Race!I30,\"\")","v":""},null,null,"",{"$f":"IF(Meetings!B33=\"\",\"\",Meetings!B33)","v":""},{"$f":"IF(Meetings!D33=\"\",\"\",getAddress(Meetings!D33))","v":""},{"$f":"IF(Meetings!E33=\"\",\"\",getAddress(Meetings!E33))","v":""},{"$f":"IF(Meetings!F33=\"\",\"\",getAddress(Meetings!F33))","v":""},{"$f":"IF(Meetings!G33=\"\",\"\",getAddress(Meetings!G33))","v":""},{"$f":"IF(Meetings!H33=\"\",\"\",getAddress(Meetings!H33))","v":""},{"$f":"IF(Meetings!I33=\"\",\"\",getAddress(Meetings!I33))","v":""},{"$f":"IF(Meetings!J33=\"\",\"\",getAddress(Meetings!J33))","v":""},{"$f":"IF(Meetings!K33=\"\",\"\",getAddress(Meetings!K33))","v":""},{"$f":"IF(Meetings!L33=\"\",\"\",getAddress(Meetings!L33))","v":""},{"$f":"IF(Meetings!M33=\"\",\"\",getAddress(Meetings!M33))","v":""},{"$f":"IF(Meetings!N33=\"\",\"\",getAddress(Meetings!N33))","v":""},{"$f":"IF(Meetings!O33=\"\",\"\",getAddress(Meetings!O33))","v":""},null,{"$f":"COUNTA(Meetings!D33:'Meetings'!O33)","v":0},{"$f":"IF(W32<>\"\",IF(ISERROR(CLEAN(TRIM((LEFT(Meetings!W32,FIND(\"-\",Meetings!W32,1)-1))))),CLEAN(TRIM(Meetings!W32)),CLEAN(TRIM(LEFT(Meetings!W32,FIND(\"-\",Meetings!W32,1)-1)))),\"\")","v":""},{"$f":"IF(Meetings!W32=\"\",\"\",getAddress(Meetings!W32))","v":""},""]
[{"$f":"IF(Race!N31<>\"\",(CLEAN(TRIM(Race!C31))),\"\")","v":"DEXTER'S ANGEL"},{"$f":"IF(A33<>\"\",Race!N31,\"\")","v":92},{"$f":"IF(A33<>\"\",Race!I31,\"\")","v":8},null,null,"",{"$f":"IF(Meetings!B34=\"\",\"\",Meetings!B34)","v":""},{"$f":"IF(Meetings!D34=\"\",\"\",getAddress(Meetings!D34))","v":""},{"$f":"IF(Meetings!E34=\"\",\"\",getAddress(Meetings!E34))","v":""},{"$f":"IF(Meetings!F34=\"\",\"\",getAddress(Meetings!F34))","v":""},{"$f":"IF(Meetings!G34=\"\",\"\",getAddress(Meetings!G34))","v":""},{"$f":"IF(Meetings!H34=\"\",\"\",getAddress(Meetings!H34))","v":""},{"$f":"IF(Meetings!I34=\"\",\"\",getAddress(Meetings!I34))","v":""},{"$f":"IF(Meetings!J34=\"\",\"\",getAddress(Meetings!J34))","v":""},{"$f":"IF(Meetings!K34=\"\",\"\",getAddress(Meetings!K34))","v":""},{"$f":"IF(Meetings!L34=\"\",\"\",getAddress(Meetings!L34))","v":""},{"$f":"IF(Meetings!M34=\"\",\"\",getAddress(Meetings!M34))","v":""},{"$f":"IF(Meetings!N34=\"\",\"\",getAddress(Meetings!N34))","v":""},{"$f":"IF(Meetings!O34=\"\",\"\",getAddress(Meetings!O34))","v":""},null,{"$f":"COUNTA(Meetings!D34:'Meetings'!O34)","v":0},{"$f":"IF(W33<>\"\",IF(ISERROR(CLEAN(TRIM((LEFT(Meetings!W33,FIND(\"-\",Meetings!W33,1)-1))))),CLEAN(TRIM(Meetings!W33)),CLEAN(TRIM(LEFT(Meetings!W33,FIND(\"-\",Meetings!W33,1)-1)))),\"\")","v":""},{"$f":"IF(Meetings!W33=\"\",\"\",getAddress(Meetings!W33))","v":""},""]
[{"$f":"IF(Race!N32<>\"\",(CLEAN(TRIM(Race!C32))),\"\")","v":"KONEDOBU"},{"$f":"IF(A34<>\"\",Race!N32,\"\")","v":92},{"$f":"IF(A34<>\"\",Race!I32,\"\")","v":10},{"$nulls":4},{"$f":"IF(Meetings!D36=\"\",\"\",getAddress(Meetings!D36))","v":""},{"$f":"IF(Meetings!E36=\"\",\"\",getAddress(Meetings!E36))","v":""},{"$f":"IF(Meetings!F36=\"\",\"\",getAddress(Meetings!F36))","v":""},{"$f":"IF(Meetings!G36=\"\",\"\",getAddress(Meetings!G36))","v":""},{"$f":"IF(Meetings!H36=\"\",\"\",getAddress(Meetings!H36))","v":""},{"$f":"IF(Meetings!I36=\"\",\"\",getAddress(Meetings!I36))","v":""},{"$f":"IF(Meetings!J36=\"\",\"\",getAddress(Meetings!J36))","v":""},{"$f":"IF(Meetings!K36=\"\",\"\",getAddress(Meetings!K36))","v":""},{"$f":"IF(Meetings!L36=\"\",\"\",getAddress(Meetings!L36))","v":""},{"$f":"IF(Meetings!M36=\"\",\"\",getAddress(Meetings!M36))","v":""},null,null,null,{"$f":"COUNTA(Meetings!D35:'Meetings'!O35)","v":0},{"$f":"IF(W34<>\"\",IF(ISERROR(CLEAN(TRIM((LEFT(Meetings!W34,FIND(\"-\",Meetings!W34,1)-1))))),CLEAN(TRIM(Meetings!W34)),CLEAN(TRIM(LEFT(Meetings!W34,FIND(\"-\",Meetings!W34,1)-1)))),\"\")","v":""},{"$f":"IF(Meetings!W34=\"\",\"\",getAddress(Meetings!W34))","v":""},""]
[{"$f":"IF(Race!N33<>\"\",(CLEAN(TRIM(Race!C33))),\"\")","v":"PLANET ICE"},{"$f":"IF(A35<>\"\",Race!N33,\"\")","v":94},{"$f":"IF(A35<>\"\",Race!I33,\"\")","v":12},{"$nulls":4},{"$f":"IF(Meetings!D37=\"\",\"\",getAddress(Meetings!D37))","v":""},{"$f":"IF(Meetings!E37=\"\",\"\",getAddress(Meetings!E37))","v":""},{"$f":"IF(Meetings!F37=\"\",\"\",getAddress(Meetings!F37))","v":""},{"$f":"IF(Meetings!G37=\"\",\"\",getAddress(Meetings!G37))","v":""},{"$f":"IF(Meetings!H37=\"\",\"\",getAddress(Meetings!H37))","v":""},{"$f":"IF(Meetings!I37=\"\",\"\",getAddress(Meetings!I37))","v":""},{"$f":"IF(Meetings!J37=\"\",\"\",getAddress(Meetings!J37))","v":""},{"$f":"IF(Meetings!K37=\"\",\"\",getAddress(Meetings!K37))","v":""},{"$f":"IF(Meetings!L37=\"\",\"\",getAddress(Meetings!L37))","v":""},{"$f":"IF(Meetings!M37=\"\",\"\",getAddress(Meetings!M37))","v":""},{"$nulls":4},{"$f":"IF(W35<>\"\",IF(ISERROR(CLEAN(TRIM((LEFT(Meetings!W35,FIND(\"-\",Meetings!W35,1)-1))))),CLEAN(TRIM(Meetings!W35)),CLEAN(TRIM(LEFT(Meetings!W35,FIND(\"-\",Meetings!W35,1)-1)))),\"\")","v":""},{"$f":"IF(Meetings!W35=\"\",\"\",getAddress(Meetings!W35))","v":""},""]
[{"$f":"IF(Race!N34<>\"\",(CLEAN(TRIM(Race!C34))),\"\")","v":""},{"$f":"IF(A36<>\"\",Race!N34,\"\")","v":""},{"$f":"IF(A36<>\"\",Race!I34,\"\")","v":""},{"$nulls":4},{"$f":"IF(Meetings!D38=\"\",\"\",getAddress(Meetings!D38))","v":""},{"$f":"IF(Meetings!E38=\"\",\"\",getAddress(Meetings!E38))","v":""},{"$f":"IF(Meetings!F38=\"\",\"\",getAddress(Meetings!F38))","v":""},{"$f":"IF(Meetings!G38=\"\",\"\",getAddress(Meetings!G38))","v":""},{"$f":"IF(Meetings!H38=\"\",\"\",getAddress(Meetings!H38))","v":""},{"$f":"IF(Meetings!I38=\"\",\"\",getAddress(Meetings!I38))","v":""},{"$f":"IF(Meetings!J38=\"\",\"\",getAddress(Meetings!J38))","v":""},{"$f":"IF(Meetings!K38=\"\",\"\",getAddress(Meetings!K38))","v":""},{"$f":"IF(Meetings!L38=\"\",\"\",getAddress(Meetings!L38))","v":""},{"$f":"IF(Meetings!M38=\"\",\"\",getAddress(Meetings!M38))","v":""},{"$nulls":4},{"$f":"IF(W36<>\"\",IF(ISERROR(CLEAN(TRIM((LEFT(Meetings!W36,FIND(\"-\",Meetings!W36,1)-1))))),CLEAN(TRIM(Meetings!W36)),CLEAN(TRIM(LEFT(Meetings!W36,FIND(\"-\",Meetings!W36,1)-1)))),\"\")","v":""},{"$f":"IF(Meetings!W36=\"\",\"\",getAddress(Meetings!W36))","v":""},""]
[null,null,{"$f":"IF(A37<>\"\",Race!I35,\"\")","v":""},{"$nulls":4},{"$f":"IF(Meetings!D39=\"\",\"\",getAddress(Meetings!D39))","v":""},{"$f":"IF(Meetings!E39=\"\",\"\",getAddress(Meetings!E39))","v":""},{"$f":"IF(Meetings!F39=\"\",\"\",getAddress(Meetings!F39))","v":""},{"$f":"IF(Meetings!G39=\"\",\"\",getAddress(Meetings!G39))","v":""},{"$f":"IF(Meetings!H39=\"\",\"\",getAddress(Meetings!H39))","v":""},{"$f":"IF(Meetings!I39=\"\",\"\",getAddress(Meetings!I39))","v":""},{"$f":"IF(Meetings!J39=\"\",\"\",getAddress(Meetings!J39))","v":""},{"$f":"IF(Meetings!K39=\"\",\"\",getAddress(Meetings!K39))","v":""},{"$f":"IF(Meetings!L39=\"\",\"\",getAddress(Meetings!L39))","v":""},{"$f":"IF(Meetings!M39=\"\",\"\",getAddress(Meetings!M39))","v":""},{"$nulls":4},{"$f":"IF(W37<>\"\",IF(ISERROR(CLEAN(TRIM((LEFT(Meetings!W37,FIND(\"-\",Meetings!W37,1)-1))))),CLEAN(TRIM(Meetings!W37)),CLEAN(TRIM(LEFT(Meetings!W37,FIND(\"-\",Meetings!W37,1)-1)))),\"\")","v":"Alice Springs"},{"$f":"IF(Meetings!W37=\"\",\"\",getAddress(Meetings!W37))","v":"http://www.racingandsports.com.au/form-guide/meeting.asp?meeting=16420"},"16420"]
[null,null,{"$f":"IF(A38<>\"\",Race!I36,\"\")","v":""},{"$nulls":4},{"$f":"IF(Meetings!D40=\"\",\"\",getAddress(Meetings!D40))","v":""},{"$f":"IF(Meetings!E40=\"\",\"\",getAddress(Meetings!E40))","v":""},{"$f":"IF(Meetings!F40=\"\",\"\",getAddress(Meetings!F40))","v":""},{"$f":"IF(Meetings!G40=\"\",\"\",getAddress(Meetings!G40))","v":""},{"$f":"IF(Meetings!H40=\"\",\"\",getAddress(Meetings!H40))","v":""},{"$f":"IF(Meetings!I40=\"\",\"\",getAddress(Meetings!I40))","v":""},{"$f":"IF(Meetings!J40=\"\",\"\",getAddress(Meetings!J40))","v":""},{"$f":"IF(Meetings!K40=\"\",\"\",getAddress(Meetings!K40))","v":""},{"$f":"IF(Meetings!L40=\"\",\"\",getAddress(Meetings!L40))","v":""},{"$f":"IF(Meetings!M40=\"\",\"\",getAddress(Meetings!M40))","v":""},{"$nulls":4},{"$f":"IF(W38<>\"\",IF(ISERROR(CLEAN(TRIM((LEFT(Meetings!W38,FIND(\"-\",Meetings!W38,1)-1))))),CLEAN(TRIM(Meetings!W38)),CLEAN(TRIM(LEFT(Meetings!W38,FIND(\"-\",Meetings!W38,1)-1)))),\"\")","v":"Ascot"},{"$f":"IF(Meetings!W38=\"\",\"\",getAddress(Meetings!W38))","v":"http://www.racingandsports.com.au/form-guide/meeting.asp?meeting=16414"},"16414"]
[null,null,{"$f":"IF(A39<>\"\",Race!I37,\"\")","v":""},{"$nulls":4},{"$f":"IF(Meetings!D41=\"\",\"\",getAddress(Meetings!D41))","v":""},{"$f":"IF(Meetings!E41=\"\",\"\",getAddress(Meetings!E41))","v":""},{"$f":"IF(Meetings!F41=\"\",\"\",getAddress(Meetings!F41))","v":""},{"$f":"IF(Meetings!G41=\"\",\"\",getAddress(Meetings!G41))","v":""},{"$f":"IF(Meetings!H41=\"\",\"\",getAddress(Meetings!H41))","v":""},{"$f":"IF(Meetings!I41=\"\",\"\",getAddress(Meetings!I41))","v":""},{"$f":"IF(Meetings!J41=\"\",\"\",getAddress(Meetings!J41))","v":""},{"$f":"IF(Meetings!K41=\"\",\"\",getAddress(Meetings!K41))","v":""},{"$f":"IF(Meetings!L41=\"\",\"\",getAddress(Meetings!L41))","v":""},{"$f":"IF(Meetings!M41=\"\",\"\",getAddress(Meetings!M41))","v":""},{"$nulls":4},{"$f":"IF(W39<>\"\",IF(ISERROR(CLEAN(TRIM((LEFT(Meetings!W39,FIND(\"-\",Meetings!W39,1)-1))))),CLEAN(TRIM(Meetings!W39)),CLEAN(TRIM(LEFT(Meetings!W39,FIND(\"-\",Meetings!W39,1)-1)))),\"\")","v":"Ballarat"},{"$f":"IF(Meetings!W39=\"\",\"\",getAddress(Meetings!W39))","v":"http://www.racingandsports.com.au/form-guide/meeting.asp?meeting=16421"},"16421"]
[null,null,{"$f":"IF(A40<>\"\",Race!I38,\"\")","v":""},{"$nulls":4},{"$f":"IF(Meetings!D42=\"\",\"\",getAddress(Meetings!D42))","v":""},{"$f":"IF(Meetings!E42=\"\",\"\",getAddress(Meetings!E42))","v":""},{"$f":"IF(Meetings!F42=\"\",\"\",getAddress(Meetings!F42))","v":""},{"$f":"IF(Meetings!G42=\"\",\"\",getAddress(Meetings!G42))","v":""},{"$f":"IF(Meetings!H42=\"\",\"\",getAddress(Meetings!H42))","v":""},{"$f":"IF(Meetings!I42=\"\",\"\",getAddress(Meetings!I42))","v":""},{"$f":"IF(Meetings!J42=\"\",\"\",getAddress(Meetings!J42))","v":""},{"$f":"IF(Meetings!K42=\"\",\"\",getAddress(Meetings!K42))","v":""},{"$f":"IF(Meetings!L42=\"\",\"\",getAddress(Meetings!L42))","v":""},{"$f":"IF(Meetings!M42=\"\",\"\",getAddress(Meetings!M42))","v":""},{"$nulls":4},{"$f":"IF(W40<>\"\",IF(ISERROR(CLEAN(TRIM((LEFT(Meetings!W40,FIND(\"-\",Meetings!W40,1)-1))))),CLEAN(TRIM(Meetings!W40)),CLEAN(TRIM(LEFT(Meetings!W40,FIND(\"-\",Meetings!W40,1)-1)))),\"\")","v":"Eagle Farm"},{"$f":"IF(Meetings!W40=\"\",\"\",getAddress(Meetings!W40))","v":"http://www.racingandsports.com.au/form-guide/meeting.asp?meeting=16397"},"16397"]
[null,null,{"$f":"IF(A41<>\"\",Race!I39,\"\")","v":""},{"$nulls":4},{"$f":"IF(Meetings!D43=\"\",\"\",getAddress(Meetings!D43))","v":""},{"$f":"IF(Meetings!E43=\"\",\"\",getAddress(Meetings!E43))","v":""},{"$f":"IF(Meetings!F43=\"\",\"\",getAddress(Meetings!F43))","v":""},{"$f":"IF(Meetings!G43=\"\",\"\",getAddress(Meetings!G43))","v":""},{"$f":"IF(Meetings!H43=\"\",\"\",getAddress(Meetings!H43))","v":""},{"$f":"IF(Meetings!I43=\"\",\"\",getAddress(Meetings!I43))","v":""},{"$f":"IF(Meetings!J43=\"\",\"\",getAddress(Meetings!J43))","v":""},{"$f":"IF(Meetings!K43=\"\",\"\",getAddress(Meetings!K43))","v":""},{"$f":"IF(Meetings!L43=\"\",\"\",getAddress(Meetings!L43))","v":""},{"$f":"IF(Meetings!M43=\"\",\"\",getAddress(Meetings!M43))","v":""}]
[null,null,{"$f":"IF(A42<>\"\",Race!I40,\"\")","v":""},{"$nulls":4},{"$f":"IF(Meetings!D44=\"\",\"\",getAddress(Meetings!D44))","v":""},{"$f":"IF(Meetings!E44=\"\",\"\",getAddress(Meetings!E44))","v":""},{"$f":"IF(Meetings!F44=\"\",\"\",getAddress(Meetings!F44))","v":""},{"$f":"IF(Meetings!G44=\"\",\"\",getAddress(Meetings!G44))","v":""},{"$f":"IF(Meetings!H44=\"\",\"\",getAddress(Meetings!H44))","v":""},{"$f":"IF(Meetings!I44=\"\",\"\",getAddress(Meetings!I44))","v":""},{"$f":"IF(Meetings!J44=\"\",\"\",getAddress(Meetings!J44))","v":""},{"$f":"IF(Meetings!K44=\"\",\"\",getAddress(Meetings!K44))","v":""},{"$f":"IF(Meetings!L44=\"\",\"\",getAddress(Meetings!L44))","v":""},{"$f":"IF(Meetings!M44=\"\",\"\",getAddress(Meetings!M44))","v":""}]
[null,null,{"$f":"IF(A43<>\"\",Race!I41,\"\")","v":""},{"$nulls":4},{"$f":"IF(Meetings!D45=\"\",\"\",getAddress(Meetings!D45))","v":""},{"$f":"IF(Meetings!E45=\"\",\"\",getAddress(Meetings!E45))","v":""},{"$f":"IF(Meetings!F45=\"\",\"\",getAddress(Meetings!F45))","v":""},{"$f":"IF(Meetings!G45=\"\",\"\",getAddress(Meetings!G45))","v":""},{"$f":"IF(Meetings!H45=\"\",\"\",getAddress(Meetings!H45))","v":""},{"$f":"IF(Meetings!I45=\"\",\"\",getAddress(Meetings!I45))","v":""},{"$f":"IF(Meetings!J45=\"\",\"\",getAddress(Meetings!J45))","v":""},{"$f":"IF(Meetings!K45=\"\",\"\",getAddress(Meetings!K45))","v":""},{"$f":"IF(Meetings!L45=\"\",\"\",getAddress(Meetings!L45))","v":""},{"$f":"IF(Meetings!M45=\"\",\"\",getAddress(Meetings!M45))","v":""}]
[null,null,{"$f":"IF(A44<>\"\",Race!I42,\"\")","v":""},{"$nulls":4},{"$f":"IF(Meetings!D46=\"\",\"\",getAddress(Meetings!D46))","v":""},{"$f":"IF(Meetings!E46=\"\",\"\",getAddress(Meetings!E46))","v":""},{"$f":"IF(Meetings!F46=\"\",\"\",getAddress(Meetings!F46))","v":""},{"$f":"IF(Meetings!G46=\"\",\"\",getAddress(Meetings!G46))","v":""},{"$f":"IF(Meetings!H46=\"\",\"\",getAddress(Meetings!H46))","v":""},{"$f":"IF(Meetings!I46=\"\",\"\",getAddress(Meetings!I46))","v":""},{"$f":"IF(Meetings!J46=\"\",\"\",getAddress(Meetings!J46))","v":""},{"$f":"IF(Meetings!K46=\"\",\"\",getAddress(Meetings!K46))","v":""},{"$f":"IF(Meetings!L46=\"\",\"\",getAddress(Meetings!L46))","v":""},{"$f":"IF(Meetings!M46=\"\",\"\",getAddress(Meetings!M46))","v":""}]
[null,null,{"$f":"IF(A45<>\"\",Race!I43,\"\")","v":""},{"$nulls":4},{"$f":"IF(Meetings!D47=\"\",\"\",getAddress(Meetings!D47))","v":""},{"$f":"IF(Meetings!E47=\"\",\"\",getAddress(Meetings!E47))","v":""},{"$f":"IF(Meetings!F47=\"\",\"\",getAddress(Meetings!F47))","v":""},{"$f":"IF(Meetings!G47=\"\",\"\",getAddress(Meetings!G47))","v":""},{"$f":"IF(Meetings!H47=\"\",\"\",getAddress(Meetings!H47))","v":""},{"$f":"IF(Meetings!I47=\"\",\"\",getAddress(Meetings!I47))","v":""},{"$f":"IF(Meetings!J47=\"\",\"\",getAddress(Meetings!J47))","v":""},{"$f":"IF(Meetings!K47=\"\",\"\",getAddress(Meetings!K47))","v":""},{"$f":"IF(Meetings!L47=\"\",\"\",getAddress(Meetings!L47))","v":""},{"$f":"IF(Meetings!M47=\"\",\"\",getAddress(Meetings!M47))","v":""}]

{"sheet":"Instructions","index":2,"n_rows":10,"n_cols":2,"rows_kept":10,"cut":false,"hidden":false,"merged":[]}
[]
[]
[]
[]
[null,"Instructions"]
[]
[]
[null,"On the \"Neurals\" sheet press \"Start\" press \"OK\" for todays date or put in a date, there is a box on the right that has the days races, hightlight a race and press \"Select\"  then press the \"Import\" button,"]
[null,"the race will be imported, if the top Neurals selection is also the unitab top rated it will copy to the \"Selections\" sheet."]
[null,"Each race will cycle through for that meeting, when done change the meeting and the race numbers and press import again."]

{"sheet":"Meetings","index":3,"n_rows":153,"n_cols":41,"rows_kept":153,"cut":false,"hidden":false,"merged":[[0,54,150,54],[151,20,151,53],[139,26,139,28],[140,26,140,28],[150,28,150,30],[141,20,145,27],[141,28,141,30],[142,28,142,30],[143,28,143,30],[144,28,144,30],[145,28,145,30],[146,20,150,27],[146,28,146,30],[130,26,130,28],[131,26,131,28],[132,26,132,28],[133,26,133,28],[134,26,134,28],[135,26,135,28],[136,26,136,28],[137,26,137,28],[138,26,138,28],[121,26,121,28],[122,26,122,28],[123,26,123,28],[124,26,124,28],[125,26,125,28],[126,26,126,28],[127,26,127,28],[128,26,128,28],[129,26,129,28],[124,21,124,25],[130,20,130,25],[131,21,131,25],[133,20,133,25],[134,21,134,25],[136,20,136,25],[137,21,137,25],[139,20,139,21],[140,21,140,25],[89,20,89,21],[90,21,90,25],[91,20,91,25],[92,20,92,25],[98,20,98,21],[99,21,99,25],[121,20,121,25],[122,20,122,25],[123,20,123,25],[100,20,100,25],[59,20,59,25],[60,20,60,25],[61,21,61,25],[71,20,71,25],[72,21,72,25],[74,20,74,25],[75,21,75,25],[77,20,77,25],[78,21,78,25],[26,20,26,25],[30,20,30,21],[32,20,32,25],[33,20,33,25],[34,20,34,25],[35,21,35,25],[52,20,52,25],[56,20,56,21],[58,20,58,25],[114,26,114,28],[115,26,115,28],[116,26,116,28],[117,26,117,28],[118,26,118,28],[119,26,119,28],[120,26,120,28],[97,26,97,28],[98,26,98,28],[99,26,99,28],[103,26,103,28],[104,26,104,28],[105,26,105,28],[120,21,120,25],[78,26,78,28],[79,26,79,28],[80,26,80,28],[81,26,81,28],[82,26,82,28],[83,26,83,28],[84,26,84,28],[85,26,85,28],[86,26,86,28],[87,26,87,28],[88,26,88,28],[89,26,89,28],[90,26,90,28],[91,26,91,28],[92,26,92,28],[93,26,93,28],[80,20,80,21],[81,21,81,25],[84,20,84,25],[85,21,85,25],[109,26,109,28],[110,26,110,28],[111,26,111,28],[112,26,112,28],[113,26,113,28],[106,26,106,28],[107,26,107,28],[108,26,108,28],[119,20,119,21],[114,21,114,25],[116,20,116,25],[117,21,117,25],[93,20,93,25],[94,21,94,25],[101,20,101,25],[102,20,102,25],[103,20,103,25],[104,21,104,25],[110,20,110,25],[111,21,111,25],[113,20,113,25],[100,26,100,28],[101,26,101,28],[102,26,102,28],[73,26,73,28],[74,26,74,28],[75,26,75,28],[76,26,76,28],[77,26,77,28],[69,26,69,28],[70,26,70,28],[71,26,71,28],[72,26,72,28],[94,26,94,28],[95,26,95,28],[96,26,96,28],[44,26,44,28],[45,26,45,28],[46,26,46,28],[29,26,30,26],[32,26,33,26],[41,26,42,26],[47,26,47,28],[48,26,48,28],[49,26,49,28],[50,26,50,28],[51,26,51,28],[52,26,52,28],[58,26,58,28],[59,26,59,28],[60,26,60,28],[61,26,61,28],[62,26,62,28],[53,26,53,28],[54,26,54,28],[55,26,55,28],[56,26,56,28],[57,26,57,28],[68,26,68,28],[63,26,63,28],[64,26,64,28],[65,26,65,28],[66,26,66,28],[67,26,67,28],[53,21,53,25],[2,32,4,32],[2,20,2,30],[3,20,3,30],[4,20,4,30],[5,20,5,30],[7,20,7,53],[8,20,8,53],[14,26,14,28],[15,26,15,28],[6,31,6,37],[9,20,9,25],[10,20,10,25],[11,20,11,25],[12,21,12,25],[1,0,1,2],[0,20,0,30],[1,20,1,27],[1,28,1,30],[6,20,6,30],[23,26,23,28],[24,26,24,28],[21,26,21,28],[22,26,22,28],[11,0,11,2],[20,0,20,2],[17,20,17,25],[18,21,18,25],[20,20,20,25],[21,21,21,25],[23,20,23,25],[24,21,24,25],[0,19,150,19],[48,20,48,25],[57,21,57,25],[27,21,27,25],[31,21,31,25],[49,21,49,25],[82,20,82,25],[83,20,83,25]]}
[{"$nulls":20}," ",{"$nulls":10}," "," "," "]
["Races",null,null,1,2,3,4,5,6,7,8,9,10,11,12,{"$nulls":5}," ",{"$nulls":10}," ",null," "]
[null,"IPSWICH (BR)","Fields","3,9,6 F4","6,7,3 F4","4,10,11 F4","8,12,11 F4","4,1,3 F4","4,9,13 F4","4,13,6 F4",{"$nulls":21}," ",null," "]
[null,"GRAFTON (NR)","Fields","2,7,1 ","6,9,4 ","4,3,8 ","4,11,7 ","4,7,12 ","4,6,5 ","7,2,12 F4","3,8,1 F4","4,8,2 F4","5,2,4 F4",{"$nulls":18}," ",null," "]
[null,"MORNINGTON (VR)","Fields","2,8,7 ","5,9,8 ","11,1,12 ","7,6,2 ","1,5,4 ","4,5,13 F4","4,9,1 F4","5,12,7 F4","3,4,8 F4",{"$nulls":19}," ",null," "]
[null,"CANBERRA (CR)","Fields","8,7,5 ","5,1,2 ","1,3,6 ","5,4,9 ","1,5,13 F4","9,5,3 F4","8,3,5 F4","2,1,10 F4",{"$nulls":9}," ",{"$nulls":17},"Username",null,"Password"]
[null,"KRANJI (SS)","Fields","08:20:00","08:50:00","09:20:00","09:50:00","10:20:00","10:50:00","11:20:00","11:50:00","12:25am ","12:55am "]
[null,"FAIRVIEW (AS)","Fields","08:30:00","09:05:00","09:40:00","10:15:00","10:55:00","11:30:00","12:05am ","12:40am "]
[null,"NEWCASTLE (CS)","Fields","11:30:00","12:00am ","12:30am ","1:00am ","1:30am "]
[null,"ENGLAND (ES)","Fields","11:10:00","11:40:00","12:10am ","12:40am ","1:10am ",{"$nulls":18},"Horse Records"]
[null,"WINGATUI (ZS)","Fields","5,6,1 ","8,7,3 ","2,6,8 ","7,3,8 ","12,6,7 ","8,11,5 ","6,4,3 ","2,12,1 ","1,6,3 ","2,3,5 ",{"$nulls":7},"Friday, 1 April",{"$nulls":5},"Jockey Records"]
["Trots",null,null,1,2,3,4,5,6,7,8,9,10,11,12,{"$nulls":11},"Trainer Records"]
[null,"BANKSTOWN (ST)","Fields","1,7,8 ","Closed ","26m ","56m ","07:30:00","08:00:00","08:30:00","09:00:00",{"$nulls":10},"Australia",{"$nulls":4},"Stallion Records"]
[null,"MELTON (MT)","Fields","2,7,11 ","8m ","38m ","07:12:00","07:42:00","08:12:00","08:42:00","09:14:00",{"$nulls":11},"Grafton",null,"Shower or two. (Max: 26) Track: SLOW","Speed MapNeuralsWorksheetCustomised Form Guide","Course Records"]
[null,"GOLD COAST (QT)","Fields","20m F4","50m F4","7:24 F4","7:54 F4","8:24 F4","8:55 F4","9:25 F4",{"$nulls":12},"Ipswich",null,"A few showers, possible thunder. (Max: 27) Track: HVY","Speed MapNeuralsWorksheetCustomised Form Guide"]
[null,"BATHURST (NT)","Fields","8,2,1 ","1,9,4 ","6,7,5 ","5m ","35m ","07:09:00","07:39:00","08:09:00",{"$nulls":11},"Canberra",null,"Mostly clear. (Max: 24) Track: DEAD","Form Preview Speed MapNeuralsWorksheetCustomised Form Guide","Legend"]
[null,"MILDURA (VT)","Fields","2,5,8 ","9,11,8 ","6,4,2 ","8,2,3 ","8,7,9 ","2,1,7 ","6,2,5 ","2,5,7 ","7,3,2 ",{"$nulls":10},"Mornington",null,"Dry day. (Max: 23) Track: DEAD","Speed MapNeuralsWorksheetCustomised Form Guide","Form Preview","Form Preview"]
[null,"GLOBE DERBY (AT)","Fields","1m F4","31m F4","7:05 F4","7:35 F4","8:05 F4","8:35 F4","9:05 F4","9:35 F4",{"$nulls":15},"Neurals","Neurals"]
[null,"GLOUCESTER PARK (PT)","Fields","08:20:00","08:50:00","09:20:00","09:50:00","10:15:00","10:45:00","11:16:00","11:46:00","12:17am ","12:47am ",{"$nulls":8},"New Zealand",{"$nulls":4},"Worksheet","Worksheet"]
[null,"ALEXANDRA PARK (ZT)","Fields","10,9,8 ","1,3,8 ","9,4,1 ","12,8,11 F4","10,3,1 ","10,1,9 F4","16m F4","46m F4","07:20:00","07:50:00",{"$nulls":9},"Wingatui",null,"Clear (Max: 8) Track: SLOW","Speed MapNeuralsWorksheetCustomised Form Guide","Customised Form Guide","Customised Form Guide"]
["Greyhounds",null,null,1,2,3,4,5,6,7,8,9,10,11,12,{"$nulls":11},"Complete Form Service","Complete Form Service"]
[null,"ALBION PARK (BG)","Fields","3,1,7 F4","6,5,1 F4","4,8,7 F4","2,4,1 F4","8,7,3 F4","6,1,4 F4","1,2,3 F4","3,7,6 F4","4,7,1 F4","10,4,3 F4",{"$nulls":8},"Singapore"]
[null,"WENTWORTH PARK (SG)","Fields","5,7,6 ","5,3,1 ","13m ","36m ","54m ","07:17:00","07:40:00","07:58:00","08:17:00","08:40:00",{"$nulls":9},"Kranji",null,"Scattered Thunder Storms (Max: 31)","Form Preview Speed MapNeuralsWorksheetCustomised Form Guide"]
[null,"BALLARAT (MG)","Fields","6m ","24m ","43m ","07:10:00","07:28:00","07:47:00","08:10:00","08:28:00","08:47:00","09:10:00","09:32:00","09:48:00"]
[null,"THE GARDENS (NG)","Fields","7,2,4 ","3,4,1 ","2,6,1 ","3,2,6 ","2,8,4 ","4,2,5 ","6,3,4 ","8,1,2 ","8,6,3 ","3,6,5 ",{"$nulls":8},"South Africa",{"$nulls":4},"Media Centre"]
[null,"TRARALGON (VG)","Fields","2,5,7 ","1,5,7 ","6,5,2 ","5,8,6 ","6,8,1 ","2,6,4 ","8,3,5 ","7,1,8 ","1,4,8 ","3,8,6 ",{"$nulls":9},"Fairview",null,"Showers (Max: 24)","Speed MapNeuralsWorksheetCustomised Form Guide"]
[null,"CASINO (CG)","Fields","6,5,4 ","3,1,9 ","8,7,5 ","7,1,4 ","6,2,1 ","3,8,4 ","7,6,4 ","7,1,8 ","3,6,2 ","6,8,5 ","8,3,2 ","7,1,2 ",{"$nulls":11},"Punting Patto Moonee Valley 25th March 11"]
[null,"MANDURAH (PG)","Fields","09:12:00","09:30:00","09:46:00","10:05:00","10:27:00","10:42:00","11:02:00","11:27:00","11:42:00","11:57:00","12:12am ","12:32am ",{"$nulls":6},"United Kingdom",{"$nulls":5},"The Smarts with Tom Waterhouse 26/3/11"]
[null,"ADDINGTON (OG)","Fields","1,2,6 ","4,5,9 ","3,4,8 ","5,6,3 ","1,4,7 ","2,4,8 ","6,8,3 ","5,6,8 ","3,8,5 ","5,1,8 ","5,2,4 ","8,3,1 ",{"$nulls":7},"Wolverhampton",null,null,"Speed MapNeuralsWorksheetCustomised Form Guide",null,"Steve Moran Selects for 24/3/11"]
[null,"HATRICK (ZG)","Fields","1,3,7 ","6,4,7 ","3,5,7 ","4,2,3 ","6,4,8 ","4,5,8 ","2,1,4 ","3,2,1 ","4,7,3 ","8,5,6 ","3,7,1 ","1,4,3 ",{"$nulls":7},"Musselburgh",null,null,"Speed MapNeuralsWorksheetCustomised Form Guide"]
[null,"WINNELLIE PARK (DG)","Fields","08:09:00","08:29:00","08:49:00","09:09:00","09:34:00","09:59:00","10:23:00",{"$nulls":17},"Black Caviar and Peter Moody Moonee Valley Preview"]
[{"$nulls":27},"Aquanita Track Talk 24/03/11"]
[]
[{"$nulls":20},"Saturday, 2 April",{"$nulls":6},"Dubai Trackwork Thursday 24th March 2011"]
[{"$nulls":27},"Carl O'Callaghan talks about Kinsale King in Dubai 2011"]
[{"$nulls":21},"Australia",{"$nulls":5},"Saimee Jumaat talks to Craig Evans about Better Than Ever"]
[{"$nulls":22},"Alice Springs",null,"Sunny, dry. (Max: 28) Rail: True. Track: GOOD 3","Speed MapNeuralsWorksheetCustomised Form Guide",null,"Craig Evans speaks with Danny Beasley regarding Better Be The One in Dubai 2011"]
[{"$nulls":22},"Ascot",null,"Sunny. (Max: 31) Rail: Out 6m Track: GOOD 3","Speed MapNeuralsWorksheetCustomised Form Guide",null,"Craig Evans talks to Felix Coetzee about Rocket Man in Dubai 2011"]
[{"$nulls":22},"Ballarat",null,"Morning shower or two. (Max: 15) Rail: True Position Entire Circuit (Inside Track). Track: DEAD 4","Speed MapNeuralsWorksheetCustomised Form Guide",null,"Dubai World Cup Day preview - John Moore : Dim Sum & Sunny King"]
[{"$nulls":22},"Eagle Farm",null,"A few showers. (Max: 27) Rail: 3m 400-1000; True Remainder. Track: SLOW 7","Speed MapNeuralsWorksheetCustomised Form Guide",null,"Dubai World Cup Day preview - Herman Brown : Bankable & Sweet Ducky"]
[{"$nulls":22},"Gold Coast",null,"A few showers, local thunder (Max: 26) Rail: 3.5m Entire Course. Track: HEAVY 9","Speed MapNeuralsWorksheetCustomised Form Guide",null,"Fox Sports' Julian De Stoop on AFL's round one"]
[{"$nulls":22},"Kembla Grange",null,"Becoming windy. (Max: 23) Rail: True. Track: DEAD 5","Speed MapNeuralsWorksheetCustomised Form Guide",null,"Australian Grand Prix preview with Matt Clayton"]
[{"$nulls":22},"Moonee Valley",null,"Morning shower or two. (Max: 18) Rail: Out 5m Entire Circuit. (Pent: 4.55). Track: DEAD 4","Speed MapNeuralsWorksheetCustomised Form Guide",null,"Motorsport journalist Matthew Clayton previews the weekend's Australian Grand Prix in Melbourne."]
[{"$nulls":22},"Oakbank",null,"Fine day. (Max: 21) Rail: Out 3m from 600 to 400. Track: DEAD 4","Speed MapNeuralsWorksheetCustomised Form Guide",null,"Mark Webber tops opening Formula One practice"]
[{"$nulls":22},"Rosehill",null,"Becoming windy. (Max: 23) Rail: Out 4m Entire Circuit. Track: DEAD 5","Speed MapNeuralsWorksheetCustomised Form Guide"]
[{"$nulls":22},"Sapphire Coast",null,"Becoming windy. (Max: 23) Rail: True Position. Track: DEAD 4","Speed MapNeuralsWorksheetCustomised Form Guide"]
[{"$nulls":22},"Taree",null,"Afternoon shower or two. (Max: 26) Rail: Out 3m entire. Track: SLOW 6","Speed MapNeuralsWorksheetCustomised Form Guide"]
[{"$nulls":22},"Toowoomba Cushion",null,"A few showers. (Max: 27) Rail: True Track: GOOD 3","Speed MapNeuralsWorksheetCustomised Form Guide"]
[]
[{"$nulls":21},"New Zealand"]
[{"$nulls":22},"Awapuni",null,"Mostly Sunny (Max: 20) Rail: True Track: DEAD 4","Speed MapNeuralsWorksheetCustomised Form Guide"]
[{"$nulls":22},"Ellerslie",null,"Sunny (Max: 21) Rail: Out 10m Track: DEAD 5","Speed MapNeuralsWorksheetCustomised Form Guide"]
[]
[{"$nulls":21},"South Africa"]
[{"$nulls":22},"Turffontein Standside",null,"Afternoon Showers (Max: 24)","Speed MapNeuralsWorksheetCustomised Form Guide"]
[{"$nulls":22},"Kenilworth",null,"Mostly Sunny (Max: 22)","Speed MapNeuralsWorksheetCustomised Form Guide"]
[]
[]
[]
[{"$nulls":20},"Sunday, 3 April"]
[]
[{"$nulls":21},"Australia"]
[{"$nulls":22},"Ballarat",null,"Shower or two. (Max: 15) Rail: True Position Entire Circuit (Outside Track). Track: DEAD 4","Speed MapNeuralsWorksheetCustomised Form Guide"]
[{"$nulls":22},"Fannie Bay",null,"Showers and storms. (Max: 30) Rail: True Track: GOOD 3","Speed MapNeuralsWorksheetCustomised Form Guide"]
[{"$nulls":22},"Gundagai",null,"Mostly sunny. (Max: 25) Rail: True. Track: GOOD 3","Speed MapNeuralsWorksheetCustomised Form Guide"]
[{"$nulls":22},"Hobart",null,"Shower or two. (Max: 15) Rail: True. (Pent: 4.67). Track: DEAD 4","Speed MapNeuralsWorksheetCustomised Form Guide"]
[{"$nulls":22},"Mildura",null,"Sunny. (Max: 20) Rail: True Position Entire Circuit. Track: GOOD 3","Speed MapNeuralsWorksheetCustomised Form Guide"]
[{"$nulls":22},"Muswellbrook",null,"Mostly sunny. (Max: 25) Rail: Out 5m 1300m-240m; True remainder. Track: GOOD 3","Speed MapNeuralsWorksheetCustomised Form Guide"]
[{"$nulls":22},"Naracoorte",null,"Late shower or two. (Max: 18) Rail: True. Track: DEAD 5","Speed MapNeuralsWorksheetCustomised Form Guide"]
[{"$nulls":22},"Pinjarra",null,"Sunny. (Max: 32) Rail: True Track: GOOD 3","Speed MapNeuralsWorksheetCustomised Form Guide"]
[{"$nulls":22},"Sunshine Coast",null,"Shower or two. (Max: 27) Rail: 9m Entire Course. (Pent: 7.7). Track: HEAVY 9","Speed MapNeuralsWorksheetCustomised Form Guide"]
[]
[{"$nulls":21},"Hong Kong"]
[{"$nulls":22},"Sha Tin",null,"Mainly fine. (Max: 26)","Speed MapNeuralsWorksheetCustomised Form Guide"]
[]
[{"$nulls":21},"New Zealand"]
[{"$nulls":22},"Motukarara",null,"Partly Cloudy (Max: 19) Rail: True Track: DEAD 4","Speed MapNeuralsWorksheetCustomised Form Guide"]
[]
[{"$nulls":21},"South Africa"]
[{"$nulls":22},"Clairwood",null,"Thunder Showers (Max: 26)","Speed MapNeuralsWorksheetCustomised Form Guide"]
[]
[]
[]
[{"$nulls":20},"Monday, 4 April"]
[]
[{"$nulls":21},"Australia"]
[{"$nulls":22},"Ballina",null,"Shower or two. (Max: 26) Rail: Out 3m from 1000m - 250m where cutaway applies. Track: HEAVY 10","Speed MapNeuralsWorksheetCustomised Form Guide"]
[{"$nulls":22},"Townsville",null,"A few showers. (Max: 28) Rail: Out 3.5m 1000m to W.P True remainder. (Pent: 6.9). Track: HEAVY 10","Speed MapNeuralsWorksheetCustomised Form Guide"]
[{"$nulls":22},"Warrnambool",null,"Shower or two. (Max: 17) Rail: Out 7m Entire Circuit. Track: DEAD 4","Speed MapNeuralsWorksheetCustomised Form Guide"]
[]
[]
[]
[{"$nulls":20},"Tuesday, 5 April"]
[]
[{"$nulls":21},"Australia"]
[{"$nulls":22},"Gosford",null,"Shower or two. (Max: 22) Rail: Out 3m Entire Circuit.","Speed MapNeuralsWorksheetCustomised Form Guide"]
[{"$nulls":22},"Pakenham",null,"Partly cloudy. (Max: 19) Rail: Out 3m Entire Circuit.","Speed MapNeuralsWorksheetCustomised Form Guide"]
[{"$nulls":22},"Rockhampton",null,"A few showers, mostly afternoon. (Max: 28)","Speed MapNeuralsWorksheetCustomised Form Guide"]
[]
[]
[]
[]
[{"$nulls":20},"Wednesday, 30 March"]
[]
[{"$nulls":21},"Australia"]
[{"$nulls":22},"Balaklava",null,"Mainly fine. (Max: 22) Rail: True. Track: GOOD","Speed MapNeuralsWorksheetCustomised Form Guide"]
[{"$nulls":22},"Bunbury",null,"Sunny. (Max: 30) Rail: Out 3m Track: GOOD","Speed MapNeuralsWorksheetCustomised Form Guide"]
[{"$nulls":22},"Doomben",null,"Showers, rain (Max: 28) Rail: 5m 1000-375; 7.5m Remainder. Track: HVY","Speed MapNeuralsWorksheetCustomised Form Guide"]
[{"$nulls":22},"Randwick-Kensington",null,"Possible shower. (Max: 21) Rail: True. Track: SLOW (Pent: 6.9)","Speed MapNeuralsWorksheetCustomised Form Guide"]
[{"$nulls":22},"Sandown-Lakeside",null,"Shower or two. (Max: 19) Rail: Out 3m Track: GOOD","Speed MapNeuralsWorksheetCustomised Form Guide"]
[]
[{"$nulls":21},"Hong Kong"]
[{"$nulls":22},"Happy Valley",null,"Sunny periods. (Max: 22) Track: GOOD","Speed MapNeuralsWorksheetCustomised Form Guide"]
[]
[{"$nulls":21},"New Zealand"]
[{"$nulls":22},"Paeroa",null,"Partly Cloudy (Max: 9) Rail: True Track: DEAD","Speed MapNeuralsWorksheetCustomised Form Guide"]
[]
[{"$nulls":21},"South Africa"]
[{"$nulls":22},"Kenilworth",null,"Afternoon Light Rain (Max: 23)","Speed MapNeuralsWorksheetCustomised Form Guide"]
[]
[]
[]
[{"$nulls":20},"Thursday, 31 March"]
[]
[{"$nulls":21},"Australia"]
[{"$nulls":22},"Albany",null,"Partly cloudy. (Max: 24) Rail: Out 3m Track: GOOD","Speed MapNeuralsWorksheetCustomised Form Guide"]
[{"$nulls":22},"Hawkesbury",null,"Shower or two. (Max: 24) Rail: Out 3m 1200m to Winning Post, True Remainder. (Pent: 5.19). Track: SLOW (Pent: 5.19)","Speed MapNeuralsWorksheetCustomised Form Guide"]
[{"$nulls":22},"Launceston",null,"Fine. (Max: 19) Rail: Out 9m 1200m-WP. Out 4m WP-1200m. (Pent: 4.73). Track: DEAD (Pent: 4.73)","Speed MapNeuralsWorksheetCustomised Form Guide"]
[{"$nulls":22},"Seymour",null,"Clear. (Max: 23) Rail: Out 3m Entire Circuit. Track: GOOD","Speed MapNeuralsWorksheetCustomised Form Guide"]
[{"$nulls":22},"Toowoomba Cushion",null,"A shower or two (Max: 27) Rail: True Track: GOOD","Speed MapNeuralsWorksheetCustomised Form Guide"]
[]
[{"$nulls":21},"New Zealand"]
[{"$nulls":22},"Wanganui",null,"Partly Cloudy (Max: 6) Rail: True Track: GOOD","Speed MapNeuralsWorksheetCustomised Form Guide"]
[]
[{"$nulls":21},"South Africa"]
[{"$nulls":22},"Vaal",null,"Mostly Sunny (Max: 26)","Speed MapNeuralsWorksheetCustomised Form Guide"]
[]
[{"$nulls":21},"United Kingdom"]
[{"$nulls":22},"Ludlow",null,null,"Speed MapNeuralsWorksheetCustomised Form Guide"]
[]
[]
[{"$nulls":28},"RISA Notice:"]
[]
[{"$nulls":28},"© 2010, Racing Information Services Australia (RISA) and others working with it. These racing materials are reproduced under a copyright licence. Any unauthorised reproduction, adaptation or communication is strictly prohibited."]
[{"$nulls":28},"Full copyright notice."]
[]
[]
[]
[]
[{"$nulls":28},"Racing and Sports",null,"Racing and Sports Pty Ltd | Contact Us | R&S Terms of Use | R&S Privacy"]
[{"$nulls":28},"This site is maintained by Racing and Sports (®) Pty Ltd (ABN 093 360 108) (\"R&S\"). Copyright in all R&S materials is owned by Racing and Sports Pty Ltd (R&S). Racing and Sports is a Registered Trademark. R&S takes all care in the preparation of information appearing on the site, but accepts no responsibility nor warrants the accuracy of the information displayed. This information is provided for entertainment purposes only. All information including race fields and TAB numbers should be checked with an official source. (RAS-WWW02) (ADS1)"]
[]
[{"$nulls":19},"\"; } var allLinks = document.links; for (var i=0; i=0) { } else if (allLinks[i].href.indexOf(\"viewStallion\")>=0) { } else if (allLinks[i].href.indexOf(\"viewJockey\")>=0) { } else if (allLinks[i].href.indexOf(\"viewTrainer\")>=0) { } else if (allLinks[i].href.indexOf(\"viewCourse\")>=0) { } } //-->"]

{"sheet":"Race","index":4,"n_rows":43,"n_cols":14,"rows_kept":43,"cut":false,"hidden":false,"merged":[]}
[]
["CANBERRA",null,"CR 8","PAYING"]
[]
["2011-04-01","BM 60 HANDICAP",null,null,"Fixed Price"]
["RADIO TAB","5-2-9-10","IAN HUMPHRIES","5-1-9-10",null,"1400M","FINE","DEAD(4)"]
[]
[{"$nulls":6},"SCR 3 12"]
[2,null,"PARAMOUNT PETE",10.7,3.3]
[1,null,"HURRICONI",null,2,null,"Sub Fav 5"]
[10,null,"RED RIVER",null,2.2000000000000002]
[]
["QN","1* 2",30.7,null,null,null,"TF","2* 1*10",364.9]
["EX","2* 1",76.599999999999994,null,null,null,"A2","1* 2",6.9]
["DD","8* 2",114,{"$nulls":4},"2*10",12]
["TT","9* 8* 2",1043.3,{"$nulls":4},"1*10",6.8]
["QD","1* 9* 8* 2",4592.3999999999996]
["F4","2* 1*10* 4",1374.8]
["No.",null,"Name","04:27:00","Win","Plc",null,"Rider  ","Bar","Wght",null,"Form","L3S","Rtng"]
[1,null,"HURRICONI",5.3,5.2,2,null,"MATHEW CAHILL",6,57,null,"WT",176,99]
[2,null,"PARAMOUNT PETE",12.2,10.7,3.3,null,"R SAXTON",5,57,null,"D",247,97]
[3,null,"POETIC JUSTICE",{"$nulls":4},"SCRATCHED",1]
[4,null,"BUSH BRANDY",14.8,11.1,3.4,null,"L WRAY(A)",9,56.5,null,null,"X17",98]
[5,null,"ANGELOS LUCKY BOY",3.1,3.1,1.8,null,"G BUCKLEY",3,56,null,null,"X25",100]
[6,null,"HIGH TIME",13,9.1,2.8,null,"K SWEENEY",13,56,null,"D",245,98]
[7,null,"PIN THE TAIL",58,74.5,19,null,"A GAIN",11,56,null,"WT","X0X",79]
[8,null,"ACQUEST",16.399999999999999,22.3,5.5,null,"R BENSLEY",2,55.5,null,"C",168,96]
[9,null,"MURIALS SPIRIT",13.4,12,3.2,null,"B OWEN(A)",7,55.5,null,"D",717,99]
[10,null,"RED RIVER",7.3,8.1999999999999993,2.2000000000000002,null,"K O'HARA",4,55.5,null,null,"X50",96]
[11,null,"LADY MYSTIC",23.4,26.8,5.9,null,"R FREEMAN-KEY",14,54.5,null,null,"4X5",95]
[12,null,"SAVVY MISS",{"$nulls":4},"SCRATCHED",15]
[13,null,"DEXTER'S ANGEL",15,25.2,5.5,null,"T LOVELOCK-WIGGINS(A",8,54,null,null,864,92]
[14,null,"KONEDOBU",41.7,74.5,14,null,"TIM PHILLIPS",10,54,null,"DWT","40X",92]
[15,null,"PLANET ICE",41.2,63.4,8.9,null,"B WARD",12,54,null,"D",0,94]
[]
["UNiTAB Pool Totals"]
["WN",39081,"QN",4987,"TF",19379,"DD(7,8) "]
["PL",13679,"EX",2737,"F4",798,"TT(6,7,8) "]
[null,null,"A2",1382,null,null,"QD(5,6,7,8) "]
[]
["<< CR  1  2  3  4  5  6  7  8  DD/TT/QD  XD Riders  Fixed Price >>"]
[]
["Help","Gambling Advice","TAB Home","Refresh"]
["© Copyright UNiTAB Ltd","Created: Fri, 01 Apr 2011 16:47:28 Aust EST"]

{"sheet":"Selections","index":5,"n_rows":82,"n_cols":11,"rows_kept":82,"cut":false,"hidden":false,"merged":[]}
["Venue",null,"Race",null,"No","Runner",null,null,"Win","Place"]
["",null,"","","","",null,null,"",""]
["IPSWICH",null,1,"CP/FR",5,"Spotted Eagle",null,null,"",""]
["",null,"","","","",null,null,"",""]
["IPSWICH",null,3,"Fav",4,"La Mariposa",null,null,1.9,1.3,"x"]
["IPSWICH",null,3,"CP/FR",4,"La Mariposa",null,null,1.9,1.3]
["IPSWICH",null,3,2.4,4,"La Mariposa",null,null,1.9,1.3]
["",null,"","","","",null,null,"",""]
["",null,"","","","",null,null,"",""]
["IPSWICH",null,4,4.8,11,"Leica Beach Boy",null,null,0,1.8]
["",null,"","","","",null,null,"",""]
["",null,"","","","",null,null,"",""]
["IPSWICH",null,6,2.2999999999999998,20,"Zodiac Prince",null,null,"",""]
["",null,"","","","",null,null,"",""]
["",null,"","","","",null,null,"",""]
["IPSWICH",null,7,2.2000000000000002,8,"Grey Mambo",null,null,"",""]
["",null,"","","","",null,null,"",""]
["",null,"","","","",null,null,"",""]
["GRAFTON",null,1,4.2,1,"Clasped",null,null,0,1.7]
["",null,"","","","",null,null,"",""]
["GRAFTON",null,2,"CP/FR",4,"Ogre",null,null,0,1.3]
["",null,"","","","",null,null,"",""]
["",null,"","","","",null,null,"",""]
["",null,"","","","",null,null,"",""]
["GRAFTON",null,3,3.1,8,"Hidden Decision",null,null,0,1.5]
["",null,"","","","",null,null,"",""]
["",null,"","","","",null,null,"",""]
["GRAFTON",null,4,3.1,4,"Prince Oka",null,null,3.2,1.3]
["",null,"","","","",null,null,"",""]
["",null,"","","","",null,null,"",""]
["GRAFTON",null,5,3.1,4,"Dundigin",null,null,3.7,1.8]
["",null,"","","","",null,null,"",""]
["",null,"","","","",null,null,"",""]
["GRAFTON",null,7,2.25,2,"All Again",null,null,0,2.4]
["",null,"","","","",null,null,"",""]
["",null,"","","","",null,null,"",""]
["GRAFTON",null,8,2.35,3,"Mooltan",null,null,4.0999999999999996,1.4]
["",null,"","","","",null,null,"",""]
["",null,"","","","",null,null,"",""]
["GRAFTON",null,9,4.4000000000000004,4,"Moneysaver",null,null,3.3,1.5]
["",null,"","","","",null,null,"",""]
["",null,"","","","",null,null,"",""]
["GRAFTON",null,10,5,2,"Jestachenka",null,null,0,2.7]
["",null,"","","","",null,null,"",""]
["MORNINGTON",null,1,"CP/FR",8,"Saint Angers",null,null,0,1]
["MORNINGTON",null,1,2.9,8,"Saint Angers",null,null,0,1]
["",null,"","","","",null,null,"",""]
["MORNINGTON",null,2,"CP/FR",5,"Rockfest",null,null,7.9,1.6]
["",null,"","","","",null,null,"",""]
["",null,"","","","",null,null,"",""]
["",null,"","","","",null,null,"",""]
["MORNINGTON",null,4,3.5,6,"Spirit Song",null,null,0,3.5]
["",null,"","","","",null,null,"",""]
["",null,"","","","",null,null,"",""]
["MORNINGTON",null,5,3,1,"Blacko",null,null,4.5,1.4]
["",null,"","","","",null,null,"",""]
["",null,"","","","",null,null,"",""]
["MORNINGTON",null,6,4.4000000000000004,5,"Cavalry Prince",null,null,0,3.2]
["MORNINGTON",null,7,"Fav",9,"Marvellous Miss",null,null,0,2.6]
["MORNINGTON",null,7,"CP/FR",9,"Marvellous Miss",null,null,0,2.6]
["",null,"","","","",null,null,"",""]
["MORNINGTON",null,8,"Fav",5,"Assertion",null,null,2.2999999999999998,1.3,"x"]
["",null,"","","","",null,null,"",""]
["",null,"","","","",null,null,"",""]
["",null,"","","","",null,null,"",""]
["",null,"","","","",null,null,"",""]
["MORNINGTON",null,9,5,6,"Faveaux",null,null,"",""]
["CANBERRA",null,1,"Fav",8,"Pale",null,null,1.5,1.2,"x"]
["",null,"","","","",null,null,"",""]
["CANBERRA",null,1,3.3,7,"Nineveh'S Wish",null,null,0,2.6]
["CANBERRA",null,4,"Fav",1,"In His Honour",null,null,"","","x"]
["",null,"","","","",null,null,"",""]
["CANBERRA",null,4,2.4,10,"Sheazali",null,null,"",""]
["",null,"","","","",null,null,"",""]
["",null,"","","","",null,null,"",""]
["CANBERRA",null,5,5.5,10,"Redline Raider",null,null,"",""]
["CANBERRA",null,6,"Fav",7,"Chosen Time",null,null,"",""]
["CANBERRA",null,6,"CP/FR",7,"Chosen Time",null,null,"",""]
["",null,"","","","",null,null,"",""]
["",null,"","","","",null,null,"",""]
["",null,"","","","",null,null,"",""]
["CANBERRA",null,8,3.5,4,"Bush Brandy",null,null,"",""]