{"text_format":"2","workbook":"xlsx","n_sheets":3,"sheets":["RaceCard","Review","Start here"],"not_rendered":{"charts":0,"images":1,"macros":1,"external_links":0,"defined_names":4,"comments":1,"pivot_tables":0},"unopened":[],"bounds":{"document_bytes":16777216,"sheet_cells":100000,"run_cost":"one","rows_first":2000,"rows_last":500,"rows_between":2000,"halvings":0,"cell_chars":16384,"cell_head_chars":4096},"cells_cut":0,"cells_raw":0,"read":"whole","date_system":"1900"}

{"sheet":"RaceCard","index":0,"n_rows":305,"n_cols":55,"rows_kept":305,"cut":false,"hidden":false,"merged":[]}
["Code","Track","Track Condition","Track Rating",null,null,"Weather",{"$nulls":5},"TAB","Name","Weight","Jockey","Win Types","BP","L3S","Q Rating","Last Odds","Win$","Plc$","LFP1","LFP2","LFP3","Q Rating Rank","ABND","MeetingType","Venue","Abandoned","Code","Races","VTAB CODE","Type","Venue","Track","Weather","QTAB CODE","Race ID","Race Name","Distance","Class 1","Time","Jump","Track","Race","Race Name","Class 2",null,"Jump","Track","Race","Race Name","Class 2"]
["CR","Canberra","Good",1,3,1,"Fine","N",{"$nulls":4},1,"RAVNA GORA",60.5,"J KISSICK(A)","DWTC",3,434,94,3,3.2,3,{"$f":"IF(OR($V2=0,$V2=\"\",$V2>1000),\"\",IF(OR(S2=\"\",LEFT(S2,1)=\"F\",LEFT(S2,1)=\"L\",LEFT(S2,1)=\"U\",LEFT(S2,1)=\"X\",LEFT(S2,1)=\"P\",LEFT(S2,1)=\"0\",LEFT(S2,1)=\"T\",LEFT(S2,1)=\"D\"),\"\",LEFT(S2,1)))","v":"4"},{"$f":"IF(OR($V2=0,$V2=\"\",$V2>1000),\"\",IF(OR(S2=\"\",MID(S2,2,1)=\"X\",MID(S2,2,1)=\"L\",MID(S2,2,1)=\"U\",MID(S2,2,1)=\"D\",MID(S2,2,1)=\"P\",MID(S2,2,1)=\"T\",MID(S2,2,1)=\"0\",MID(S2,2,1)=\"F\"),\"\",IF(LEN(S2)=1,\"\",MID(S2,2,1))))","v":"3"},{"$f":"IF(OR($V2=0,$V2=\"\",$V2>1000),\"\",IF(OR(S2=\"\",RIGHT(S2,1)=\"X\",RIGHT(S2,1)=\"L\",RIGHT(S2,1)=\"U\",RIGHT(S2,1)=\"D\",RIGHT(S2,1)=\"P\",RIGHT(S2,1)=\"0\",RIGHT(S2,1)=\"T\",RIGHT(S2,1)=\"F\"),\"\",IF(OR(LEN(S2)=2,LEN(S2)=1),\"\",RIGHT(S2,1))))","v":"4"},{"$f":"IF(OR($V2=0,$V2=\"\",$V2>1000),\"\",RANK(T2,T$2:T$25)+COUNTIF(T$2:T2,T2)-1)","v":5},{"$f":"VLOOKUP(Review!D2,RaceCard!AD2:AE80,2,FALSE)","v":"N"},"R","Ipswich","Y","BR",7,"MR_20120127","R","MOONEE VALLEY","DEAD","FINE",{"$f":"IF(AJ2=\"\",\"\",IF(ISERROR(VLOOKUP(AJ2,$AD$2:$AF$48,1,FALSE)),\"X\",VLOOKUP(AJ2,$AD$2:$AF$48,3,FALSE)))","v":"MR"},"MR_20120127_01","MITCHELTON WINES 3YO 0-72 HCP",1600,"RB72","18:45:00",{"$f":"IF(AN2=\"\",\"\",IF(OR(RIGHT(VLOOKUP(LEFT(AN2,11),$AH$2:$AM$28,6,FALSE),1)=\"S\",VLOOKUP(LEFT(AN2,11),$AH$2:$AM$28,6,FALSE)=\"X\"),\"\",AR2))","v":"18:45:00"},{"$f":"IF(AN2=\"\",\"\",IF(OR(RIGHT(VLOOKUP(LEFT(AN2,11),$AH$2:$AM$50,6,FALSE),1)=\"S\",VLOOKUP(LEFT(AN2,11),$AH$2:$AM$50,6,FALSE)=\"X\"),\"\",VLOOKUP(LEFT(AN2,11),$AH$2:$AJ$50,3,FALSE)))","v":"MOONEE VALLEY"},{"$f":"IF(AN2=\"\",\"\",IF(OR(RIGHT(VLOOKUP(LEFT(AN2,11),$AH$2:$AM$28,6,FALSE),1)=\"S\",VLOOKUP(LEFT(AN2,11),$AH$2:$AM$28,6,FALSE)=\"X\"),\"\",RIGHT(AN2,2)))","v":"01"},{"$f":"IF(AS2=\"\",\"\",IF(AO2=\"\",\"UNKNOWN RACE NAME\",AO2))","v":"MITCHELTON WINES 3YO 0-72 HCP"},{"$f":"IF(AS2=\"\",\"\",IF(AQ2=\"\",\"UNKNOWN\",AQ2))","v":"RB72"},null,"13:00:00","MORNINGTON","01","LAND ENGINEERING MDN PLT","MDN"]
["Race No.","Jump Time","Race Name","Distance","Status",{"$nulls":5},"Time",null,2,"JOLLY JOKER",58.5,"A KING(A)","DWC",8,135,94,0,108.5,6,{"$f":"IF(OR($V3=0,$V3=\"\",$V3>1000),\"\",IF(OR(S3=\"\",LEFT(S3,1)=\"F\",LEFT(S3,1)=\"L\",LEFT(S3,1)=\"U\",LEFT(S3,1)=\"X\",LEFT(S3,1)=\"P\",LEFT(S3,1)=\"0\",LEFT(S3,1)=\"T\",LEFT(S3,1)=\"D\"),\"\",LEFT(S3,1)))","v":"1"},{"$f":"IF(OR($V3=0,$V3=\"\",$V3>1000),\"\",IF(OR(S3=\"\",MID(S3,2,1)=\"X\",MID(S3,2,1)=\"L\",MID(S3,2,1)=\"U\",MID(S3,2,1)=\"D\",MID(S3,2,1)=\"P\",MID(S3,2,1)=\"T\",MID(S3,2,1)=\"0\",MID(S3,2,1)=\"F\"),\"\",IF(LEN(S3)=1,\"\",MID(S3,2,1))))","v":"3"},{"$f":"IF(OR($V3=0,$V3=\"\",$V3>1000),\"\",IF(OR(S3=\"\",RIGHT(S3,1)=\"X\",RIGHT(S3,1)=\"L\",RIGHT(S3,1)=\"U\",RIGHT(S3,1)=\"D\",RIGHT(S3,1)=\"P\",RIGHT(S3,1)=\"0\",RIGHT(S3,1)=\"T\",RIGHT(S3,1)=\"F\"),\"\",IF(OR(LEN(S3)=2,LEN(S3)=1),\"\",RIGHT(S3,1))))","v":"5"},{"$f":"IF(OR($V3=0,$V3=\"\",$V3>1000),\"\",RANK(T3,T$2:T$25)+COUNTIF(T$2:T3,T3)-1)","v":6},null,"R","Moonee Valley","N","MR",8,"SR_20120127","R","ARMIDALE","SLOW","OCAST",{"$f":"IF(AJ3=\"\",\"\",IF(ISERROR(VLOOKUP(AJ3,$AD$2:$AF$48,1,FALSE)),\"X\",VLOOKUP(AJ3,$AD$2:$AF$48,3,FALSE)))","v":"NR"},"MR_20120127_02","AQUANAS FOODS 0-82 HCP",3000,"RB82","19:15:00",{"$f":"IF(AN3=\"\",\"\",IF(OR(RIGHT(VLOOKUP(LEFT(AN3,11),$AH$2:$AM$28,6,FALSE),1)=\"S\",VLOOKUP(LEFT(AN3,11),$AH$2:$AM$28,6,FALSE)=\"X\"),\"\",AR3))","v":"19:15:00"},{"$f":"IF(AN3=\"\",\"\",IF(OR(RIGHT(VLOOKUP(LEFT(AN3,11),$AH$2:$AM$50,6,FALSE),1)=\"S\",VLOOKUP(LEFT(AN3,11),$AH$2:$AM$50,6,FALSE)=\"X\"),\"\",VLOOKUP(LEFT(AN3,11),$AH$2:$AJ$50,3,FALSE)))","v":"MOONEE VALLEY"},"02",{"$f":"IF(AS3=\"\",\"\",IF(AO3=\"\",\"UNKNOWN RACE NAME\",AO3))","v":"AQUANAS FOODS 0-82 HCP"},{"$f":"IF(AS3=\"\",\"\",IF(AQ3=\"\",\"UNKNOWN\",AQ3))","v":"RB82"},null,"13:08:00","CANBERRA","01","KENNARDS HIRE 2YO HCP","UNKNOWN"]
[3,"2012-01-27T13:18:00","BM 70 HANDICAP",1000,"SELLING",{"$nulls":5},{"$f":"TIMEVALUE(RIGHT(B4,8))","v":"13:18:00"},null,3,"DELABOMBELL",57,"B WARD","DC",7,"X46",93,1638.35,1638.35,1638.35,"","","",{"$f":"IF(OR($V4=0,$V4=\"\",$V4>1000),\"\",RANK(T4,T$2:T$25)+COUNTIF(T$2:T4,T4)-1)","v":""},null,"R","Sunshine Coast","Y","QR",8,"AR_20120127","R","FONTWELL PARK",null,null,"X","MR_20120127_03","CORPORATE INTERIORS PREMIUM 0-78",1000,"RB78","19:45:00","19:45:00","MOONEE VALLEY","03","CORPORATE INTERIORS PREMIUM 0-78",{"$f":"IF(AS4=\"\",\"\",IF(AQ4=\"\",\"UNKNOWN\",AQ4))","v":"RB78"},null,"13:35:00","MORNINGTON","02","LAND ENGINEERING F&M MDN PLT","MDN"]
["Tipster","Tips 1","Tips 2","Tips 3","Tips 4",{"$nulls":7},4,"MY DEAR FRIEND",57,"B MURPHY","W",2,"17X",95,0,54.2,0,"1","7","",{"$f":"IF(OR($V5=0,$V5=\"\",$V5>1000),\"\",RANK(T5,T$2:T$25)+COUNTIF(T$2:T5,T5)-1)","v":4},null,"R","Armidale","N","NR",8,"BR_20120127","R","IPSWICH",null,null,"BR","MR_20120127_04","ESSENDON MAZDA AUSTRALIA STAKES",1200,null,"20:15:00","20:15:00","MOONEE VALLEY","04","ESSENDON MAZDA AUSTRALIA STAKES",{"$f":"IF(AS5=\"\",\"\",IF(AQ5=\"\",\"UNKNOWN\",AQ5))","v":"UNKNOWN"},null,"13:43:00","CANBERRA","02","ALAN RUMMERY MDN PLT","MDN"]
[{"$nulls":12},5,"BATTLE READY",55.5,"G BUCKLEY","DW",6,"X6X",96,7.3,9,2,"","6","",{"$f":"IF(OR($V6=0,$V6=\"\",$V6>1000),\"\",RANK(T6,T$2:T$25)+COUNTIF(T$2:T6,T6)-1)","v":2},null,"R","Mornington","N","VR",8,"WR_20120127","R","HUNTINGDON",null,null,"X","MR_20120127_05","ESSENDON MAZDA 55 SEC MARES HT11",955,null,"20:45:00","20:45:00","MOONEE VALLEY","05","ESSENDON MAZDA 55 SEC MARES HT11",{"$f":"IF(AS6=\"\",\"\",IF(AQ6=\"\",\"UNKNOWN\",AQ6))","v":"UNKNOWN"},null,"14:00:00","IPSWICH","01","SKY RACING BM 75 HCP","UNKNOWN"]
["RADIO TAB","*7-6-2",{"$nulls":10},6,"TANYA JEAN",55.5,"MATHEW CAHILL","TC",4,51,100,1.8,2.6,3,"5","1","",{"$f":"IF(OR($V7=0,$V7=\"\",$V7>1000),\"\",RANK(T7,T$2:T$25)+COUNTIF(T$2:T7,T7)-1)","v":1},null,"R","Canberra","N","CR",8,"PR_20120127","R","MORNINGTON","DEAD","FINE","VR","MR_20120127_06","SPORTINGBET CARLYON F&M CLASSIC",2040,null,"21:15:00","21:15:00","MOONEE VALLEY","06","SPORTINGBET CARLYON F&M CLASSIC",{"$f":"IF(AS7=\"\",\"\",IF(AQ7=\"\",\"UNKNOWN\",AQ7))","v":"UNKNOWN"},null,"14:10:00","MORNINGTON","03","ADAM DOWER MEMORIAL MDN PLT","MDN"]
["IAN HUMPHRIES","6-7-1",{"$nulls":10},7,"MATERIAL MATTERS",54,"J PENZA","C",1,232,96,5.6,3.1,1,"2","3","2",{"$f":"IF(OR($V8=0,$V8=\"\",$V8>1000),\"\",RANK(T8,T$2:T$25)+COUNTIF(T$2:T8,T8)-1)","v":3},null,"T","Tamworth","N","ST",8,"CR_20120127","R","CANBERRA","GOOD","FINE","CR","MR_20120127_07","PRINTHOUSE GROUP 0-78 HCP",1600,"RB78","21:45:00",{"$f":"IF(AN8=\"\",\"\",IF(OR(RIGHT(VLOOKUP(LEFT(AN8,11),$AH$2:$AM$28,6,FALSE),1)=\"S\",VLOOKUP(LEFT(AN8,11),$AH$2:$AM$28,6,FALSE)=\"X\"),\"\",AR8))","v":"21:45:00"},{"$f":"IF(AN8=\"\",\"\",IF(OR(RIGHT(VLOOKUP(LEFT(AN8,11),$AH$2:$AM$50,6,FALSE),1)=\"S\",VLOOKUP(LEFT(AN8,11),$AH$2:$AM$50,6,FALSE)=\"X\"),\"\",VLOOKUP(LEFT(AN8,11),$AH$2:$AJ$50,3,FALSE)))","v":"MOONEE VALLEY"},{"$f":"IF(AN8=\"\",\"\",IF(OR(RIGHT(VLOOKUP(LEFT(AN8,11),$AH$2:$AM$28,6,FALSE),1)=\"S\",VLOOKUP(LEFT(AN8,11),$AH$2:$AM$28,6,FALSE)=\"X\"),\"\",RIGHT(AN8,2)))","v":"07"},"PRINTHOUSE GROUP 0-78 HCP",{"$f":"IF(AS8=\"\",\"\",IF(AQ8=\"\",\"UNKNOWN\",AQ8))","v":"RB78"},null,"14:18:00","CANBERRA","03","GRASS FX BM 70 HCP","BM70"]
[{"$f":"IF(B6=\"\",\"\",A6)","v":""},{"$f":"IF(B6=\"\",\"\",IF(LEFT(B6,1)=\"*\",MID(B6,2,100),B6))","v":""},{"$nulls":10},8,"BLUE WREN",54,"S GUYMER(A)",null,5,"71X",86,0,36.1,0,"7","1","",{"$f":"IF(OR($V9=0,$V9=\"\",$V9>1000),\"\",RANK(T9,T$2:T$25)+COUNTIF(T$2:T9,T9)-1)","v":8},null,"T","Melton","N","MT",9,"TR_20120127","R","SUNSHINE COAST",null,null,"QR","MR_20120127_08","ANDREWS & PARKER FURNITURE 0-72",1200,"RB72","22:15:00","22:15:00","MOONEE VALLEY","08","ANDREWS & PARKER FURNITURE 0-72",{"$f":"IF(AS9=\"\",\"\",IF(AQ9=\"\",\"UNKNOWN\",AQ9))","v":"RB72"},null,"14:30:00","ARMIDALE","01","ARMIDALE CUP DAY 19/3 MDN PLT","MDN"]
[{"$f":"IF(B7=\"\",\"\",A7)","v":"RADIO TAB"},{"$f":"IF(B7=\"\",\"\",IF(LEFT(B7,1)=\"*\",MID(B7,2,100),B7))","v":"7-6-2"},{"$nulls":21},"","","",{"$f":"IF(OR($V10=0,$V10=\"\",$V10>1000),\"\",RANK(T10,T$2:T$25)+COUNTIF(T$2:T10,T10)-1)","v":""},null,"T","Gold Coast","N","QT",10,"LR_20120127","R","SINGAPORE",null,null,"X","SR_20120127_01","ARMIDALE CUP DAY 19/3 MDN PLT",1900,"MDN","14:30:00","14:30:00","ARMIDALE","01","ARMIDALE CUP DAY 19/3 MDN PLT",{"$f":"IF(AS10=\"\",\"\",IF(AQ10=\"\",\"UNKNOWN\",AQ10))","v":"MDN"},null,"14:35:00","IPSWICH","02","KEVIN KEIDGE MEM 2YO MDN HCP","UNKNOWN"]
{"$rows_left_out":296}
{"sheet":"Review","index":1,"n_rows":301,"n_cols":40,"rows_kept":301,"cut":false,"hidden":false,"merged":[[0,3,0,4],[1,3,1,4],[0,11,0,15],[1,11,1,15]]}
["2012-01-27","Types","Code","Track",null,"Race","Mtrs","Field","Cond","Jump","Now","Race Name",{"$nulls":4},"TF Pool","WIN Pool",{"$nulls":12},"Date",1,{"$f":"IF(AI1=\"\",\"\",CONCATENATE(TEXT(AH1,\"HH:MM AM/PM\"),\"-\",AI1,\"-\",AJ1))","v":"01:00 PM-MORNINGTON-01"},{"$f":"IF(RaceCard!AY2=\"\",\"\",RaceCard!AY2)","v":"13:00:00"},{"$f":"IF(RaceCard!AZ2=\"\",\"\",RaceCard!AZ2)","v":"MORNINGTON"},{"$f":"IF(RaceCard!BA2=\"\",\"\",RaceCard!BA2)","v":"01"},{"$f":"IF(RaceCard!BB2=\"\",\"\",RaceCard!BB2)","v":"LAND ENGINEERING MDN PLT"},{"$f":"IF(RaceCard!BC2=\"\",\"\",RaceCard!BC2)","v":"MDN"},{"$f":"IF(AI1=\"\",\"\",IF(ISERROR(VLOOKUP(AI1,RaceCard!$AD$2:$AF$48,2,FALSE)),\"X\",VLOOKUP(AI1,RaceCard!$AD$2:$AF$48,3,FALSE)))","v":"VR"},{"$f":"IF(AG1=\"\",\"\",CONCATENATE(AM1,\"-\",TEXT(AJ1,\"00\")))","v":"VR-01"}]
[7,"R",{"$f":"VLOOKUP(A2,racecodes,9,FALSE)","v":"CR-03"},{"$f":"VLOOKUP(A2,racecodes,4,FALSE)","v":"CANBERRA"},null,{"$f":"VALUE(VLOOKUP(A2,racecodes,5,FALSE))","v":3},{"$f":"VALUE(RaceCard!D4)","v":1000},{"$f":"COUNTIF(RaceCard!AA2:AA25,\">0\")","v":7},{"$f":"RaceCard!C2","v":"Good"},{"$f":"VLOOKUP(A2,racecodes,3,FALSE)","v":"14:18:00"},{"$f":"NOW()+TIME(0,30,0)","v":40935.51099594908},{"$f":"VLOOKUP(A2,racecodes,6,FALSE)","v":"GRASS FX BM 70 HCP"},{"$nulls":4},{"$f":"RaceCard!A26","v":40},{"$nulls":13},{"$f":"TEXT($A$1,\"yyyy/m/d\")","v":"2012/1/27"},2,{"$f":"IF(AI2=\"\",\"\",CONCATENATE(TEXT(AH2,\"HH:MM AM/PM\"),\"-\",AI2,\"-\",AJ2))","v":"01:08 PM-CANBERRA-01"},{"$f":"IF(RaceCard!AY3=\"\",\"\",RaceCard!AY3)","v":"13:08:00"},{"$f":"IF(RaceCard!AZ3=\"\",\"\",RaceCard!AZ3)","v":"CANBERRA"},{"$f":"IF(RaceCard!BA3=\"\",\"\",RaceCard!BA3)","v":"01"},{"$f":"IF(RaceCard!BB3=\"\",\"\",RaceCard!BB3)","v":"KENNARDS HIRE 2YO HCP"},{"$f":"IF(RaceCard!BC3=\"\",\"\",RaceCard!BC3)","v":"UNKNOWN"},{"$f":"IF(AI2=\"\",\"\",IF(ISERROR(VLOOKUP(AI2,RaceCard!$AD$2:$AF$48,2,FALSE)),\"X\",VLOOKUP(AI2,RaceCard!$AD$2:$AF$48,3,FALSE)))","v":"CR"},"CR-01"]
[null,"TAB","Name","Win Odds","Plc Odds","Last Odds","Odds +/-","Weight","QTP","Tipster","Qrating","Late Mail","LS3 Form","LS1","LS2","LS3","Form","Jockey",{"$nulls":12},{"$f":"TEXT(A1,\"yyyy\")","v":"2012"},3,"01:35 PM-MORNINGTON-02",{"$f":"IF(RaceCard!AY4=\"\",\"\",RaceCard!AY4)","v":"13:35:00"},{"$f":"IF(RaceCard!AZ4=\"\",\"\",RaceCard!AZ4)","v":"MORNINGTON"},{"$f":"IF(RaceCard!BA4=\"\",\"\",RaceCard!BA4)","v":"02"},{"$f":"IF(RaceCard!BB4=\"\",\"\",RaceCard!BB4)","v":"LAND ENGINEERING F&M MDN PLT"},{"$f":"IF(RaceCard!BC4=\"\",\"\",RaceCard!BC4)","v":"MDN"},{"$f":"IF(AI3=\"\",\"\",IF(ISERROR(VLOOKUP(AI3,RaceCard!$AD$2:$AF$48,2,FALSE)),\"X\",VLOOKUP(AI3,RaceCard!$AD$2:$AF$48,3,FALSE)))","v":"VR"},"VR-02"]
[null,{"$f":"IF(OR(RaceCard!$V2=0,RaceCard!$V2=\"\",RaceCard!$V2>1000),\"\",RaceCard!M2)","v":1},{"$f":"IF(B4=\"\",\"\",RaceCard!N2)","v":"RAVNA GORA"},{"$f":"IF(B4=\"\",\"\",RaceCard!V2)","v":3.2},{"$f":"IF(B4=\"\",\"\",RaceCard!W2)","v":3},{"$f":"IF(B4=\"\",\"\",RaceCard!U2)","v":3},{"$f":"IF(OR(D4=\"\",D4=0,F4=0),\"\",(D4-F4)/F4)","v":6.6666666666666721E-2},{"$f":"IF(B4=\"\",\"\",RaceCard!O2)","v":60.5},{"$f":"IF(B4=\"\",\"\",IF($B4=RaceCard!$B$13,1,IF($B4=RaceCard!$C$13,2,IF($B4=RaceCard!$D$13,3,IF($B4=RaceCard!$E$13,4,\"\")))))","v":""},{"$f":"IF($B4=\"\",\"\",IF($B4=RaceCard!$B$14,1,IF($B4=RaceCard!$C$14,2,IF($B4=RaceCard!$D$14,3,IF($B4=RaceCard!$E$14,4,\"\")))))","v":3},{"$f":"IF(B4=\"\",\"\",RaceCard!T2)","v":94},{"$f":"IF(B4=\"\",\"\",IF($B4=RaceCard!$B$12,1,\"\"))","v":""},{"$f":"IF(B4=\"\",\"\",IF(RaceCard!S2=\"\",\"\",RaceCard!S2))","v":434},{"$f":"IF(B4=\"\",\"\",IF(RaceCard!X2=\"\",\"\",VALUE(RaceCard!X2)))","v":4},{"$f":"IF(B4=\"\",\"\",IF(RaceCard!Y2=\"\",\"\",VALUE(RaceCard!Y2)))","v":3},{"$f":"IF(B4=\"\",\"\",IF(RaceCard!Z2=\"\",\"\",VALUE(RaceCard!Z2)))","v":4},{"$f":"IF(B4=\"\",\"\",IF(RaceCard!Q2=\"\",\"\",RaceCard!Q2))","v":"DWTC"},{"$f":"IF(B4=\"\",\"\",IF(RaceCard!P2=\"\",\"\",RaceCard!P2))","v":"J KISSICK(A)"},{"$nulls":12},{"$f":"TEXT(A1,\"m\")","v":"1"},4,"01:43 PM-CANBERRA-02",{"$f":"IF(RaceCard!AY5=\"\",\"\",RaceCard!AY5)","v":"13:43:00"},{"$f":"IF(RaceCard!AZ5=\"\",\"\",RaceCard!AZ5)","v":"CANBERRA"},{"$f":"IF(RaceCard!BA5=\"\",\"\",RaceCard!BA5)","v":"02"},{"$f":"IF(RaceCard!BB5=\"\",\"\",RaceCard!BB5)","v":"ALAN RUMMERY MDN PLT"},{"$f":"IF(RaceCard!BC5=\"\",\"\",RaceCard!BC5)","v":"MDN"},{"$f":"IF(AI4=\"\",\"\",IF(ISERROR(VLOOKUP(AI4,RaceCard!$AD$2:$AF$48,2,FALSE)),\"X\",VLOOKUP(AI4,RaceCard!$AD$2:$AF$48,3,FALSE)))","v":"CR"},"CR-02"]
[null,{"$f":"IF(OR(RaceCard!$V3=0,RaceCard!$V3=\"\",RaceCard!$V3>1000),\"\",RaceCard!M3)","v":2},{"$f":"IF(B5=\"\",\"\",RaceCard!N3)","v":"JOLLY JOKER"},{"$f":"IF(B5=\"\",\"\",RaceCard!V3)","v":108.5},{"$f":"IF(B5=\"\",\"\",RaceCard!W3)","v":6},{"$f":"IF(B5=\"\",\"\",RaceCard!U3)","v":0},{"$f":"IF(OR(D5=\"\",D5=0,F5=0),\"\",(D5-F5)/F5)","v":""},{"$f":"IF(B5=\"\",\"\",RaceCard!O3)","v":58.5},{"$f":"IF(B5=\"\",\"\",IF($B5=RaceCard!$B$13,1,IF($B5=RaceCard!$C$13,2,IF($B5=RaceCard!$D$13,3,IF($B5=RaceCard!$E$13,4,\"\")))))","v":3},{"$f":"IF($B5=\"\",\"\",IF($B5=RaceCard!$B$14,1,IF($B5=RaceCard!$C$14,2,IF($B5=RaceCard!$D$14,3,IF($B5=RaceCard!$E$14,4,\"\")))))","v":""},{"$f":"IF(B5=\"\",\"\",RaceCard!T3)","v":94},{"$f":"IF(B5=\"\",\"\",IF($B5=RaceCard!$B$12,1,\"\"))","v":""},{"$f":"IF(B5=\"\",\"\",IF(RaceCard!S3=\"\",\"\",RaceCard!S3))","v":135},{"$f":"IF(B5=\"\",\"\",IF(RaceCard!X3=\"\",\"\",VALUE(RaceCard!X3)))","v":1},{"$f":"IF(B5=\"\",\"\",IF(RaceCard!Y3=\"\",\"\",VALUE(RaceCard!Y3)))","v":3},{"$f":"IF(B5=\"\",\"\",IF(RaceCard!Z3=\"\",\"\",VALUE(RaceCard!Z3)))","v":5},{"$f":"IF(B5=\"\",\"\",IF(RaceCard!Q3=\"\",\"\",RaceCard!Q3))","v":"DWC"},{"$f":"IF(B5=\"\",\"\",IF(RaceCard!P3=\"\",\"\",RaceCard!P3))","v":"A KING(A)"},{"$nulls":12},{"$f":"TEXT(A1,\"d\")","v":"27"},5,"02:00 PM-IPSWICH-01",{"$f":"IF(RaceCard!AY6=\"\",\"\",RaceCard!AY6)","v":"14:00:00"},{"$f":"IF(RaceCard!AZ6=\"\",\"\",RaceCard!AZ6)","v":"IPSWICH"},{"$f":"IF(RaceCard!BA6=\"\",\"\",RaceCard!BA6)","v":"01"},{"$f":"IF(RaceCard!BB6=\"\",\"\",RaceCard!BB6)","v":"SKY RACING BM 75 HCP"},{"$f":"IF(RaceCard!BC6=\"\",\"\",RaceCard!BC6)","v":"UNKNOWN"},{"$f":"IF(AI5=\"\",\"\",IF(ISERROR(VLOOKUP(AI5,RaceCard!$AD$2:$AF$48,2,FALSE)),\"X\",VLOOKUP(AI5,RaceCard!$AD$2:$AF$48,3,FALSE)))","v":"BR"},"BR-01"]
[null,{"$f":"IF(OR(RaceCard!$V4=0,RaceCard!$V4=\"\",RaceCard!$V4>1000),\"\",RaceCard!M4)","v":""},{"$f":"IF(B6=\"\",\"\",RaceCard!N4)","v":""},{"$f":"IF(B6=\"\",\"\",RaceCard!V4)","v":""},{"$f":"IF(B6=\"\",\"\",RaceCard!W4)","v":""},{"$f":"IF(B6=\"\",\"\",RaceCard!U4)","v":""},"",{"$f":"IF(B6=\"\",\"\",RaceCard!O4)","v":""},{"$f":"IF(B6=\"\",\"\",IF($B6=RaceCard!$B$13,1,IF($B6=RaceCard!$C$13,2,IF($B6=RaceCard!$D$13,3,IF($B6=RaceCard!$E$13,4,\"\")))))","v":""},{"$f":"IF($B6=\"\",\"\",IF($B6=RaceCard!$B$14,1,IF($B6=RaceCard!$C$14,2,IF($B6=RaceCard!$D$14,3,IF($B6=RaceCard!$E$14,4,\"\")))))","v":""},{"$f":"IF(B6=\"\",\"\",RaceCard!T4)","v":""},{"$f":"IF(B6=\"\",\"\",IF($B6=RaceCard!$B$12,1,\"\"))","v":""},{"$f":"IF(B6=\"\",\"\",IF(RaceCard!S4=\"\",\"\",RaceCard!S4))","v":""},{"$f":"IF(B6=\"\",\"\",IF(RaceCard!X4=\"\",\"\",VALUE(RaceCard!X4)))","v":""},{"$f":"IF(B6=\"\",\"\",IF(RaceCard!Y4=\"\",\"\",VALUE(RaceCard!Y4)))","v":""},{"$f":"IF(B6=\"\",\"\",IF(RaceCard!Z4=\"\",\"\",VALUE(RaceCard!Z4)))","v":""},{"$f":"IF(B6=\"\",\"\",IF(RaceCard!Q4=\"\",\"\",RaceCard!Q4))","v":""},{"$f":"IF(B6=\"\",\"\",IF(RaceCard!P4=\"\",\"\",RaceCard!P4))","v":""},{"$nulls":12},{"$f":"IF(A2=\"\",\"\",VLOOKUP(A2,racecodes,8,FALSE))","v":"CR"},6,"02:10 PM-MORNINGTON-03",{"$f":"IF(RaceCard!AY7=\"\",\"\",RaceCard!AY7)","v":"14:10:00"},{"$f":"IF(RaceCard!AZ7=\"\",\"\",RaceCard!AZ7)","v":"MORNINGTON"},{"$f":"IF(RaceCard!BA7=\"\",\"\",RaceCard!BA7)","v":"03"},{"$f":"IF(RaceCard!BB7=\"\",\"\",RaceCard!BB7)","v":"ADAM DOWER MEMORIAL MDN PLT"},{"$f":"IF(RaceCard!BC7=\"\",\"\",RaceCard!BC7)","v":"MDN"},{"$f":"IF(AI6=\"\",\"\",IF(ISERROR(VLOOKUP(AI6,RaceCard!$AD$2:$AF$48,2,FALSE)),\"X\",VLOOKUP(AI6,RaceCard!$AD$2:$AF$48,3,FALSE)))","v":"VR"},"VR-03"]
[null,{"$f":"IF(OR(RaceCard!$V5=0,RaceCard!$V5=\"\",RaceCard!$V5>1000),\"\",RaceCard!M5)","v":4},{"$f":"IF(B7=\"\",\"\",RaceCard!N5)","v":"MY DEAR FRIEND"},{"$f":"IF(B7=\"\",\"\",RaceCard!V5)","v":54.2},{"$f":"IF(B7=\"\",\"\",RaceCard!W5)","v":0},{"$f":"IF(B7=\"\",\"\",RaceCard!U5)","v":0},"",{"$f":"IF(B7=\"\",\"\",RaceCard!O5)","v":57},{"$f":"IF(B7=\"\",\"\",IF($B7=RaceCard!$B$13,1,IF($B7=RaceCard!$C$13,2,IF($B7=RaceCard!$D$13,3,IF($B7=RaceCard!$E$13,4,\"\")))))","v":""},{"$f":"IF($B7=\"\",\"\",IF($B7=RaceCard!$B$14,1,IF($B7=RaceCard!$C$14,2,IF($B7=RaceCard!$D$14,3,IF($B7=RaceCard!$E$14,4,\"\")))))","v":""},{"$f":"IF(B7=\"\",\"\",RaceCard!T5)","v":95},{"$f":"IF(B7=\"\",\"\",IF($B7=RaceCard!$B$12,1,\"\"))","v":""},{"$f":"IF(B7=\"\",\"\",IF(RaceCard!S5=\"\",\"\",RaceCard!S5))","v":"17X"},{"$f":"IF(B7=\"\",\"\",IF(RaceCard!X5=\"\",\"\",VALUE(RaceCard!X5)))","v":1},{"$f":"IF(B7=\"\",\"\",IF(RaceCard!Y5=\"\",\"\",VALUE(RaceCard!Y5)))","v":7},{"$f":"IF(B7=\"\",\"\",IF(RaceCard!Z5=\"\",\"\",VALUE(RaceCard!Z5)))","v":""},{"$f":"IF(B7=\"\",\"\",IF(RaceCard!Q5=\"\",\"\",RaceCard!Q5))","v":"W"},{"$f":"IF(B7=\"\",\"\",IF(RaceCard!P5=\"\",\"\",RaceCard!P5))","v":"B MURPHY"},{"$nulls":12},{"$f":"F2","v":3},7,"02:18 PM-CANBERRA-03",{"$f":"IF(RaceCard!AY8=\"\",\"\",RaceCard!AY8)","v":"14:18:00"},{"$f":"IF(RaceCard!AZ8=\"\",\"\",RaceCard!AZ8)","v":"CANBERRA"},{"$f":"IF(RaceCard!BA8=\"\",\"\",RaceCard!BA8)","v":"03"},{"$f":"IF(RaceCard!BB8=\"\",\"\",RaceCard!BB8)","v":"GRASS FX BM 70 HCP"},{"$f":"IF(RaceCard!BC8=\"\",\"\",RaceCard!BC8)","v":"BM70"},{"$f":"IF(AI7=\"\",\"\",IF(ISERROR(VLOOKUP(AI7,RaceCard!$AD$2:$AF$48,2,FALSE)),\"X\",VLOOKUP(AI7,RaceCard!$AD$2:$AF$48,3,FALSE)))","v":"CR"},"CR-03"]
[null,{"$f":"IF(OR(RaceCard!$V6=0,RaceCard!$V6=\"\",RaceCard!$V6>1000),\"\",RaceCard!M6)","v":5},{"$f":"IF(B8=\"\",\"\",RaceCard!N6)","v":"BATTLE READY"},{"$f":"IF(B8=\"\",\"\",RaceCard!V6)","v":9},{"$f":"IF(B8=\"\",\"\",RaceCard!W6)","v":2},{"$f":"IF(B8=\"\",\"\",RaceCard!U6)","v":7.3},0.23287671232876717,{"$f":"IF(B8=\"\",\"\",RaceCard!O6)","v":55.5},{"$f":"IF(B8=\"\",\"\",IF($B8=RaceCard!$B$13,1,IF($B8=RaceCard!$C$13,2,IF($B8=RaceCard!$D$13,3,IF($B8=RaceCard!$E$13,4,\"\")))))","v":""},{"$f":"IF($B8=\"\",\"\",IF($B8=RaceCard!$B$14,1,IF($B8=RaceCard!$C$14,2,IF($B8=RaceCard!$D$14,3,IF($B8=RaceCard!$E$14,4,\"\")))))","v":""},{"$f":"IF(B8=\"\",\"\",RaceCard!T6)","v":96},{"$f":"IF(B8=\"\",\"\",IF($B8=RaceCard!$B$12,1,\"\"))","v":""},{"$f":"IF(B8=\"\",\"\",IF(RaceCard!S6=\"\",\"\",RaceCard!S6))","v":"X6X"},{"$f":"IF(B8=\"\",\"\",IF(RaceCard!X6=\"\",\"\",VALUE(RaceCard!X6)))","v":""},{"$f":"IF(B8=\"\",\"\",IF(RaceCard!Y6=\"\",\"\",VALUE(RaceCard!Y6)))","v":6},{"$f":"IF(B8=\"\",\"\",IF(RaceCard!Z6=\"\",\"\",VALUE(RaceCard!Z6)))","v":""},{"$f":"IF(B8=\"\",\"\",IF(RaceCard!Q6=\"\",\"\",RaceCard!Q6))","v":"DW"},{"$f":"IF(B8=\"\",\"\",IF(RaceCard!P6=\"\",\"\",RaceCard!P6))","v":"G BUCKLEY"},{"$nulls":12},{"$f":"CONCATENATE(AE6,TEXT(AE7,\"0\"))","v":"CR3"},8,"02:30 PM-ARMIDALE-01",{"$f":"IF(RaceCard!AY9=\"\",\"\",RaceCard!AY9)","v":"14:30:00"},{"$f":"IF(RaceCard!AZ9=\"\",\"\",RaceCard!AZ9)","v":"ARMIDALE"},{"$f":"IF(RaceCard!BA9=\"\",\"\",RaceCard!BA9)","v":"01"},{"$f":"IF(RaceCard!BB9=\"\",\"\",RaceCard!BB9)","v":"ARMIDALE CUP DAY 19/3 MDN PLT"},{"$f":"IF(RaceCard!BC9=\"\",\"\",RaceCard!BC9)","v":"MDN"},{"$f":"IF(AI8=\"\",\"\",IF(ISERROR(VLOOKUP(AI8,RaceCard!$AD$2:$AF$48,2,FALSE)),\"X\",VLOOKUP(AI8,RaceCard!$AD$2:$AF$48,3,FALSE)))","v":"NR"},"NR-01"]
[null,{"$f":"IF(OR(RaceCard!$V7=0,RaceCard!$V7=\"\",RaceCard!$V7>1000),\"\",RaceCard!M7)","v":6},{"$f":"IF(B9=\"\",\"\",RaceCard!N7)","v":"TANYA JEAN"},{"$f":"IF(B9=\"\",\"\",RaceCard!V7)","v":2.6},{"$f":"IF(B9=\"\",\"\",RaceCard!W7)","v":3},{"$f":"IF(B9=\"\",\"\",RaceCard!U7)","v":1.8},0.44444444444444448,{"$f":"IF(B9=\"\",\"\",RaceCard!O7)","v":55.5},{"$f":"IF(B9=\"\",\"\",IF($B9=RaceCard!$B$13,1,IF($B9=RaceCard!$C$13,2,IF($B9=RaceCard!$D$13,3,IF($B9=RaceCard!$E$13,4,\"\")))))","v":2},{"$f":"IF($B9=\"\",\"\",IF($B9=RaceCard!$B$14,1,IF($B9=RaceCard!$C$14,2,IF($B9=RaceCard!$D$14,3,IF($B9=RaceCard!$E$14,4,\"\")))))","v":1},{"$f":"IF(B9=\"\",\"\",RaceCard!T7)","v":100},{"$f":"IF(B9=\"\",\"\",IF($B9=RaceCard!$B$12,1,\"\"))","v":""},{"$f":"IF(B9=\"\",\"\",IF(RaceCard!S7=\"\",\"\",RaceCard!S7))","v":51},{"$f":"IF(B9=\"\",\"\",IF(RaceCard!X7=\"\",\"\",VALUE(RaceCard!X7)))","v":5},{"$f":"IF(B9=\"\",\"\",IF(RaceCard!Y7=\"\",\"\",VALUE(RaceCard!Y7)))","v":1},{"$f":"IF(B9=\"\",\"\",IF(RaceCard!Z7=\"\",\"\",VALUE(RaceCard!Z7)))","v":""},{"$f":"IF(B9=\"\",\"\",IF(RaceCard!Q7=\"\",\"\",RaceCard!Q7))","v":"TC"},{"$f":"IF(B9=\"\",\"\",IF(RaceCard!P7=\"\",\"\",RaceCard!P7))","v":"MATHEW CAHILL"},{"$nulls":13},9,"02:35 PM-IPSWICH-02",{"$f":"IF(RaceCard!AY10=\"\",\"\",RaceCard!AY10)","v":"14:35:00"},{"$f":"IF(RaceCard!AZ10=\"\",\"\",RaceCard!AZ10)","v":"IPSWICH"},{"$f":"IF(RaceCard!BA10=\"\",\"\",RaceCard!BA10)","v":"02"},{"$f":"IF(RaceCard!BB10=\"\",\"\",RaceCard!BB10)","v":"KEVIN KEIDGE MEM 2YO MDN HCP"},{"$f":"IF(RaceCard!BC10=\"\",\"\",RaceCard!BC10)","v":"UNKNOWN"},{"$f":"IF(AI9=\"\",\"\",IF(ISERROR(VLOOKUP(AI9,RaceCard!$AD$2:$AF$48,2,FALSE)),\"X\",VLOOKUP(AI9,RaceCard!$AD$2:$AF$48,3,FALSE)))","v":"BR"},"BR-02"]
[null,{"$f":"IF(OR(RaceCard!$V8=0,RaceCard!$V8=\"\",RaceCard!$V8>1000),\"\",RaceCard!M8)","v":7},{"$f":"IF(B10=\"\",\"\",RaceCard!N8)","v":"MATERIAL MATTERS"},{"$f":"IF(B10=\"\",\"\",RaceCard!V8)","v":3.1},{"$f":"IF(B10=\"\",\"\",RaceCard!W8)","v":1},{"$f":"IF(B10=\"\",\"\",RaceCard!U8)","v":5.6},-0.4464285714285714,{"$f":"IF(B10=\"\",\"\",RaceCard!O8)","v":54},{"$f":"IF(B10=\"\",\"\",IF($B10=RaceCard!$B$13,1,IF($B10=RaceCard!$C$13,2,IF($B10=RaceCard!$D$13,3,IF($B10=RaceCard!$E$13,4,\"\")))))","v":1},{"$f":"IF($B10=\"\",\"\",IF($B10=RaceCard!$B$14,1,IF($B10=RaceCard!$C$14,2,IF($B10=RaceCard!$D$14,3,IF($B10=RaceCard!$E$14,4,\"\")))))","v":2},{"$f":"IF(B10=\"\",\"\",RaceCard!T8)","v":96},{"$f":"IF(B10=\"\",\"\",IF($B10=RaceCard!$B$12,1,\"\"))","v":""},{"$f":"IF(B10=\"\",\"\",IF(RaceCard!S8=\"\",\"\",RaceCard!S8))","v":232},{"$f":"IF(B10=\"\",\"\",IF(RaceCard!X8=\"\",\"\",VALUE(RaceCard!X8)))","v":2},{"$f":"IF(B10=\"\",\"\",IF(RaceCard!Y8=\"\",\"\",VALUE(RaceCard!Y8)))","v":3},{"$f":"IF(B10=\"\",\"\",IF(RaceCard!Z8=\"\",\"\",VALUE(RaceCard!Z8)))","v":2},{"$f":"IF(B10=\"\",\"\",IF(RaceCard!Q8=\"\",\"\",RaceCard!Q8))","v":"C"},{"$f":"IF(B10=\"\",\"\",IF(RaceCard!P8=\"\",\"\",RaceCard!P8))","v":"J PENZA"},{"$nulls":13},10,"02:45 PM-MORNINGTON-04",{"$f":"IF(RaceCard!AY11=\"\",\"\",RaceCard!AY11)","v":"14:45:00"},{"$f":"IF(RaceCard!AZ11=\"\",\"\",RaceCard!AZ11)","v":"MORNINGTON"},{"$f":"IF(RaceCard!BA11=\"\",\"\",RaceCard!BA11)","v":"04"},{"$f":"IF(RaceCard!BB11=\"\",\"\",RaceCard!BB11)","v":"LAND ENGINEERING F&M 0-62 HCP"},{"$f":"IF(RaceCard!BC11=\"\",\"\",RaceCard!BC11)","v":"RB62"},{"$f":"IF(AI10=\"\",\"\",IF(ISERROR(VLOOKUP(AI10,RaceCard!$AD$2:$AF$48,2,FALSE)),\"X\",VLOOKUP(AI10,RaceCard!$AD$2:$AF$48,3,FALSE)))","v":"VR"},"VR-04"]
{"$rows_left_out":292}
{"sheet":"Start here","index":2,"n_rows":25,"n_cols":3,"rows_kept":25,"cut":false,"hidden":false,"merged":[]}
[]
[null,"Instructions/Notes"]
[null,"1) Enter a Date in cell A1 in the Review Worksheet"]
[]
[null,"2) In cell B2, select which Race Types you wish to see loaded (R = Horses, G = Greyhounds, RG = Both Greyhounds and Horses)"]
[]
[null,"3) Click the 'Load Races' button and the day's races will appear in the left-hand navigation panel"]
[]
[null,"4) Click on a Race to retrieve race details"]
[]
{"$rows_left_out":15}