{"text_format":"2","workbook":"xlsx","n_sheets":3,"sheets":["RaceCard","Review","Start here"],"not_rendered":{"charts":0,"images":1,"macros":1,"external_links":0,"defined_names":4,"comments":1,"pivot_tables":0},"unopened":[],"bounds":{"document_bytes":16777216,"sheet_cells":100000,"run_cost":"one","rows_first":2000,"rows_last":500,"rows_between":2000,"halvings":0,"cell_chars":16384,"cell_head_chars":4096},"cells_cut":0,"cells_raw":0,"read":"whole","date_system":"1900"}

{"sheet":"RaceCard","index":0,"n_rows":305,"n_cols":55,"rows_kept":305,"cut":false,"hidden":false,"merged":[]}
["Code","Track","Track Condition","Track Rating",null,null,"Weather",{"$nulls":5},"TAB","Name","Weight","Jockey","Win Types","BP","L3S","Q Rating","Last Odds","Win$","Plc$","LFP1","LFP2","LFP3","Q Rating Rank","ABND","MeetingType","Venue","Abandoned","Code","Races","VTAB CODE","Type","Venue","Track","Weather","QTAB CODE","Race ID","Race Name","Distance","Class 1","Time","Jump","Track","Race","Race Name","Class 2",null,"Jump","Track","Race","Race Name","Class 2"]
["CR","Canberra","Good",1,3,1,"Fine","N",{"$nulls":4},1,"RAVNA GORA",60.5,"J KISSICK(A)","DWTC",3,434,94,3,3.2,3,{"$f":"IF(OR($V2=0,$V2=\"\",$V2>1000),\"\",IF(OR(S2=\"\",LEFT(S2,1)=\"F\",LEFT(S2,1)=\"L\",LEFT(S2,1)=\"U\",LEFT(S2,1)=\"X\",LEFT(S2,1)=\"P\",LEFT(S2,1)=\"0\",LEFT(S2,1)=\"T\",LEFT(S2,1)=\"D\"),\"\",LEFT(S2,1)))","v":"4"},{"$f":"IF(OR($V2=0,$V2=\"\",$V2>1000),\"\",IF(OR(S2=\"\",MID(S2,2,1)=\"X\",MID(S2,2,1)=\"L\",MID(S2,2,1)=\"U\",MID(S2,2,1)=\"D\",MID(S2,2,1)=\"P\",MID(S2,2,1)=\"T\",MID(S2,2,1)=\"0\",MID(S2,2,1)=\"F\"),\"\",IF(LEN(S2)=1,\"\",MID(S2,2,1))))","v":"3"},{"$f":"IF(OR($V2=0,$V2=\"\",$V2>1000),\"\",IF(OR(S2=\"\",RIGHT(S2,1)=\"X\",RIGHT(S2,1)=\"L\",RIGHT(S2,1)=\"U\",RIGHT(S2,1)=\"D\",RIGHT(S2,1)=\"P\",RIGHT(S2,1)=\"0\",RIGHT(S2,1)=\"T\",RIGHT(S2,1)=\"F\"),\"\",IF(OR(LEN(S2)=2,LEN(S2)=1),\"\",RIGHT(S2,1))))","v":"4"},{"$f":"IF(OR($V2=0,$V2=\"\",$V2>1000),\"\",RANK(T2,T$2:T$25)+COUNTIF(T$2:T2,T2)-1)","v":5},{"$f":"VLOOKUP(Review!D2,RaceCard!AD2:AE80,2,FALSE)","v":"N"},"R","Ipswich","Y","BR",7,"MR_20120127","R","MOONEE VALLEY","DEAD","FINE",{"$f":"IF(AJ2=\"\",\"\",IF(ISERROR(VLOOKUP(AJ2,$AD$2:$AF$48,1,FALSE)),\"X\",VLOOKUP(AJ2,$AD$2:$AF$48,3,FALSE)))","v":"MR"},"MR_20120127_01","MITCHELTON WINES 3YO 0-72 HCP",1600,"RB72","18:45:00",{"$f":"IF(AN2=\"\",\"\",IF(OR(RIGHT(VLOOKUP(LEFT(AN2,11),$AH$2:$AM$28,6,FALSE),1)=\"S\",VLOOKUP(LEFT(AN2,11),$AH$2:$AM$28,6,FALSE)=\"X\"),\"\",AR2))","v":"18:45:00"},{"$f":"IF(AN2=\"\",\"\",IF(OR(RIGHT(VLOOKUP(LEFT(AN2,11),$AH$2:$AM$50,6,FALSE),1)=\"S\",VLOOKUP(LEFT(AN2,11),$AH$2:$AM$50,6,FALSE)=\"X\"),\"\",VLOOKUP(LEFT(AN2,11),$AH$2:$AJ$50,3,FALSE)))","v":"MOONEE VALLEY"},{"$f":"IF(AN2=\"\",\"\",IF(OR(RIGHT(VLOOKUP(LEFT(AN2,11),$AH$2:$AM$28,6,FALSE),1)=\"S\",VLOOKUP(LEFT(AN2,11),$AH$2:$AM$28,6,FALSE)=\"X\"),\"\",RIGHT(AN2,2)))","v":"01"},{"$f":"IF(AS2=\"\",\"\",IF(AO2=\"\",\"UNKNOWN RACE NAME\",AO2))","v":"MITCHELTON WINES 3YO 0-72 HCP"},{"$f":"IF(AS2=\"\",\"\",IF(AQ2=\"\",\"UNKNOWN\",AQ2))","v":"RB72"},null,"13:00:00","MORNINGTON","01","LAND ENGINEERING MDN PLT","MDN"]
["Race No.","Jump Time","Race Name","Distance","Status",{"$nulls":5},"Time",null,2,"JOLLY JOKER",58.5,"A KING(A)","DWC",8,135,94,0,108.5,6,{"$f":"IF(OR($V3=0,$V3=\"\",$V3>1000),\"\",IF(OR(S3=\"\",LEFT(S3,1)=\"F\",LEFT(S3,1)=\"L\",LEFT(S3,1)=\"U\",LEFT(S3,1)=\"X\",LEFT(S3,1)=\"P\",LEFT(S3,1)=\"0\",LEFT(S3,1)=\"T\",LEFT(S3,1)=\"D\"),\"\",LEFT(S3,1)))","v":"1"},{"$f":"IF(OR($V3=0,$V3=\"\",$V3>1000),\"\",IF(OR(S3=\"\",MID(S3,2,1)=\"X\",MID(S3,2,1)=\"L\",MID(S3,2,1)=\"U\",MID(S3,2,1)=\"D\",MID(S3,2,1)=\"P\",MID(S3,2,1)=\"T\",MID(S3,2,1)=\"0\",MID(S3,2,1)=\"F\"),\"\",IF(LEN(S3)=1,\"\",MID(S3,2,1))))","v":"3"},{"$f":"IF(OR($V3=0,$V3=\"\",$V3>1000),\"\",IF(OR(S3=\"\",RIGHT(S3,1)=\"X\",RIGHT(S3,1)=\"L\",RIGHT(S3,1)=\"U\",RIGHT(S3,1)=\"D\",RIGHT(S3,1)=\"P\",RIGHT(S3,1)=\"0\",RIGHT(S3,1)=\"T\",RIGHT(S3,1)=\"F\"),\"\",IF(OR(LEN(S3)=2,LEN(S3)=1),\"\",RIGHT(S3,1))))","v":"5"},{"$f":"IF(OR($V3=0,$V3=\"\",$V3>1000),\"\",RANK(T3,T$2:T$25)+COUNTIF(T$2:T3,T3)-1)","v":6},null,"R","Moonee Valley","N","MR",8,"SR_20120127","R","ARMIDALE","SLOW","OCAST",{"$f":"IF(AJ3=\"\",\"\",IF(ISERROR(VLOOKUP(AJ3,$AD$2:$AF$48,1,FALSE)),\"X\",VLOOKUP(AJ3,$AD$2:$AF$48,3,FALSE)))","v":"NR"},"MR_20120127_02","AQUANAS FOODS 0-82 HCP",3000,"RB82","19:15:00",{"$f":"IF(AN3=\"\",\"\",IF(OR(RIGHT(VLOOKUP(LEFT(AN3,11),$AH$2:$AM$28,6,FALSE),1)=\"S\",VLOOKUP(LEFT(AN3,11),$AH$2:$AM$28,6,FALSE)=\"X\"),\"\",AR3))","v":"19:15:00"},{"$f":"IF(AN3=\"\",\"\",IF(OR(RIGHT(VLOOKUP(LEFT(AN3,11),$AH$2:$AM$50,6,FALSE),1)=\"S\",VLOOKUP(LEFT(AN3,11),$AH$2:$AM$50,6,FALSE)=\"X\"),\"\",VLOOKUP(LEFT(AN3,11),$AH$2:$AJ$50,3,FALSE)))","v":"MOONEE VALLEY"},"02",{"$f":"IF(AS3=\"\",\"\",IF(AO3=\"\",\"UNKNOWN RACE NAME\",AO3))","v":"AQUANAS FOODS 0-82 HCP"},{"$f":"IF(AS3=\"\",\"\",IF(AQ3=\"\",\"UNKNOWN\",AQ3))","v":"RB82"},null,"13:08:00","CANBERRA","01","KENNARDS HIRE 2YO HCP","UNKNOWN"]
[3,"2012-01-27T13:18:00","BM 70 HANDICAP",1000,"SELLING",{"$nulls":5},{"$f":"TIMEVALUE(RIGHT(B4,8))","v":"13:18:00"},null,3,"DELABOMBELL",57,"B WARD","DC",7,"X46",93,1638.35,1638.35,1638.35,"","","",{"$f":"IF(OR($V4=0,$V4=\"\",$V4>1000),\"\",RANK(T4,T$2:T$25)+COUNTIF(T$2:T4,T4)-1)","v":""},null,"R","Sunshine Coast","Y","QR",8,"AR_20120127","R","FONTWELL PARK",null,null,"X","MR_20120127_03","CORPORATE INTERIORS PREMIUM 0-78",1000,"RB78","19:45:00","19:45:00","MOONEE VALLEY","03","CORPORATE INTERIORS PREMIUM 0-78",{"$f":"IF(AS4=\"\",\"\",IF(AQ4=\"\",\"UNKNOWN\",AQ4))","v":"RB78"},null,"13:35:00","MORNINGTON","02","LAND ENGINEERING F&M MDN PLT","MDN"]
["Tipster","Tips 1","Tips 2","Tips 3","Tips 4",{"$nulls":7},4,"MY DEAR FRIEND",57,"B MURPHY","W",2,"17X",95,0,54.2,0,"1","7","",{"$f":"IF(OR($V5=0,$V5=\"\",$V5>1000),\"\",RANK(T5,T$2:T$25)+COUNTIF(T$2:T5,T5)-1)","v":4},null,"R","Armidale","N","NR",8,"BR_20120127","R","IPSWICH",null,null,"BR","MR_20120127_04","ESSENDON MAZDA AUSTRALIA STAKES",1200,null,"20:15:00","20:15:00","MOONEE VALLEY","04","ESSENDON MAZDA AUSTRALIA STAKES",{"$f":"IF(AS5=\"\",\"\",IF(AQ5=\"\",\"UNKNOWN\",AQ5))","v":"UNKNOWN"},null,"13:43:00","CANBERRA","02","ALAN RUMMERY MDN PLT","MDN"]
[{"$nulls":12},5,"BATTLE READY",55.5,"G BUCKLEY","DW",6,"X6X",96,7.3,9,2,"","6","",{"$f":"IF(OR($V6=0,$V6=\"\",$V6>1000),\"\",RANK(T6,T$2:T$25)+COUNTIF(T$2:T6,T6)-1)","v":2},null,"R","Mornington","N","VR",8,"WR_20120127","R","HUNTINGDON",null,null,"X","MR_20120127_05","ESSENDON MAZDA 55 SEC MARES HT11",955,null,"20:45:00","20:45:00","MOONEE VALLEY","05","ESSENDON MAZDA 55 SEC MARES HT11",{"$f":"IF(AS6=\"\",\"\",IF(AQ6=\"\",\"UNKNOWN\",AQ6))","v":"UNKNOWN"},null,"14:00:00","IPSWICH","01","SKY RACING BM 75 HCP","UNKNOWN"]
["RADIO TAB","*7-6-2",{"$nulls":10},6,"TANYA JEAN",55.5,"MATHEW CAHILL","TC",4,51,100,1.8,2.6,3,"5","1","",{"$f":"IF(OR($V7=0,$V7=\"\",$V7>1000),\"\",RANK(T7,T$2:T$25)+COUNTIF(T$2:T7,T7)-1)","v":1},null,"R","Canberra","N","CR",8,"PR_20120127","R","MORNINGTON","DEAD","FINE","VR","MR_20120127_06","SPORTINGBET CARLYON F&M CLASSIC",2040,null,"21:15:00","21:15:00","MOONEE VALLEY","06","SPORTINGBET CARLYON F&M CLASSIC",{"$f":"IF(AS7=\"\",\"\",IF(AQ7=\"\",\"UNKNOWN\",AQ7))","v":"UNKNOWN"},null,"14:10:00","MORNINGTON","03","ADAM DOWER MEMORIAL MDN PLT","MDN"]
["IAN HUMPHRIES","6-7-1",{"$nulls":10},7,"MATERIAL MATTERS",54,"J PENZA","C",1,232,96,5.6,3.1,1,"2","3","2",{"$f":"IF(OR($V8=0,$V8=\"\",$V8>1000),\"\",RANK(T8,T$2:T$25)+COUNTIF(T$2:T8,T8)-1)","v":3},null,"T","Tamworth","N","ST",8,"CR_20120127","R","CANBERRA","GOOD","FINE","CR","MR_20120127_07","PRINTHOUSE GROUP 0-78 HCP",1600,"RB78","21:45:00",{"$f":"IF(AN8=\"\",\"\",IF(OR(RIGHT(VLOOKUP(LEFT(AN8,11),$AH$2:$AM$28,6,FALSE),1)=\"S\",VLOOKUP(LEFT(AN8,11),$AH$2:$AM$28,6,FALSE)=\"X\"),\"\",AR8))","v":"21:45:00"},{"$f":"IF(AN8=\"\",\"\",IF(OR(RIGHT(VLOOKUP(LEFT(AN8,11),$AH$2:$AM$50,6,FALSE),1)=\"S\",VLOOKUP(LEFT(AN8,11),$AH$2:$AM$50,6,FALSE)=\"X\"),\"\",VLOOKUP(LEFT(AN8,11),$AH$2:$AJ$50,3,FALSE)))","v":"MOONEE VALLEY"},{"$f":"IF(AN8=\"\",\"\",IF(OR(RIGHT(VLOOKUP(LEFT(AN8,11),$AH$2:$AM$28,6,FALSE),1)=\"S\",VLOOKUP(LEFT(AN8,11),$AH$2:$AM$28,6,FALSE)=\"X\"),\"\",RIGHT(AN8,2)))","v":"07"},"PRINTHOUSE GROUP 0-78 HCP",{"$f":"IF(AS8=\"\",\"\",IF(AQ8=\"\",\"UNKNOWN\",AQ8))","v":"RB78"},null,"14:18:00","CANBERRA","03","GRASS FX BM 70 HCP","BM70"]
[{"$f":"IF(B6=\"\",\"\",A6)","v":""},{"$f":"IF(B6=\"\",\"\",IF(LEFT(B6,1)=\"*\",MID(B6,2,100),B6))","v":""},{"$nulls":10},8,"BLUE WREN",54,"S GUYMER(A)",null,5,"71X",86,0,36.1,0,"7","1","",{"$f":"IF(OR($V9=0,$V9=\"\",$V9>1000),\"\",RANK(T9,T$2:T$25)+COUNTIF(T$2:T9,T9)-1)","v":8},null,"T","Melton","N","MT",9,"TR_20120127","R","SUNSHINE COAST",null,null,"QR","MR_20120127_08","ANDREWS & PARKER FURNITURE 0-72",1200,"RB72","22:15:00","22:15:00","MOONEE VALLEY","08","ANDREWS & PARKER FURNITURE 0-72",{"$f":"IF(AS9=\"\",\"\",IF(AQ9=\"\",\"UNKNOWN\",AQ9))","v":"RB72"},null,"14:30:00","ARMIDALE","01","ARMIDALE CUP DAY 19/3 MDN PLT","MDN"]
[{"$f":"IF(B7=\"\",\"\",A7)","v":"RADIO TAB"},{"$f":"IF(B7=\"\",\"\",IF(LEFT(B7,1)=\"*\",MID(B7,2,100),B7))","v":"7-6-2"},{"$nulls":21},"","","",{"$f":"IF(OR($V10=0,$V10=\"\",$V10>1000),\"\",RANK(T10,T$2:T$25)+COUNTIF(T$2:T10,T10)-1)","v":""},null,"T","Gold Coast","N","QT",10,"LR_20120127","R","SINGAPORE",null,null,"X","SR_20120127_01","ARMIDALE CUP DAY 19/3 MDN PLT",1900,"MDN","14:30:00","14:30:00","ARMIDALE","01","ARMIDALE CUP DAY 19/3 MDN PLT",{"$f":"IF(AS10=\"\",\"\",IF(AQ10=\"\",\"UNKNOWN\",AQ10))","v":"MDN"},null,"14:35:00","IPSWICH","02","KEVIN KEIDGE MEM 2YO MDN HCP","UNKNOWN"]
["IAN HUMPHRIES","6-7-1",{"$nulls":21},"","","",{"$f":"IF(OR($V11=0,$V11=\"\",$V11>1000),\"\",RANK(T11,T$2:T$25)+COUNTIF(T$2:T11,T11)-1)","v":""},null,"T","Penrith","N","NT",8,"ER_20120127","R","LINGFIELD",null,null,"BS","SR_20120127_02","GUYRA CUP DAY 4/3 MDN HCP",1300,"MDN","15:05:00","15:05:00","ARMIDALE","02","GUYRA CUP DAY 4/3 MDN HCP",{"$f":"IF(AS11=\"\",\"\",IF(AQ11=\"\",\"UNKNOWN\",AQ11))","v":"MDN"},null,"14:45:00","MORNINGTON","04","LAND ENGINEERING F&M 0-62 HCP","RB62"]
["LATE MAIL",{"$nulls":22},"","","",{"$f":"IF(OR($V12=0,$V12=\"\",$V12>1000),\"\",RANK(T12,T$2:T$25)+COUNTIF(T$2:T12,T12)-1)","v":""},null,"T","Maryborough","N","VT",8,"YR_20120127","R","ROTORUA","DEAD","SHWRY","ZS","SR_20120127_03","SCHWEPPES MDN PLT",1100,"MDN","15:40:00",{"$f":"IF(AN12=\"\",\"\",IF(OR(RIGHT(VLOOKUP(LEFT(AN12,11),$AH$2:$AM$28,6,FALSE),1)=\"S\",VLOOKUP(LEFT(AN12,11),$AH$2:$AM$28,6,FALSE)=\"X\"),\"\",AR12))","v":"15:40:00"},{"$f":"IF(AN12=\"\",\"\",IF(OR(RIGHT(VLOOKUP(LEFT(AN12,11),$AH$2:$AM$50,6,FALSE),1)=\"S\",VLOOKUP(LEFT(AN12,11),$AH$2:$AM$50,6,FALSE)=\"X\"),\"\",VLOOKUP(LEFT(AN12,11),$AH$2:$AJ$50,3,FALSE)))","v":"ARMIDALE"},{"$f":"IF(AN12=\"\",\"\",IF(OR(RIGHT(VLOOKUP(LEFT(AN12,11),$AH$2:$AM$28,6,FALSE),1)=\"S\",VLOOKUP(LEFT(AN12,11),$AH$2:$AM$28,6,FALSE)=\"X\"),\"\",RIGHT(AN12,2)))","v":"03"},"SCHWEPPES MDN PLT",{"$f":"IF(AS12=\"\",\"\",IF(AQ12=\"\",\"UNKNOWN\",AQ12))","v":"MDN"},null,"14:53:00","CANBERRA","04","AUST HEALTH & SAFETY MDN PLT","MDN"]
["RADIO TAB",7,6,2,{"$nulls":19},"","","",{"$f":"IF(OR($V13=0,$V13=\"\",$V13>1000),\"\",RANK(T13,T$2:T$25)+COUNTIF(T$2:T13,T13)-1)","v":""},null,"T","Mt Gambier","N","AT",8,"TH_20120127","R","FAIRVIEW",null,null,"AS","SR_20120127_04","HAHN SUPER DRY CL1 HCP",1100,"CL1","16:20:00","16:20:00","ARMIDALE","04","HAHN SUPER DRY CL1 HCP",{"$f":"IF(AS13=\"\",\"\",IF(AQ13=\"\",\"UNKNOWN\",AQ13))","v":"CL1"},null,"15:05:00","ARMIDALE","02","GUYRA CUP DAY 4/3 MDN HCP","MDN"]
[null,6,7,1,{"$nulls":19},"","","",{"$f":"IF(OR($V14=0,$V14=\"\",$V14>1000),\"\",RANK(T14,T$2:T$25)+COUNTIF(T$2:T14,T14)-1)","v":""},null,"T","Gloucester Park","N","PT",10,{"$nulls":5},"","SR_20120127_05","XXXX GOLD BM 56 HCP",1900,"BM56","17:00:00","17:00:00","ARMIDALE","05","XXXX GOLD BM 56 HCP",{"$f":"IF(AS14=\"\",\"\",IF(AQ14=\"\",\"UNKNOWN\",AQ14))","v":"BM56"},null,"15:10:00","IPSWICH","03","TERRY NEALE MEM CL2 HCP","UNKNOWN"]
["Type","Available","Last Update","Status","Update Time","Last Update","Update Time","Time Diff",{"$nulls":15},"","","",{"$f":"IF(OR($V15=0,$V15=\"\",$V15>1000),\"\",RANK(T15,T$2:T$25)+COUNTIF(T$2:T15,T15)-1)","v":""},null,"T","Bunbury","N","FT",8,{"$nulls":5},"","SR_20120127_06","SCHWEPPES CL1 HCP",1400,"CL1","17:40:00","17:40:00","ARMIDALE","06","SCHWEPPES CL1 HCP",{"$f":"IF(AS15=\"\",\"\",IF(AQ15=\"\",\"UNKNOWN\",AQ15))","v":"CL1"},null,"15:20:00","MORNINGTON","05","LAND ENGINEERING TOUR VIC 0-68","RB68"]
[null,"Y","2012-01-01T17:08:38","SELLING","2012-01-01T17:20:35","EX","Y","2012-01-27T09:03:48","SELLING","2012-01-27T10:04:01",{"$nulls":13},"","","",{"$f":"IF(OR($V16=0,$V16=\"\",$V16>1000),\"\",RANK(T16,T$2:T$25)+COUNTIF(T$2:T16,T16)-1)","v":""},null,"T","Alexandra Park","N","ZT",11,{"$nulls":5},"","SR_20120127_07","WALCHA CUP PRELUDE BM 65 HCP",1300,"BM65","18:20:00","18:20:00","ARMIDALE","07","WALCHA CUP PRELUDE BM 65 HCP",{"$f":"IF(AS16=\"\",\"\",IF(AQ16=\"\",\"UNKNOWN\",AQ16))","v":"BM65"},null,"15:30:00","CANBERRA","05","RICHARD KEELEY LUTON BM 65 HCP","BM65"]
["Pool","Div","Leg1","Leg2",{"$nulls":19},"","","",{"$f":"IF(OR($V17=0,$V17=\"\",$V17>1000),\"\",RANK(T17,T$2:T$25)+COUNTIF(T$2:T17,T17)-1)","v":""},null,"T","United States","N","IT",10,{"$nulls":5},"","SR_20120127_08","HAHN PREMIUM LIGHT BM 50 HCP",1100,"BM50","18:55:00","18:55:00","ARMIDALE","08","HAHN PREMIUM LIGHT BM 50 HCP",{"$f":"IF(AS17=\"\",\"\",IF(AQ17=\"\",\"UNKNOWN\",AQ17))","v":"BM50"},null,"15:40:00","ARMIDALE","03","SCHWEPPES MDN PLT","MDN"]
[11,50.8,4,2,{"$nulls":19},"","","",{"$f":"IF(OR($V18=0,$V18=\"\",$V18>1000),\"\",RANK(T18,T$2:T$25)+COUNTIF(T$2:T18,T18)-1)","v":""},null,"G","Ipswich","N","BG",10,{"$nulls":5},"","AR_20120127_01","NATIONAL HUNT NOVICES' HURDLE",3700,null,"00:30:00","","","","",{"$f":"IF(AS18=\"\",\"\",IF(AQ18=\"\",\"UNKNOWN\",AQ18))","v":""},null,"15:50:00","IPSWICH","04","COL BAYLISS MEM F&M MDN HCP","UNKNOWN"]
["Type","Available","Last Update","Status","Update Time","Last Update","Update Time","Time Diff",{"$nulls":15},"","","",{"$f":"IF(OR($V19=0,$V19=\"\",$V19>1000),\"\",RANK(T19,T$2:T$25)+COUNTIF(T$2:T19,T19)-1)","v":""},null,"G","Wentworth Park","N","SG",10,{"$nulls":5},"","AR_20120127_02","RICHARD JOHNSON HCP CHASE CL5",4400,null,"01:00:00","","","","",{"$f":"IF(AS19=\"\",\"\",IF(AQ19=\"\",\"UNKNOWN\",AQ19))","v":""},null,"16:00:00","MORNINGTON","06","MITAVITE SUMMER CHALL. HT6 0-72","RB72"]
[{"$nulls":4},"QN","Y","2012-01-27T09:03:48","SELLING","2012-01-27T10:04:01",{"$nulls":14},"","","",{"$f":"IF(OR($V20=0,$V20=\"\",$V20>1000),\"\",RANK(T20,T$2:T$25)+COUNTIF(T$2:T20,T20)-1)","v":""},null,"G","Geelong","N","MG",12,{"$nulls":5},"","AR_20120127_03","RACING WELFARE HCP HURDLE CL4",4500,null,"01:30:00","","","","",{"$f":"IF(AS20=\"\",\"\",IF(AQ20=\"\",\"UNKNOWN\",AQ20))","v":""},null,"16:10:00","CANBERRA","06","DUB DESIGN CL1 HCP","CL1"]
["Pool","Div","Leg1","Leg2",{"$nulls":19},"","","",{"$f":"IF(OR($V21=0,$V21=\"\",$V21>1000),\"\",RANK(T21,T$2:T$25)+COUNTIF(T$2:T21,T21)-1)","v":""},null,"G","The Gardens","N","NG",10,{"$nulls":5},"","AR_20120127_04","BEGINNERS' CHASE CL4 5YO+",4000,null,"02:00:00","","","","",{"$f":"IF(AS21=\"\",\"\",IF(AQ21=\"\",\"UNKNOWN\",AQ21))","v":""},null,"16:20:00","ARMIDALE","04","HAHN SUPER DRY CL1 HCP","CL1"]
[12,40.700000000000003,2,4,{"$nulls":19},"","","",{"$f":"IF(OR($V22=0,$V22=\"\",$V22>1000),\"\",RANK(T22,T$2:T$25)+COUNTIF(T$2:T22,T22)-1)","v":""},null,"G","Traralgon","N","VG",11,{"$nulls":5},"","AR_20120127_05","HANDICAP HURDLE CL4 4YO+",3700,null,"02:30:00","","","","",{"$f":"IF(AS22=\"\",\"\",IF(AQ22=\"\",\"UNKNOWN\",AQ22))","v":""},null,"16:30:00","IPSWICH","05","MAX STANDFIELD MEM C,G&E MDN HCP","UNKNOWN"]
["Type","Available","Last Update","Status","Update Time","Last Update","Update Time","Time Diff",{"$nulls":15},"","","",{"$f":"IF(OR($V23=0,$V23=\"\",$V23>1000),\"\",RANK(T23,T$2:T$25)+COUNTIF(T$2:T23,T23)-1)","v":""},null,"G","Gawler","N","AG",10,{"$nulls":5},"","BR_20120127_01","SKY RACING BM 75 HCP",1100,null,"14:00:00","14:00:00","IPSWICH","01","SKY RACING BM 75 HCP",{"$f":"IF(AS23=\"\",\"\",IF(AQ23=\"\",\"UNKNOWN\",AQ23))","v":"UNKNOWN"},null,"16:40:00","MORNINGTON","07","BELMARK MORNINGTON 0-58 HCP","RB58"]
[{"$nulls":5},"TF","Y","2012-01-27T09:03:48","SELLING","2012-01-27T10:04:01",{"$nulls":13},"","","",{"$f":"IF(OR($V24=0,$V24=\"\",$V24>1000),\"\",RANK(T24,T$2:T$25)+COUNTIF(T$2:T24,T24)-1)","v":""},null,"G","Casino","N","CG",12,{"$nulls":5},"","BR_20120127_02","KEVIN KEIDGE MEM 2YO MDN HCP",1100,null,"14:35:00","14:35:00","IPSWICH","02","KEVIN KEIDGE MEM 2YO MDN HCP",{"$f":"IF(AS24=\"\",\"\",IF(AQ24=\"\",\"UNKNOWN\",AQ24))","v":"UNKNOWN"},null,"16:50:00","CANBERRA","07","UPTON & WIGGAN BM 55 HCP","BM55"]
["Pool","Div","Leg1","Leg2","Leg3",{"$nulls":18},"","","",{"$f":"IF(OR($V25=0,$V25=\"\",$V25>1000),\"\",RANK(T25,T$2:T$25)+COUNTIF(T$2:T25,T25)-1)","v":""},null,"G","Mandurah","N","PG",13,{"$nulls":5},"","BR_20120127_03","TERRY NEALE MEM CL2 HCP",1350,null,"15:10:00","15:10:00","IPSWICH","03","TERRY NEALE MEM CL2 HCP",{"$f":"IF(AS25=\"\",\"\",IF(AQ25=\"\",\"UNKNOWN\",AQ25))","v":"UNKNOWN"},null,"17:00:00","ARMIDALE","05","XXXX GOLD BM 56 HCP","BM56"]
[40,174.8,4,2,7,{"$nulls":23},"G","Addington","N","OG",12,{"$nulls":5},"","BR_20120127_04","COL BAYLISS MEM F&M MDN HCP",1200,null,"15:50:00","15:50:00","IPSWICH","04","COL BAYLISS MEM F&M MDN HCP",{"$f":"IF(AS26=\"\",\"\",IF(AQ26=\"\",\"UNKNOWN\",AQ26))","v":"UNKNOWN"},null,"17:10:00","IPSWICH","06","DR MERVYN FISH MEM CL1 HCP","UNKNOWN"]
["Type","Available","Last Update","Status","Update Time","Last Update","Update Time","Time Diff",{"$nulls":20},"G","Hatrick","N","ZG",12,{"$nulls":5},"","BR_20120127_05","MAX STANDFIELD MEM C,G&E MDN HCP",1200,null,"16:30:00","16:30:00","IPSWICH","05","MAX STANDFIELD MEM C,G&E MDN HCP",{"$f":"IF(AS27=\"\",\"\",IF(AQ27=\"\",\"UNKNOWN\",AQ27))","v":"UNKNOWN"},null,"17:20:00","MORNINGTON","08","LAND ENGINEERING 0-58 HCP","RB58"]
[{"$nulls":5},{"$f":"IF(C28=\"\",\"\",TIMEVALUE(RIGHT(C28,8)))","v":""},"F4","Y","2012-01-27T07:10:00","ABANDONED","2012-01-27T07:19:45",{"$nulls":17},"G","Winnellie Park","N","DG",6,{"$nulls":5},"","BR_20120127_06","DR MERVYN FISH MEM CL1 HCP",1700,null,"17:10:00","17:10:00","IPSWICH","06","DR MERVYN FISH MEM CL1 HCP",{"$f":"IF(AS28=\"\",\"\",IF(AQ28=\"\",\"UNKNOWN\",AQ28))","v":"UNKNOWN"},null,"17:30:00","CANBERRA","08","CUSTOM SECURITY BM 65 HCP","BM65"]
["Pool","Div","Leg1","Leg2","Leg3","Leg4",{"$nulls":22},"R","Lingfield","N","BS",4,{"$nulls":5},"","BR_20120127_07","GEORGE KITCHING MEM CL1 HCP",1100,null,"17:50:00","17:50:00","IPSWICH","07","GEORGE KITCHING MEM CL1 HCP",{"$f":"IF(AS29=\"\",\"\",IF(AQ29=\"\",\"UNKNOWN\",AQ29))","v":"UNKNOWN"},null,"17:40:00","ARMIDALE","06","SCHWEPPES CL1 HCP","CL1"]
[{"$nulls":28},"R","Kranji","N","SS",9,{"$nulls":5},"","WR_20120127_01","4YO+ NOVICES' HCP HURDLE",4100,null,"00:40:00",null,null,null,"",{"$f":"IF(AS30=\"\",\"\",IF(AQ30=\"\",\"UNKNOWN\",AQ30))","v":""},null,"17:50:00","IPSWICH","07","GEORGE KITCHING MEM CL1 HCP","UNKNOWN"]
["Pool","Div","Leg1","Leg2","Leg3","Leg4",{"$nulls":22},"R","Fairview","N","AS",7,{"$nulls":5},"","WR_20120127_02","4YO+ HCP HURDLE",4300,null,"01:10:00","","","","",{"$f":"IF(AS31=\"\",\"\",IF(AQ31=\"\",\"UNKNOWN\",AQ31))","v":""},null,"18:20:00","ARMIDALE","07","WALCHA CUP PRELUDE BM 65 HCP","BM65"]
[{"$nulls":28},"R","UK","N","CS",3,{"$nulls":5},"","WR_20120127_03","5YO+ NOVICES' CHASE",4800,null,"01:40:00","","","","",{"$f":"IF(AS32=\"\",\"\",IF(AQ32=\"\",\"UNKNOWN\",AQ32))","v":""},null,"18:45:00","MOONEE VALLEY","01","MITCHELTON WINES 3YO 0-72 HCP","RB72"]
["Pool","Div","Leg1","Leg2","Leg3","Leg4",{"$nulls":22},"R","England","N","ES",3,{"$nulls":5},"","WR_20120127_04","5YO+ HCP HURDLE",5200,null,"02:10:00","","","","",{"$f":"IF(AS33=\"\",\"\",IF(AQ33=\"\",\"UNKNOWN\",AQ33))","v":""},null,"18:55:00","ARMIDALE","08","HAHN PREMIUM LIGHT BM 50 HCP","BM50"]
[{"$nulls":28},"R","Rotorua","N","ZS",8,{"$nulls":5},"","PR_20120127_01","LAND ENGINEERING MDN PLT",1021,"MDN","13:00:00","13:00:00","MORNINGTON","01","LAND ENGINEERING MDN PLT",{"$f":"IF(AS34=\"\",\"\",IF(AQ34=\"\",\"UNKNOWN\",AQ34))","v":"MDN"},null,"19:00:00","SUNSHINE COAST","01","CROWNE PLAZA CL3 PLT","UNKNOWN"]
["Pool","Div","Leg1","Leg2","Leg3","Leg4",{"$nulls":32},"","PR_20120127_02","LAND ENGINEERING F&M MDN PLT",1227,"MDN","13:35:00","13:35:00","MORNINGTON","02","LAND ENGINEERING F&M MDN PLT",{"$f":"IF(AS35=\"\",\"\",IF(AQ35=\"\",\"UNKNOWN\",AQ35))","v":"MDN"},null,"19:15:00","MOONEE VALLEY","02","AQUANAS FOODS 0-82 HCP","RB82"]
[{"$nulls":38},"","PR_20120127_03","ADAM DOWER MEMORIAL MDN PLT",1532,"MDN","14:10:00","14:10:00","MORNINGTON","03","ADAM DOWER MEMORIAL MDN PLT",{"$f":"IF(AS36=\"\",\"\",IF(AQ36=\"\",\"UNKNOWN\",AQ36))","v":"MDN"},null,"19:30:00","SUNSHINE COAST","02","WIDE WORLD OF LIGHTS MDN HCP","UNKNOWN"]
["Pool","Div","Leg1","Leg2","Leg3","Leg4",{"$nulls":32},"","PR_20120127_04","LAND ENGINEERING F&M 0-62 HCP",1532,"RB62","14:45:00","14:45:00","MORNINGTON","04","LAND ENGINEERING F&M 0-62 HCP",{"$f":"IF(AS37=\"\",\"\",IF(AQ37=\"\",\"UNKNOWN\",AQ37))","v":"RB62"},null,"19:45:00","MOONEE VALLEY","03","CORPORATE INTERIORS PREMIUM 0-78","RB78"]
[{"$nulls":38},"","PR_20120127_05","LAND ENGINEERING TOUR VIC 0-68",2450,"RB68","15:20:00","15:20:00","MORNINGTON","05","LAND ENGINEERING TOUR VIC 0-68",{"$f":"IF(AS38=\"\",\"\",IF(AQ38=\"\",\"UNKNOWN\",AQ38))","v":"RB68"},null,"20:00:00","SUNSHINE COAST","03","LJ HOOKER CALOUNDRA 2YO PLT","UNKNOWN"]
[{"$nulls":38},"","PR_20120127_06","MITAVITE SUMMER CHALL. HT6 0-72",1532,"RB72","16:00:00","16:00:00","MORNINGTON","06","MITAVITE SUMMER CHALL. HT6 0-72",{"$f":"IF(AS39=\"\",\"\",IF(AQ39=\"\",\"UNKNOWN\",AQ39))","v":"RB72"},null,"20:15:00","MOONEE VALLEY","04","ESSENDON MAZDA AUSTRALIA STAKES","UNKNOWN"]
[{"$nulls":38},"","PR_20120127_07","BELMARK MORNINGTON 0-58 HCP",2050,"RB58","16:40:00","16:40:00","MORNINGTON","07","BELMARK MORNINGTON 0-58 HCP",{"$f":"IF(AS40=\"\",\"\",IF(AQ40=\"\",\"UNKNOWN\",AQ40))","v":"RB58"},null,"20:30:00","SUNSHINE COAST","04","SUNSHINE COAST CUP","UNKNOWN"]
[{"$nulls":38},"","PR_20120127_08","LAND ENGINEERING 0-58 HCP",1227,"RB58","17:20:00","17:20:00","MORNINGTON","08","LAND ENGINEERING 0-58 HCP",{"$f":"IF(AS41=\"\",\"\",IF(AQ41=\"\",\"UNKNOWN\",AQ41))","v":"RB58"},null,"20:45:00","MOONEE VALLEY","05","ESSENDON MAZDA 55 SEC MARES HT11","UNKNOWN"]
[{"$nulls":38},"","CR_20120127_01","KENNARDS HIRE 2YO HCP",1000,null,"13:08:00","13:08:00","CANBERRA","01","KENNARDS HIRE 2YO HCP",{"$f":"IF(AS42=\"\",\"\",IF(AQ42=\"\",\"UNKNOWN\",AQ42))","v":"UNKNOWN"},null,"21:00:00","SUNSHINE COAST","05","TIMBER SHADES CL1 HCP","UNKNOWN"]
[{"$nulls":38},"","CR_20120127_02","ALAN RUMMERY MDN PLT",1000,"MDN","13:43:00","13:43:00","CANBERRA","02","ALAN RUMMERY MDN PLT",{"$f":"IF(AS43=\"\",\"\",IF(AQ43=\"\",\"UNKNOWN\",AQ43))","v":"MDN"},null,"21:15:00","MOONEE VALLEY","06","SPORTINGBET CARLYON F&M CLASSIC","UNKNOWN"]
[{"$nulls":38},"","CR_20120127_03","GRASS FX BM 70 HCP",1000,"BM70","14:18:00","14:18:00","CANBERRA","03","GRASS FX BM 70 HCP",{"$f":"IF(AS44=\"\",\"\",IF(AQ44=\"\",\"UNKNOWN\",AQ44))","v":"BM70"},null,"21:30:00","SUNSHINE COAST","06","SUNCOAST FITNESS C,G&E MDN PLT","UNKNOWN"]
[{"$nulls":38},"","CR_20120127_04","AUST HEALTH & SAFETY MDN PLT",1400,"MDN","14:53:00","14:53:00","CANBERRA","04","AUST HEALTH & SAFETY MDN PLT",{"$f":"IF(AS45=\"\",\"\",IF(AQ45=\"\",\"UNKNOWN\",AQ45))","v":"MDN"},null,"21:45:00","MOONEE VALLEY","07","PRINTHOUSE GROUP 0-78 HCP","RB78"]
[{"$nulls":38},"","CR_20120127_05","RICHARD KEELEY LUTON BM 65 HCP",1200,"BM65","15:30:00","15:30:00","CANBERRA","05","RICHARD KEELEY LUTON BM 65 HCP",{"$f":"IF(AS46=\"\",\"\",IF(AQ46=\"\",\"UNKNOWN\",AQ46))","v":"BM65"},null,"22:00:00","SUNSHINE COAST","07","STAR SHOTS F&M MDN PLT","UNKNOWN"]
[{"$nulls":38},"","CR_20120127_06","DUB DESIGN CL1 HCP",1400,"CL1","16:10:00","16:10:00","CANBERRA","06","DUB DESIGN CL1 HCP",{"$f":"IF(AS47=\"\",\"\",IF(AQ47=\"\",\"UNKNOWN\",AQ47))","v":"CL1"},null,"22:15:00","MOONEE VALLEY","08","ANDREWS & PARKER FURNITURE 0-72","RB72"]
[{"$nulls":38},"","CR_20120127_07","UPTON & WIGGAN BM 55 HCP",1000,"BM55","16:50:00","16:50:00","CANBERRA","07","UPTON & WIGGAN BM 55 HCP",{"$f":"IF(AS48=\"\",\"\",IF(AQ48=\"\",\"UNKNOWN\",AQ48))","v":"BM55"},null,"22:30:00","SUNSHINE COAST","08","THE JOURNAL WEEKENDER CL2 HCP","UNKNOWN"]
[{"$nulls":38},"","CR_20120127_08","CUSTOM SECURITY BM 65 HCP",1400,"BM65","17:30:00","17:30:00","CANBERRA","08","CUSTOM SECURITY BM 65 HCP",{"$f":"IF(AS49=\"\",\"\",IF(AQ49=\"\",\"UNKNOWN\",AQ49))","v":"BM65"},null,"","","","",""]
[{"$nulls":38},"","TR_20120127_01","CROWNE PLAZA CL3 PLT",1600,null,"19:00:00","19:00:00","SUNSHINE COAST","01","CROWNE PLAZA CL3 PLT",{"$f":"IF(AS50=\"\",\"\",IF(AQ50=\"\",\"UNKNOWN\",AQ50))","v":"UNKNOWN"},null,"","","","",""]
[{"$nulls":38},"","TR_20120127_02","WIDE WORLD OF LIGHTS MDN HCP",1600,null,"19:30:00","19:30:00","SUNSHINE COAST","02","WIDE WORLD OF LIGHTS MDN HCP",{"$f":"IF(AS51=\"\",\"\",IF(AQ51=\"\",\"UNKNOWN\",AQ51))","v":"UNKNOWN"},null,"","","","",""]
[{"$nulls":38},"","TR_20120127_03","LJ HOOKER CALOUNDRA 2YO PLT",1200,null,"20:00:00","20:00:00","SUNSHINE COAST","03","LJ HOOKER CALOUNDRA 2YO PLT",{"$f":"IF(AS52=\"\",\"\",IF(AQ52=\"\",\"UNKNOWN\",AQ52))","v":"UNKNOWN"},null,"","","","",""]
[{"$nulls":38},"","TR_20120127_04","SUNSHINE COAST CUP",1400,null,"20:30:00","20:30:00","SUNSHINE COAST","04","SUNSHINE COAST CUP",{"$f":"IF(AS53=\"\",\"\",IF(AQ53=\"\",\"UNKNOWN\",AQ53))","v":"UNKNOWN"},null,"","","","",""]
[{"$nulls":38},"","TR_20120127_05","TIMBER SHADES CL1 HCP",1400,null,"21:00:00","21:00:00","SUNSHINE COAST","05","TIMBER SHADES CL1 HCP",{"$f":"IF(AS54=\"\",\"\",IF(AQ54=\"\",\"UNKNOWN\",AQ54))","v":"UNKNOWN"},null,"","","","",""]
[{"$nulls":38},"","TR_20120127_06","SUNCOAST FITNESS C,G&E MDN PLT",1000,null,"21:30:00","21:30:00","SUNSHINE COAST","06","SUNCOAST FITNESS C,G&E MDN PLT",{"$f":"IF(AS55=\"\",\"\",IF(AQ55=\"\",\"UNKNOWN\",AQ55))","v":"UNKNOWN"},null,"","","","",""]
[{"$nulls":38},"","TR_20120127_07","STAR SHOTS F&M MDN PLT",1000,null,"22:00:00","22:00:00","SUNSHINE COAST","07","STAR SHOTS F&M MDN PLT",{"$f":"IF(AS56=\"\",\"\",IF(AQ56=\"\",\"UNKNOWN\",AQ56))","v":"UNKNOWN"},null,"","","","",""]
[{"$nulls":38},"","TR_20120127_08","THE JOURNAL WEEKENDER CL2 HCP",1000,null,"22:30:00","22:30:00","SUNSHINE COAST","08","THE JOURNAL WEEKENDER CL2 HCP",{"$f":"IF(AS57=\"\",\"\",IF(AQ57=\"\",\"UNKNOWN\",AQ57))","v":"UNKNOWN"},null,"","","","",""]
[{"$nulls":38},"","LR_20120127_01","RESTRICTED MDN WFA",1000,null,"21:20:00","","","","",{"$f":"IF(AS58=\"\",\"\",IF(AQ58=\"\",\"UNKNOWN\",AQ58))","v":""},null,"","","","",""]
[{"$nulls":38},"","LR_20120127_02","CLASS 4 HCP",1100,null,"21:50:00","","","","",{"$f":"IF(AS59=\"\",\"\",IF(AQ59=\"\",\"UNKNOWN\",AQ59))","v":""},null,"","","","",""]
[{"$nulls":38},"","LR_20120127_03","CLASS 5 HCP",1600,null,"22:20:00","","","","",{"$f":"IF(AS60=\"\",\"\",IF(AQ60=\"\",\"UNKNOWN\",AQ60))","v":""},null,"","","","",""]
[{"$nulls":38},"","LR_20120127_04","CLASS 4 HCP",1600,null,"22:50:00","","","","",{"$f":"IF(AS61=\"\",\"\",IF(AQ61=\"\",\"UNKNOWN\",AQ61))","v":""},null,"","","","",""]
[{"$nulls":38},"","LR_20120127_05","MAIDEN HCP",1100,null,"23:20:00","","","","",{"$f":"IF(AS62=\"\",\"\",IF(AQ62=\"\",\"UNKNOWN\",AQ62))","v":""},null,"","","","",""]
[{"$nulls":38},"","LR_20120127_06","NOVICE",1200,null,"23:50:00","","","","",{"$f":"IF(AS63=\"\",\"\",IF(AQ63=\"\",\"UNKNOWN\",AQ63))","v":""},null,"","","","",""]
[{"$nulls":38},"","LR_20120127_07","CLASS 5 HCP",1200,null,"00:20:00","","","","",{"$f":"IF(AS64=\"\",\"\",IF(AQ64=\"\",\"UNKNOWN\",AQ64))","v":""},null,"","","","",""]
[{"$nulls":33},{"$f":"RaceCard!AI2","v":"R"},{"$f":"LEFT(AH2,2)","v":"MR"},null,null,null,"","LR_20120127_08","CLASS 3 HCP",1000,null,"00:50:00","","","","",{"$f":"IF(AS65=\"\",\"\",IF(AQ65=\"\",\"UNKNOWN\",AQ65))","v":""},null,"","","","",""]
[{"$nulls":38},"","LR_20120127_09","CLASS 4 HCP",1100,null,"01:20:00","","","","",{"$f":"IF(AS66=\"\",\"\",IF(AQ66=\"\",\"UNKNOWN\",AQ66))","v":""},null,"","","","",""]
[{"$nulls":38},{"$f":"IF(AJ67=\"\",\"\",IF(ISERROR(VLOOKUP(AJ67,$AD$2:$AF$48,1,FALSE)),\"X\",VLOOKUP(AJ67,$AD$2:$AF$48,3,FALSE)))","v":""},"ER_20120127_04","CLASSIFIED CLAIMING STKS 4YO+",1400,null,"01:50:00","","","",{"$f":"IF(AS67=\"\",\"\",IF(AO67=\"\",\"UNKNOWN RACE NAME\",AO67))","v":""},{"$f":"IF(AS67=\"\",\"\",IF(AQ67=\"\",\"UNKNOWN\",AQ67))","v":""},null,"","","","",""]
[{"$nulls":38},"","ER_20120127_05","MAIDEN STAKES 3YO ONLY",2000,null,"02:20:00","","","","",{"$f":"IF(AS68=\"\",\"\",IF(AQ68=\"\",\"UNKNOWN\",AQ68))","v":""},null,"","","","",""]
[{"$nulls":38},"","YR_20120127_01","WAIKATO STUD YEARLINGS MDN",1200,null,"10:35:00","","","","",{"$f":"IF(AS69=\"\",\"\",IF(AQ69=\"\",\"UNKNOWN\",AQ69))","v":""},null,"","","","",""]
[{"$nulls":38},"","YR_20120127_02","TAX PROBLEMS? SEE ILES CASEY MDN",1200,null,"11:10:00","","","","",{"$f":"IF(AS70=\"\",\"\",IF(AQ70=\"\",\"UNKNOWN\",AQ70))","v":""},null,"","","","",""]
[{"$nulls":38},"","YR_20120127_03","ILES CASEY ACCOUNTANTS RTG 65",1200,null,"11:45:00","","","","",{"$f":"IF(AS71=\"\",\"\",IF(AQ71=\"\",\"UNKNOWN\",AQ71))","v":""},null,"","","","",""]
[{"$nulls":38},"","YR_20120127_04","VERO.CO.NZ RTG 65",1560,null,"12:20:00",{"$f":"IF(AN72=\"\",\"\",IF(OR(RIGHT(VLOOKUP(LEFT(AN72,11),$AH$2:$AM$28,6,FALSE),1)=\"S\",VLOOKUP(LEFT(AN72,11),$AH$2:$AM$28,6,FALSE)=\"X\"),\"\",AR72))","v":""},{"$f":"IF(AN72=\"\",\"\",IF(OR(RIGHT(VLOOKUP(LEFT(AN72,11),$AH$2:$AM$50,6,FALSE),1)=\"S\",VLOOKUP(LEFT(AN72,11),$AH$2:$AM$50,6,FALSE)=\"X\"),\"\",VLOOKUP(LEFT(AN72,11),$AH$2:$AJ$50,3,FALSE)))","v":""},{"$f":"IF(AN72=\"\",\"\",IF(OR(RIGHT(VLOOKUP(LEFT(AN72,11),$AH$2:$AM$28,6,FALSE),1)=\"S\",VLOOKUP(LEFT(AN72,11),$AH$2:$AM$28,6,FALSE)=\"X\"),\"\",RIGHT(AN72,2)))","v":""},"",{"$f":"IF(AS72=\"\",\"\",IF(AQ72=\"\",\"UNKNOWN\",AQ72))","v":""},null,"","","","",""]
[{"$nulls":38},"","YR_20120127_05","TOWNLEY TRENCHING MDN",1560,null,"12:55:00","","","","",{"$f":"IF(AS73=\"\",\"\",IF(AQ73=\"\",\"UNKNOWN\",AQ73))","v":""},null,"","","","",""]
[{"$nulls":38},"","YR_20120127_06","ATKINSON & DONALDSON RTG 75",1400,null,"13:31:00","","","","",{"$f":"IF(AS74=\"\",\"\",IF(AQ74=\"\",\"UNKNOWN\",AQ74))","v":""},null,"","","","",""]
[{"$nulls":38},"","YR_20120127_07","RON KUSABS MEMORIAL MDN",1400,null,"14:06:00","","","","",{"$f":"IF(AS75=\"\",\"\",IF(AQ75=\"\",\"UNKNOWN\",AQ75))","v":""},null,"","","","",""]
[{"$nulls":38},"","YR_20120127_08","CREEDENCE CLEARWATER 29/1 MDN",1950,null,"14:41:00","","","","",{"$f":"IF(AS76=\"\",\"\",IF(AQ76=\"\",\"UNKNOWN\",AQ76))","v":""},null,"","","","",""]
[{"$nulls":38},"","TH_20120127_01","A JAMMIN JOZI 2YO MDN JUV PLT",1000,null,"22:00:00","","","","",{"$f":"IF(AS77=\"\",\"\",IF(AQ77=\"\",\"UNKNOWN\",AQ77))","v":""},null,"","","","",""]
[{"$nulls":38},"","TH_20120127_02","ALL TO COME F&M MDN PLT",1200,null,"22:35:00","","","","",{"$f":"IF(AS78=\"\",\"\",IF(AQ78=\"\",\"UNKNOWN\",AQ78))","v":""},null,"","","","",""]
[{"$nulls":38},"","TH_20120127_03","J&B MET MDN PLT",2400,null,"23:05:00","","","","",{"$f":"IF(AS79=\"\",\"\",IF(AQ79=\"\",\"UNKNOWN\",AQ79))","v":""},null,"","","","",""]
[{"$nulls":38},"","TH_20120127_04","RUGBY 5 TRY IT OPEN MR 93 HCP",2400,null,"23:35:00","","","","",{"$f":"IF(AS80=\"\",\"\",IF(AQ80=\"\",\"UNKNOWN\",AQ80))","v":""},null,"","","","",""]
[{"$nulls":39},"TH_20120127_05","SOCCER 6 MR 69 HCP",2000,null,"00:10:00","","","","",{"$f":"IF(AS81=\"\",\"\",IF(AQ81=\"\",\"UNKNOWN\",AQ81))","v":""},null,"","","","",""]
[{"$nulls":39},"TH_20120127_06","J&B MET F&M GRAD PLT",1600,null,"00:45:00","","","","",{"$f":"IF(AS82=\"\",\"\",IF(AQ82=\"\",\"UNKNOWN\",AQ82))","v":""},null,"","","","",""]
[{"$nulls":39},"TH_20120127_07","RACING ASSOCIATION MR 78 HCP",1200,null,"01:25:00","","","","",{"$f":"IF(AS83=\"\",\"\",IF(AQ83=\"\",\"UNKNOWN\",AQ83))","v":""},null,"","","","",""]
[{"$nulls":39},"TH_20120127_08","COMPUTAFORM EXPRESS FM 74 HCP",1200,null,"02:00:00","","","","",{"$f":"IF(AS84=\"\",\"\",IF(AQ84=\"\",\"UNKNOWN\",AQ84))","v":""},null,"","","","",""]
[{"$nulls":39},"TH_20120127_09","J&B MET F&M MDN PLT",1200,null,"02:35:00","","","","",{"$f":"IF(AS85=\"\",\"\",IF(AQ85=\"\",\"UNKNOWN\",AQ85))","v":""},null,"","","","",""]
[{"$nulls":43},"15:55:00","","","","",{"$f":"IF(AS86=\"\",\"\",IF(AQ86=\"\",\"UNKNOWN\",AQ86))","v":""},null,"","","","",""]
[{"$nulls":43},"16:34:00","","","","",{"$f":"IF(AS87=\"\",\"\",IF(AQ87=\"\",\"UNKNOWN\",AQ87))","v":""},null,"","","","",""]
[{"$nulls":43},"17:18:00","","","","",{"$f":"IF(AS88=\"\",\"\",IF(AQ88=\"\",\"UNKNOWN\",AQ88))","v":""},null,"","","","",""]
[{"$nulls":43},"17:55:00","","","","",{"$f":"IF(AS89=\"\",\"\",IF(AQ89=\"\",\"UNKNOWN\",AQ89))","v":""},null,"","","","",""]
[{"$nulls":43},"18:30:00","","","","",{"$f":"IF(AS90=\"\",\"\",IF(AQ90=\"\",\"UNKNOWN\",AQ90))","v":""},null,"","","","",""]
[{"$nulls":43},"19:05:00","","","","",{"$f":"IF(AS91=\"\",\"\",IF(AQ91=\"\",\"UNKNOWN\",AQ91))","v":""},null,"","","","",""]
[{"$nulls":43},"19:43:00","","","","",{"$f":"IF(AS92=\"\",\"\",IF(AQ92=\"\",\"UNKNOWN\",AQ92))","v":""},null,"","","","",""]
[{"$nulls":43},"20:21:00","","","","",{"$f":"IF(AS93=\"\",\"\",IF(AQ93=\"\",\"UNKNOWN\",AQ93))","v":""},null,"","","","",""]
[{"$nulls":43},"20:57:00","","","","",{"$f":"IF(AS94=\"\",\"\",IF(AQ94=\"\",\"UNKNOWN\",AQ94))","v":""},null,"","","","",""]
[{"$nulls":43},"00:05:00","","","","",{"$f":"IF(AS95=\"\",\"\",IF(AQ95=\"\",\"UNKNOWN\",AQ95))","v":""},null,"","","","",""]
[{"$nulls":43},"00:35:00","","","","",{"$f":"IF(AS96=\"\",\"\",IF(AQ96=\"\",\"UNKNOWN\",AQ96))","v":""},null,"","","","",""]
[{"$nulls":43},"01:08:00","","","","",{"$f":"IF(AS97=\"\",\"\",IF(AQ97=\"\",\"UNKNOWN\",AQ97))","v":""},null,"","","","",""]
[{"$nulls":43},"01:35:00","","","","",{"$f":"IF(AS98=\"\",\"\",IF(AQ98=\"\",\"UNKNOWN\",AQ98))","v":""},null,"","","","",""]
[{"$nulls":43},"14:02:00","","","","",{"$f":"IF(AS99=\"\",\"\",IF(AQ99=\"\",\"UNKNOWN\",AQ99))","v":""},null,"","","","",""]
[{"$nulls":43},"14:37:00","","","","",{"$f":"IF(AS100=\"\",\"\",IF(AQ100=\"\",\"UNKNOWN\",AQ100))","v":""},null,"","","","",""]
[{"$nulls":43},"15:16:00","","","","",{"$f":"IF(AS101=\"\",\"\",IF(AQ101=\"\",\"UNKNOWN\",AQ101))","v":""},null,"","","","",""]
[{"$nulls":43},"15:51:00","","","","",{"$f":"IF(AS102=\"\",\"\",IF(AQ102=\"\",\"UNKNOWN\",AQ102))","v":""},null,"","","","",""]
[{"$nulls":43},"16:31:00","","","","",{"$f":"IF(AS103=\"\",\"\",IF(AQ103=\"\",\"UNKNOWN\",AQ103))","v":""},null,"","","","",""]
[{"$nulls":43},"17:11:00","","","","",{"$f":"IF(AS104=\"\",\"\",IF(AQ104=\"\",\"UNKNOWN\",AQ104))","v":""},null,"","","","",""]
[{"$nulls":43},"00:15:00","","","","",{"$f":"IF(AS105=\"\",\"\",IF(AQ105=\"\",\"UNKNOWN\",AQ105))","v":""},null,"","","","",""]
[{"$nulls":43},"00:45:00","","","","",{"$f":"IF(AS106=\"\",\"\",IF(AQ106=\"\",\"UNKNOWN\",AQ106))","v":""},null,"","","","",""]
[{"$nulls":43},"01:15:00","","","","",{"$f":"IF(AS107=\"\",\"\",IF(AQ107=\"\",\"UNKNOWN\",AQ107))","v":""},null,"","","","",""]
[{"$nulls":43},"01:45:00","","","","",{"$f":"IF(AS108=\"\",\"\",IF(AQ108=\"\",\"UNKNOWN\",AQ108))","v":""},null,"","","","",""]
[{"$nulls":44},"","","","",{"$f":"IF(AS109=\"\",\"\",IF(AQ109=\"\",\"UNKNOWN\",AQ109))","v":""},null,"","","","",""]
[{"$nulls":44},"","","","",{"$f":"IF(AS110=\"\",\"\",IF(AQ110=\"\",\"UNKNOWN\",AQ110))","v":""},null,"","","","",""]
[{"$nulls":44},"","","","",{"$f":"IF(AS111=\"\",\"\",IF(AQ111=\"\",\"UNKNOWN\",AQ111))","v":""},null,"","","","",""]
[{"$nulls":44},"","","","",{"$f":"IF(AS112=\"\",\"\",IF(AQ112=\"\",\"UNKNOWN\",AQ112))","v":""},null,"","","","",""]
[{"$nulls":44},"","","","",{"$f":"IF(AS113=\"\",\"\",IF(AQ113=\"\",\"UNKNOWN\",AQ113))","v":""},null,"","","","",""]
[{"$nulls":44},"","","","",{"$f":"IF(AS114=\"\",\"\",IF(AQ114=\"\",\"UNKNOWN\",AQ114))","v":""},null,"","","","",""]
[{"$nulls":44},"","","","",{"$f":"IF(AS115=\"\",\"\",IF(AQ115=\"\",\"UNKNOWN\",AQ115))","v":""},null,"","","","",""]
[{"$nulls":44},"","","","",{"$f":"IF(AS116=\"\",\"\",IF(AQ116=\"\",\"UNKNOWN\",AQ116))","v":""},null,"","","","",""]
[{"$nulls":44},"","","","",{"$f":"IF(AS117=\"\",\"\",IF(AQ117=\"\",\"UNKNOWN\",AQ117))","v":""},null,"","","","",""]
[{"$nulls":44},"","","","",{"$f":"IF(AS118=\"\",\"\",IF(AQ118=\"\",\"UNKNOWN\",AQ118))","v":""},null,"","","","",""]
[{"$nulls":44},"","","","",{"$f":"IF(AS119=\"\",\"\",IF(AQ119=\"\",\"UNKNOWN\",AQ119))","v":""},null,"","","","",""]
[{"$nulls":44},"","","","",{"$f":"IF(AS120=\"\",\"\",IF(AQ120=\"\",\"UNKNOWN\",AQ120))","v":""},null,"","","","",""]
[{"$nulls":44},"","","","",{"$f":"IF(AS121=\"\",\"\",IF(AQ121=\"\",\"UNKNOWN\",AQ121))","v":""},null,"","","","",""]
[{"$nulls":44},"","","","",{"$f":"IF(AS122=\"\",\"\",IF(AQ122=\"\",\"UNKNOWN\",AQ122))","v":""},null,"","","","",""]
[{"$nulls":44},"","","","",{"$f":"IF(AS123=\"\",\"\",IF(AQ123=\"\",\"UNKNOWN\",AQ123))","v":""},null,"","","","",""]
[{"$nulls":44},"","","","",{"$f":"IF(AS124=\"\",\"\",IF(AQ124=\"\",\"UNKNOWN\",AQ124))","v":""},null,"","","","",""]
[{"$nulls":44},"","","","",{"$f":"IF(AS125=\"\",\"\",IF(AQ125=\"\",\"UNKNOWN\",AQ125))","v":""},null,"","","","",""]
[{"$nulls":44},"","","","",{"$f":"IF(AS126=\"\",\"\",IF(AQ126=\"\",\"UNKNOWN\",AQ126))","v":""},null,"","","","",""]
[{"$nulls":44},"","","","",{"$f":"IF(AS127=\"\",\"\",IF(AQ127=\"\",\"UNKNOWN\",AQ127))","v":""},null,"","","","",""]
[{"$nulls":44},"","","","",{"$f":"IF(AS128=\"\",\"\",IF(AQ128=\"\",\"UNKNOWN\",AQ128))","v":""},null,"","","","",""]
[{"$nulls":44},"","","","",{"$f":"IF(AS129=\"\",\"\",IF(AQ129=\"\",\"UNKNOWN\",AQ129))","v":""},null,"","","","",""]
[{"$nulls":44},"","","","",{"$f":"IF(AS130=\"\",\"\",IF(AQ130=\"\",\"UNKNOWN\",AQ130))","v":""},null,"","","","",""]
[{"$nulls":44},"","","",{"$f":"IF(AS131=\"\",\"\",IF(AO131=\"\",\"UNKNOWN RACE NAME\",AO131))","v":""},{"$f":"IF(AS131=\"\",\"\",IF(AQ131=\"\",\"UNKNOWN\",AQ131))","v":""},null,"","","","",""]
[{"$nulls":44},"","","","",{"$f":"IF(AS132=\"\",\"\",IF(AQ132=\"\",\"UNKNOWN\",AQ132))","v":""},null,"","","","",""]
[{"$nulls":44},"","","","",{"$f":"IF(AS133=\"\",\"\",IF(AQ133=\"\",\"UNKNOWN\",AQ133))","v":""},null,"","","","",""]
[{"$nulls":44},"","","","",{"$f":"IF(AS134=\"\",\"\",IF(AQ134=\"\",\"UNKNOWN\",AQ134))","v":""},null,"","","","",""]
[{"$nulls":44},"","","","",{"$f":"IF(AS135=\"\",\"\",IF(AQ135=\"\",\"UNKNOWN\",AQ135))","v":""},null,"","","","",""]
[{"$nulls":44},{"$f":"IF(AN136=\"\",\"\",IF(OR(RIGHT(VLOOKUP(LEFT(AN136,11),$AH$2:$AM$28,6,FALSE),1)=\"S\",VLOOKUP(LEFT(AN136,11),$AH$2:$AM$28,6,FALSE)=\"X\"),\"\",AR136))","v":""},{"$f":"IF(AN136=\"\",\"\",IF(OR(RIGHT(VLOOKUP(LEFT(AN136,11),$AH$2:$AM$50,6,FALSE),1)=\"S\",VLOOKUP(LEFT(AN136,11),$AH$2:$AM$50,6,FALSE)=\"X\"),\"\",VLOOKUP(LEFT(AN136,11),$AH$2:$AJ$50,3,FALSE)))","v":""},{"$f":"IF(AN136=\"\",\"\",IF(OR(RIGHT(VLOOKUP(LEFT(AN136,11),$AH$2:$AM$28,6,FALSE),1)=\"S\",VLOOKUP(LEFT(AN136,11),$AH$2:$AM$28,6,FALSE)=\"X\"),\"\",RIGHT(AN136,2)))","v":""},"",{"$f":"IF(AS136=\"\",\"\",IF(AQ136=\"\",\"UNKNOWN\",AQ136))","v":""},null,"","","","",""]
[{"$nulls":44},"","","","",{"$f":"IF(AS137=\"\",\"\",IF(AQ137=\"\",\"UNKNOWN\",AQ137))","v":""},null,"","","","",""]
[{"$nulls":44},"","","","",{"$f":"IF(AS138=\"\",\"\",IF(AQ138=\"\",\"UNKNOWN\",AQ138))","v":""},null,"","","","",""]
[{"$nulls":44},"","","","",{"$f":"IF(AS139=\"\",\"\",IF(AQ139=\"\",\"UNKNOWN\",AQ139))","v":""},null,"","","","",""]
[{"$nulls":44},"","","","",{"$f":"IF(AS140=\"\",\"\",IF(AQ140=\"\",\"UNKNOWN\",AQ140))","v":""},null,"","","","",""]
[{"$nulls":44},"","","","",{"$f":"IF(AS141=\"\",\"\",IF(AQ141=\"\",\"UNKNOWN\",AQ141))","v":""},null,"","","","",""]
[{"$nulls":44},"","","","",{"$f":"IF(AS142=\"\",\"\",IF(AQ142=\"\",\"UNKNOWN\",AQ142))","v":""},null,"","","","",""]
[{"$nulls":44},"","","","",{"$f":"IF(AS143=\"\",\"\",IF(AQ143=\"\",\"UNKNOWN\",AQ143))","v":""},null,"","","","",""]
[{"$nulls":44},"","","","",{"$f":"IF(AS144=\"\",\"\",IF(AQ144=\"\",\"UNKNOWN\",AQ144))","v":""},null,"","","","",""]
[{"$nulls":44},"","","","",{"$f":"IF(AS145=\"\",\"\",IF(AQ145=\"\",\"UNKNOWN\",AQ145))","v":""},null,"","","","",""]
[{"$nulls":44},"","","","",{"$f":"IF(AS146=\"\",\"\",IF(AQ146=\"\",\"UNKNOWN\",AQ146))","v":""},null,"","","","",""]
[{"$nulls":44},"","","","",{"$f":"IF(AS147=\"\",\"\",IF(AQ147=\"\",\"UNKNOWN\",AQ147))","v":""},null,"","","","",""]
[{"$nulls":44},"","","","",{"$f":"IF(AS148=\"\",\"\",IF(AQ148=\"\",\"UNKNOWN\",AQ148))","v":""},null,"","","","",""]
[{"$nulls":44},"","","","",{"$f":"IF(AS149=\"\",\"\",IF(AQ149=\"\",\"UNKNOWN\",AQ149))","v":""},null,"","","","",""]
[{"$nulls":44},"","","","",{"$f":"IF(AS150=\"\",\"\",IF(AQ150=\"\",\"UNKNOWN\",AQ150))","v":""},null,"","","","",""]
[{"$nulls":44},"","","","",{"$f":"IF(AS151=\"\",\"\",IF(AQ151=\"\",\"UNKNOWN\",AQ151))","v":""},null,"","","","",""]
[{"$nulls":44},"","","","",{"$f":"IF(AS152=\"\",\"\",IF(AQ152=\"\",\"UNKNOWN\",AQ152))","v":""},null,"","","","",""]
[{"$nulls":44},"","","","",{"$f":"IF(AS153=\"\",\"\",IF(AQ153=\"\",\"UNKNOWN\",AQ153))","v":""},null,"","","","",""]
[{"$nulls":44},"","","","",{"$f":"IF(AS154=\"\",\"\",IF(AQ154=\"\",\"UNKNOWN\",AQ154))","v":""},null,"","","","",""]
[{"$nulls":44},"","","","",{"$f":"IF(AS155=\"\",\"\",IF(AQ155=\"\",\"UNKNOWN\",AQ155))","v":""},null,"","","","",""]
[{"$nulls":44},"","","","",{"$f":"IF(AS156=\"\",\"\",IF(AQ156=\"\",\"UNKNOWN\",AQ156))","v":""},null,"","","","",""]
[{"$nulls":44},"","","","",{"$f":"IF(AS157=\"\",\"\",IF(AQ157=\"\",\"UNKNOWN\",AQ157))","v":""},null,"","","","",""]
[{"$nulls":44},"","","","",{"$f":"IF(AS158=\"\",\"\",IF(AQ158=\"\",\"UNKNOWN\",AQ158))","v":""},null,"","","","",""]
[{"$nulls":44},"","","","",{"$f":"IF(AS159=\"\",\"\",IF(AQ159=\"\",\"UNKNOWN\",AQ159))","v":""},null,"","","","",""]
[{"$nulls":44},"","","","",{"$f":"IF(AS160=\"\",\"\",IF(AQ160=\"\",\"UNKNOWN\",AQ160))","v":""},null,"","","","",""]
[{"$nulls":44},"","","","",{"$f":"IF(AS161=\"\",\"\",IF(AQ161=\"\",\"UNKNOWN\",AQ161))","v":""},null,"","","","",""]
[{"$nulls":44},"","","","",{"$f":"IF(AS162=\"\",\"\",IF(AQ162=\"\",\"UNKNOWN\",AQ162))","v":""},null,"","","","",""]
[{"$nulls":44},"","","","",{"$f":"IF(AS163=\"\",\"\",IF(AQ163=\"\",\"UNKNOWN\",AQ163))","v":""},null,"","","","",""]
[{"$nulls":44},"","","","",{"$f":"IF(AS164=\"\",\"\",IF(AQ164=\"\",\"UNKNOWN\",AQ164))","v":""},null,"","","","",""]
[{"$nulls":44},"","","","",{"$f":"IF(AS165=\"\",\"\",IF(AQ165=\"\",\"UNKNOWN\",AQ165))","v":""},null,"","","","",""]
[{"$nulls":44},"","","","",{"$f":"IF(AS166=\"\",\"\",IF(AQ166=\"\",\"UNKNOWN\",AQ166))","v":""},null,"","","","",""]
[{"$nulls":44},"","","","",{"$f":"IF(AS167=\"\",\"\",IF(AQ167=\"\",\"UNKNOWN\",AQ167))","v":""},null,"","","","",""]
[{"$nulls":44},"","","","",{"$f":"IF(AS168=\"\",\"\",IF(AQ168=\"\",\"UNKNOWN\",AQ168))","v":""},null,"","","","",""]
[{"$nulls":44},"","","","",{"$f":"IF(AS169=\"\",\"\",IF(AQ169=\"\",\"UNKNOWN\",AQ169))","v":""},null,"","","","",""]
[{"$nulls":44},"","","","",{"$f":"IF(AS170=\"\",\"\",IF(AQ170=\"\",\"UNKNOWN\",AQ170))","v":""},null,"","","","",""]
[{"$nulls":44},"","","","",{"$f":"IF(AS171=\"\",\"\",IF(AQ171=\"\",\"UNKNOWN\",AQ171))","v":""},null,"","","","",""]
[{"$nulls":44},"","","","",{"$f":"IF(AS172=\"\",\"\",IF(AQ172=\"\",\"UNKNOWN\",AQ172))","v":""},null,"","","","",""]
[{"$nulls":44},"","","","",{"$f":"IF(AS173=\"\",\"\",IF(AQ173=\"\",\"UNKNOWN\",AQ173))","v":""},null,"","","","",""]
[{"$nulls":44},"","","","",{"$f":"IF(AS174=\"\",\"\",IF(AQ174=\"\",\"UNKNOWN\",AQ174))","v":""},null,"","","","",""]
[{"$nulls":44},"","","","",{"$f":"IF(AS175=\"\",\"\",IF(AQ175=\"\",\"UNKNOWN\",AQ175))","v":""},null,"","","","",""]
[{"$nulls":44},"","","","",{"$f":"IF(AS176=\"\",\"\",IF(AQ176=\"\",\"UNKNOWN\",AQ176))","v":""},null,"","","","",""]
[{"$nulls":44},"","","","",{"$f":"IF(AS177=\"\",\"\",IF(AQ177=\"\",\"UNKNOWN\",AQ177))","v":""},null,"","","","",""]
[{"$nulls":44},"","","","",{"$f":"IF(AS178=\"\",\"\",IF(AQ178=\"\",\"UNKNOWN\",AQ178))","v":""},null,"","","","",""]
[{"$nulls":44},"","","","",{"$f":"IF(AS179=\"\",\"\",IF(AQ179=\"\",\"UNKNOWN\",AQ179))","v":""},null,"","","","",""]
[{"$nulls":44},"","","","",{"$f":"IF(AS180=\"\",\"\",IF(AQ180=\"\",\"UNKNOWN\",AQ180))","v":""},null,"","","","",""]
[{"$nulls":44},"","","","",{"$f":"IF(AS181=\"\",\"\",IF(AQ181=\"\",\"UNKNOWN\",AQ181))","v":""},null,"","","","",""]
[{"$nulls":44},"","","","",{"$f":"IF(AS182=\"\",\"\",IF(AQ182=\"\",\"UNKNOWN\",AQ182))","v":""},null,"","","","",""]
[{"$nulls":44},"","","","",{"$f":"IF(AS183=\"\",\"\",IF(AQ183=\"\",\"UNKNOWN\",AQ183))","v":""},null,"","","","",""]
[{"$nulls":44},"","","","",{"$f":"IF(AS184=\"\",\"\",IF(AQ184=\"\",\"UNKNOWN\",AQ184))","v":""},null,"","","","",""]
[{"$nulls":44},"","","","",{"$f":"IF(AS185=\"\",\"\",IF(AQ185=\"\",\"UNKNOWN\",AQ185))","v":""},null,"","","","",""]
[{"$nulls":44},"","","","",{"$f":"IF(AS186=\"\",\"\",IF(AQ186=\"\",\"UNKNOWN\",AQ186))","v":""},null,"","","","",""]
[{"$nulls":44},"","","","",{"$f":"IF(AS187=\"\",\"\",IF(AQ187=\"\",\"UNKNOWN\",AQ187))","v":""},null,"","","","",""]
[{"$nulls":44},"","","","",{"$f":"IF(AS188=\"\",\"\",IF(AQ188=\"\",\"UNKNOWN\",AQ188))","v":""},null,"","","","",""]
[{"$nulls":44},"","","","",{"$f":"IF(AS189=\"\",\"\",IF(AQ189=\"\",\"UNKNOWN\",AQ189))","v":""},null,"","","","",""]
[{"$nulls":44},"","","","",{"$f":"IF(AS190=\"\",\"\",IF(AQ190=\"\",\"UNKNOWN\",AQ190))","v":""},null,"","","","",""]
[{"$nulls":44},"","","","",{"$f":"IF(AS191=\"\",\"\",IF(AQ191=\"\",\"UNKNOWN\",AQ191))","v":""},null,"","","","",""]
[{"$nulls":44},"","","","",{"$f":"IF(AS192=\"\",\"\",IF(AQ192=\"\",\"UNKNOWN\",AQ192))","v":""},null,"","","","",""]
[{"$nulls":44},"","","","",{"$f":"IF(AS193=\"\",\"\",IF(AQ193=\"\",\"UNKNOWN\",AQ193))","v":""},null,"","","","",""]
[{"$nulls":44},"","","","",{"$f":"IF(AS194=\"\",\"\",IF(AQ194=\"\",\"UNKNOWN\",AQ194))","v":""},null,"","","","",""]
[{"$nulls":44},"","","",{"$f":"IF(AS195=\"\",\"\",IF(AO195=\"\",\"UNKNOWN RACE NAME\",AO195))","v":""},{"$f":"IF(AS195=\"\",\"\",IF(AQ195=\"\",\"UNKNOWN\",AQ195))","v":""},null,"","","","",""]
[{"$nulls":44},"","","","",{"$f":"IF(AS196=\"\",\"\",IF(AQ196=\"\",\"UNKNOWN\",AQ196))","v":""},null,"","","","",""]
[{"$nulls":44},"","","","",{"$f":"IF(AS197=\"\",\"\",IF(AQ197=\"\",\"UNKNOWN\",AQ197))","v":""},null,"","","","",""]
[{"$nulls":44},"","","","",{"$f":"IF(AS198=\"\",\"\",IF(AQ198=\"\",\"UNKNOWN\",AQ198))","v":""},null,"","","","",""]
[{"$nulls":44},"","","","",{"$f":"IF(AS199=\"\",\"\",IF(AQ199=\"\",\"UNKNOWN\",AQ199))","v":""},null,"","","","",""]
[{"$nulls":44},{"$f":"IF(AN200=\"\",\"\",IF(OR(RIGHT(VLOOKUP(LEFT(AN200,11),$AH$2:$AM$28,6,FALSE),1)=\"S\",VLOOKUP(LEFT(AN200,11),$AH$2:$AM$28,6,FALSE)=\"X\"),\"\",AR200))","v":""},{"$f":"IF(AN200=\"\",\"\",IF(OR(RIGHT(VLOOKUP(LEFT(AN200,11),$AH$2:$AM$50,6,FALSE),1)=\"S\",VLOOKUP(LEFT(AN200,11),$AH$2:$AM$50,6,FALSE)=\"X\"),\"\",VLOOKUP(LEFT(AN200,11),$AH$2:$AJ$50,3,FALSE)))","v":""},{"$f":"IF(AN200=\"\",\"\",IF(OR(RIGHT(VLOOKUP(LEFT(AN200,11),$AH$2:$AM$28,6,FALSE),1)=\"S\",VLOOKUP(LEFT(AN200,11),$AH$2:$AM$28,6,FALSE)=\"X\"),\"\",RIGHT(AN200,2)))","v":""},"",{"$f":"IF(AS200=\"\",\"\",IF(AQ200=\"\",\"UNKNOWN\",AQ200))","v":""},null,"","","","",""]
[{"$nulls":44},"","","","",{"$f":"IF(AS201=\"\",\"\",IF(AQ201=\"\",\"UNKNOWN\",AQ201))","v":""},null,"","","","",""]
[{"$nulls":44},"","","","",{"$f":"IF(AS202=\"\",\"\",IF(AQ202=\"\",\"UNKNOWN\",AQ202))","v":""},null,"","","","",""]
[{"$nulls":44},"","","","",{"$f":"IF(AS203=\"\",\"\",IF(AQ203=\"\",\"UNKNOWN\",AQ203))","v":""},null,"","","","",""]
[{"$nulls":44},"","","","",{"$f":"IF(AS204=\"\",\"\",IF(AQ204=\"\",\"UNKNOWN\",AQ204))","v":""},null,"","","","",""]
[{"$nulls":44},"","","","",{"$f":"IF(AS205=\"\",\"\",IF(AQ205=\"\",\"UNKNOWN\",AQ205))","v":""},null,"","","","",""]
[{"$nulls":44},"","","","",{"$f":"IF(AS206=\"\",\"\",IF(AQ206=\"\",\"UNKNOWN\",AQ206))","v":""},null,"","","","",""]
[{"$nulls":44},"","","","",{"$f":"IF(AS207=\"\",\"\",IF(AQ207=\"\",\"UNKNOWN\",AQ207))","v":""},null,"","","","",""]
[{"$nulls":44},"","","","",{"$f":"IF(AS208=\"\",\"\",IF(AQ208=\"\",\"UNKNOWN\",AQ208))","v":""},null,"","","","",""]
[{"$nulls":44},"","","","",{"$f":"IF(AS209=\"\",\"\",IF(AQ209=\"\",\"UNKNOWN\",AQ209))","v":""},null,"","","","",""]
[{"$nulls":44},"","","","",{"$f":"IF(AS210=\"\",\"\",IF(AQ210=\"\",\"UNKNOWN\",AQ210))","v":""},null,"","","","",""]
[{"$nulls":44},"","","","",{"$f":"IF(AS211=\"\",\"\",IF(AQ211=\"\",\"UNKNOWN\",AQ211))","v":""},null,"","","","",""]
[{"$nulls":44},"","","","",{"$f":"IF(AS212=\"\",\"\",IF(AQ212=\"\",\"UNKNOWN\",AQ212))","v":""},null,"","","","",""]
[{"$nulls":44},"","","","",{"$f":"IF(AS213=\"\",\"\",IF(AQ213=\"\",\"UNKNOWN\",AQ213))","v":""},null,"","","","",""]
[{"$nulls":44},"","","","",{"$f":"IF(AS214=\"\",\"\",IF(AQ214=\"\",\"UNKNOWN\",AQ214))","v":""},null,"","","","",""]
[{"$nulls":44},"","","","",{"$f":"IF(AS215=\"\",\"\",IF(AQ215=\"\",\"UNKNOWN\",AQ215))","v":""},null,"","","","",""]
[{"$nulls":44},"","","","",{"$f":"IF(AS216=\"\",\"\",IF(AQ216=\"\",\"UNKNOWN\",AQ216))","v":""},null,"","","","",""]
[{"$nulls":44},"","","","",{"$f":"IF(AS217=\"\",\"\",IF(AQ217=\"\",\"UNKNOWN\",AQ217))","v":""},null,"","","","",""]
[{"$nulls":44},"","","","",{"$f":"IF(AS218=\"\",\"\",IF(AQ218=\"\",\"UNKNOWN\",AQ218))","v":""},null,"","","","",""]
[{"$nulls":44},"","","","",{"$f":"IF(AS219=\"\",\"\",IF(AQ219=\"\",\"UNKNOWN\",AQ219))","v":""},null,"","","","",""]
[{"$nulls":44},"","","","",{"$f":"IF(AS220=\"\",\"\",IF(AQ220=\"\",\"UNKNOWN\",AQ220))","v":""},null,"","","","",""]
[{"$nulls":44},"","","","",{"$f":"IF(AS221=\"\",\"\",IF(AQ221=\"\",\"UNKNOWN\",AQ221))","v":""},null,"","","","",""]
[{"$nulls":44},"","","","",{"$f":"IF(AS222=\"\",\"\",IF(AQ222=\"\",\"UNKNOWN\",AQ222))","v":""},null,"","","","",""]
[{"$nulls":44},"","","","",{"$f":"IF(AS223=\"\",\"\",IF(AQ223=\"\",\"UNKNOWN\",AQ223))","v":""},null,"","","","",""]
[{"$nulls":44},"","","","",{"$f":"IF(AS224=\"\",\"\",IF(AQ224=\"\",\"UNKNOWN\",AQ224))","v":""},null,"","","","",""]
[{"$nulls":44},"","","","",{"$f":"IF(AS225=\"\",\"\",IF(AQ225=\"\",\"UNKNOWN\",AQ225))","v":""},null,"","","","",""]
[{"$nulls":44},"","","","",{"$f":"IF(AS226=\"\",\"\",IF(AQ226=\"\",\"UNKNOWN\",AQ226))","v":""},null,"","","","",""]
[{"$nulls":44},"","","","",{"$f":"IF(AS227=\"\",\"\",IF(AQ227=\"\",\"UNKNOWN\",AQ227))","v":""},null,"","","","",""]
[{"$nulls":44},"","","","",{"$f":"IF(AS228=\"\",\"\",IF(AQ228=\"\",\"UNKNOWN\",AQ228))","v":""},null,"","","","",""]
[{"$nulls":44},"","","","",{"$f":"IF(AS229=\"\",\"\",IF(AQ229=\"\",\"UNKNOWN\",AQ229))","v":""},null,"","","","",""]
[{"$nulls":44},"","","","",{"$f":"IF(AS230=\"\",\"\",IF(AQ230=\"\",\"UNKNOWN\",AQ230))","v":""},null,"","","","",""]
[{"$nulls":44},"","","","",{"$f":"IF(AS231=\"\",\"\",IF(AQ231=\"\",\"UNKNOWN\",AQ231))","v":""},null,"","","","",""]
[{"$nulls":44},"","","","",{"$f":"IF(AS232=\"\",\"\",IF(AQ232=\"\",\"UNKNOWN\",AQ232))","v":""},null,"","","","",""]
[{"$nulls":44},"","","","",{"$f":"IF(AS233=\"\",\"\",IF(AQ233=\"\",\"UNKNOWN\",AQ233))","v":""},null,"","","","",""]
[{"$nulls":44},"","","","",{"$f":"IF(AS234=\"\",\"\",IF(AQ234=\"\",\"UNKNOWN\",AQ234))","v":""},null,"","","","",""]
[{"$nulls":44},"","","","",{"$f":"IF(AS235=\"\",\"\",IF(AQ235=\"\",\"UNKNOWN\",AQ235))","v":""},null,"","","","",""]
[{"$nulls":44},"","","","",{"$f":"IF(AS236=\"\",\"\",IF(AQ236=\"\",\"UNKNOWN\",AQ236))","v":""},null,"","","","",""]
[{"$nulls":44},"","","","",{"$f":"IF(AS237=\"\",\"\",IF(AQ237=\"\",\"UNKNOWN\",AQ237))","v":""},null,"","","","",""]
[{"$nulls":44},"","","","",{"$f":"IF(AS238=\"\",\"\",IF(AQ238=\"\",\"UNKNOWN\",AQ238))","v":""},null,"","","","",""]
[{"$nulls":44},"","","","",{"$f":"IF(AS239=\"\",\"\",IF(AQ239=\"\",\"UNKNOWN\",AQ239))","v":""},null,"","","","",""]
[{"$nulls":44},"","","","",{"$f":"IF(AS240=\"\",\"\",IF(AQ240=\"\",\"UNKNOWN\",AQ240))","v":""},null,"","","","",""]
[{"$nulls":44},"","","","",{"$f":"IF(AS241=\"\",\"\",IF(AQ241=\"\",\"UNKNOWN\",AQ241))","v":""},null,"","","","",""]
[{"$nulls":44},"","","","",{"$f":"IF(AS242=\"\",\"\",IF(AQ242=\"\",\"UNKNOWN\",AQ242))","v":""},null,"","","","",""]
[{"$nulls":44},"","","","",{"$f":"IF(AS243=\"\",\"\",IF(AQ243=\"\",\"UNKNOWN\",AQ243))","v":""},null,"","","","",""]
[{"$nulls":44},"","","","",{"$f":"IF(AS244=\"\",\"\",IF(AQ244=\"\",\"UNKNOWN\",AQ244))","v":""},null,"","","","",""]
[{"$nulls":44},"","","","",{"$f":"IF(AS245=\"\",\"\",IF(AQ245=\"\",\"UNKNOWN\",AQ245))","v":""},null,"","","","",""]
[{"$nulls":44},"","","","",{"$f":"IF(AS246=\"\",\"\",IF(AQ246=\"\",\"UNKNOWN\",AQ246))","v":""},null,"","","","",""]
[{"$nulls":44},"","","","",{"$f":"IF(AS247=\"\",\"\",IF(AQ247=\"\",\"UNKNOWN\",AQ247))","v":""},null,"","","","",""]
[{"$nulls":44},"","","","",{"$f":"IF(AS248=\"\",\"\",IF(AQ248=\"\",\"UNKNOWN\",AQ248))","v":""},null,"","","","",""]
[{"$nulls":44},"","","","",{"$f":"IF(AS249=\"\",\"\",IF(AQ249=\"\",\"UNKNOWN\",AQ249))","v":""},null,"","","","",""]
[{"$nulls":44},"","","","",{"$f":"IF(AS250=\"\",\"\",IF(AQ250=\"\",\"UNKNOWN\",AQ250))","v":""},null,"","","","",""]
[{"$nulls":44},"","","","",{"$f":"IF(AS251=\"\",\"\",IF(AQ251=\"\",\"UNKNOWN\",AQ251))","v":""},null,"","","","",""]
[{"$nulls":44},"","","","",{"$f":"IF(AS252=\"\",\"\",IF(AQ252=\"\",\"UNKNOWN\",AQ252))","v":""},null,"","","","",""]
[{"$nulls":44},"","","","",{"$f":"IF(AS253=\"\",\"\",IF(AQ253=\"\",\"UNKNOWN\",AQ253))","v":""},null,"","","","",""]
[{"$nulls":44},"","","","",{"$f":"IF(AS254=\"\",\"\",IF(AQ254=\"\",\"UNKNOWN\",AQ254))","v":""},null,"","","","",""]
[{"$nulls":44},"","","","",{"$f":"IF(AS255=\"\",\"\",IF(AQ255=\"\",\"UNKNOWN\",AQ255))","v":""},null,"","","","",""]
[{"$nulls":44},"","","","",{"$f":"IF(AS256=\"\",\"\",IF(AQ256=\"\",\"UNKNOWN\",AQ256))","v":""},null,"","","","",""]
[{"$nulls":44},"","","","",{"$f":"IF(AS257=\"\",\"\",IF(AQ257=\"\",\"UNKNOWN\",AQ257))","v":""},null,"","","","",""]
[{"$nulls":44},"","","","",{"$f":"IF(AS258=\"\",\"\",IF(AQ258=\"\",\"UNKNOWN\",AQ258))","v":""},null,"","","","",""]
[{"$nulls":44},"","","",{"$f":"IF(AS259=\"\",\"\",IF(AO259=\"\",\"UNKNOWN RACE NAME\",AO259))","v":""},{"$f":"IF(AS259=\"\",\"\",IF(AQ259=\"\",\"UNKNOWN\",AQ259))","v":""},null,"","","","",""]
[{"$nulls":44},"","","","",{"$f":"IF(AS260=\"\",\"\",IF(AQ260=\"\",\"UNKNOWN\",AQ260))","v":""},null,"","","","",""]
[{"$nulls":44},"","","","",{"$f":"IF(AS261=\"\",\"\",IF(AQ261=\"\",\"UNKNOWN\",AQ261))","v":""},null,"","","","",""]
[{"$nulls":44},"","","","",{"$f":"IF(AS262=\"\",\"\",IF(AQ262=\"\",\"UNKNOWN\",AQ262))","v":""},null,"","","","",""]
[{"$nulls":44},"","","","",{"$f":"IF(AS263=\"\",\"\",IF(AQ263=\"\",\"UNKNOWN\",AQ263))","v":""},null,"","","","",""]
[{"$nulls":44},{"$f":"IF(AN264=\"\",\"\",IF(OR(RIGHT(VLOOKUP(LEFT(AN264,11),$AH$2:$AM$28,6,FALSE),1)=\"S\",VLOOKUP(LEFT(AN264,11),$AH$2:$AM$28,6,FALSE)=\"X\"),\"\",AR264))","v":""},{"$f":"IF(AN264=\"\",\"\",IF(OR(RIGHT(VLOOKUP(LEFT(AN264,11),$AH$2:$AM$50,6,FALSE),1)=\"S\",VLOOKUP(LEFT(AN264,11),$AH$2:$AM$50,6,FALSE)=\"X\"),\"\",VLOOKUP(LEFT(AN264,11),$AH$2:$AJ$50,3,FALSE)))","v":""},{"$f":"IF(AN264=\"\",\"\",IF(OR(RIGHT(VLOOKUP(LEFT(AN264,11),$AH$2:$AM$28,6,FALSE),1)=\"S\",VLOOKUP(LEFT(AN264,11),$AH$2:$AM$28,6,FALSE)=\"X\"),\"\",RIGHT(AN264,2)))","v":""},"",{"$f":"IF(AS264=\"\",\"\",IF(AQ264=\"\",\"UNKNOWN\",AQ264))","v":""},null,"","","","",""]
[{"$nulls":44},"","","","",{"$f":"IF(AS265=\"\",\"\",IF(AQ265=\"\",\"UNKNOWN\",AQ265))","v":""},null,"","","","",""]
[{"$nulls":44},"","","","",{"$f":"IF(AS266=\"\",\"\",IF(AQ266=\"\",\"UNKNOWN\",AQ266))","v":""},null,"","","","",""]
[{"$nulls":44},"","","","",{"$f":"IF(AS267=\"\",\"\",IF(AQ267=\"\",\"UNKNOWN\",AQ267))","v":""},null,"","","","",""]
[{"$nulls":44},"","","","",{"$f":"IF(AS268=\"\",\"\",IF(AQ268=\"\",\"UNKNOWN\",AQ268))","v":""},null,"","","","",""]
[{"$nulls":44},"","","","",{"$f":"IF(AS269=\"\",\"\",IF(AQ269=\"\",\"UNKNOWN\",AQ269))","v":""},null,"","","","",""]
[{"$nulls":44},"","","","",{"$f":"IF(AS270=\"\",\"\",IF(AQ270=\"\",\"UNKNOWN\",AQ270))","v":""},null,"","","","",""]
[{"$nulls":44},"","","","",{"$f":"IF(AS271=\"\",\"\",IF(AQ271=\"\",\"UNKNOWN\",AQ271))","v":""},null,"","","","",""]
[{"$nulls":44},"","","","",{"$f":"IF(AS272=\"\",\"\",IF(AQ272=\"\",\"UNKNOWN\",AQ272))","v":""},null,"","","","",""]
[{"$nulls":44},"","","","",{"$f":"IF(AS273=\"\",\"\",IF(AQ273=\"\",\"UNKNOWN\",AQ273))","v":""},null,"","","","",""]
[{"$nulls":44},"","","","",{"$f":"IF(AS274=\"\",\"\",IF(AQ274=\"\",\"UNKNOWN\",AQ274))","v":""},null,"","","","",""]
[{"$nulls":44},"","","","",{"$f":"IF(AS275=\"\",\"\",IF(AQ275=\"\",\"UNKNOWN\",AQ275))","v":""},null,"","","","",""]
[{"$nulls":44},"","","","",{"$f":"IF(AS276=\"\",\"\",IF(AQ276=\"\",\"UNKNOWN\",AQ276))","v":""},null,"","","","",""]
[{"$nulls":44},"","","","",{"$f":"IF(AS277=\"\",\"\",IF(AQ277=\"\",\"UNKNOWN\",AQ277))","v":""},null,"","","","",""]
[{"$nulls":44},"","","","",{"$f":"IF(AS278=\"\",\"\",IF(AQ278=\"\",\"UNKNOWN\",AQ278))","v":""},null,"","","","",""]
[{"$nulls":44},"","","","",{"$f":"IF(AS279=\"\",\"\",IF(AQ279=\"\",\"UNKNOWN\",AQ279))","v":""},null,"","","","",""]
[{"$nulls":44},"","","","",{"$f":"IF(AS280=\"\",\"\",IF(AQ280=\"\",\"UNKNOWN\",AQ280))","v":""},null,"","","","",""]
[{"$nulls":44},"","","","",{"$f":"IF(AS281=\"\",\"\",IF(AQ281=\"\",\"UNKNOWN\",AQ281))","v":""},null,"","","","",""]
[{"$nulls":44},"","","","",{"$f":"IF(AS282=\"\",\"\",IF(AQ282=\"\",\"UNKNOWN\",AQ282))","v":""},null,"","","","",""]
[{"$nulls":44},"","","","",{"$f":"IF(AS283=\"\",\"\",IF(AQ283=\"\",\"UNKNOWN\",AQ283))","v":""},null,"","","","",""]
[{"$nulls":44},"","","","",{"$f":"IF(AS284=\"\",\"\",IF(AQ284=\"\",\"UNKNOWN\",AQ284))","v":""},null,"","","","",""]
[{"$nulls":44},"","","","",{"$f":"IF(AS285=\"\",\"\",IF(AQ285=\"\",\"UNKNOWN\",AQ285))","v":""},null,"","","","",""]
[{"$nulls":44},"","","","",{"$f":"IF(AS286=\"\",\"\",IF(AQ286=\"\",\"UNKNOWN\",AQ286))","v":""},null,"","","","",""]
[{"$nulls":44},"","","","",{"$f":"IF(AS287=\"\",\"\",IF(AQ287=\"\",\"UNKNOWN\",AQ287))","v":""},null,"","","","",""]
[{"$nulls":44},"","","","",{"$f":"IF(AS288=\"\",\"\",IF(AQ288=\"\",\"UNKNOWN\",AQ288))","v":""},null,"","","","",""]
[{"$nulls":44},"","","","",{"$f":"IF(AS289=\"\",\"\",IF(AQ289=\"\",\"UNKNOWN\",AQ289))","v":""},null,"","","","",""]
[{"$nulls":44},"","","","",{"$f":"IF(AS290=\"\",\"\",IF(AQ290=\"\",\"UNKNOWN\",AQ290))","v":""},null,"","","","",""]
[{"$nulls":44},"","","","",{"$f":"IF(AS291=\"\",\"\",IF(AQ291=\"\",\"UNKNOWN\",AQ291))","v":""},null,"","","","",""]
[{"$nulls":44},"","","","",{"$f":"IF(AS292=\"\",\"\",IF(AQ292=\"\",\"UNKNOWN\",AQ292))","v":""},null,"","","","",""]
[{"$nulls":44},"","","","",{"$f":"IF(AS293=\"\",\"\",IF(AQ293=\"\",\"UNKNOWN\",AQ293))","v":""},null,"","","","",""]
[{"$nulls":44},"","","","",{"$f":"IF(AS294=\"\",\"\",IF(AQ294=\"\",\"UNKNOWN\",AQ294))","v":""},null,"","","","",""]
[{"$nulls":44},"","","","",{"$f":"IF(AS295=\"\",\"\",IF(AQ295=\"\",\"UNKNOWN\",AQ295))","v":""},null,"","","","",""]
[{"$nulls":44},"","","","",{"$f":"IF(AS296=\"\",\"\",IF(AQ296=\"\",\"UNKNOWN\",AQ296))","v":""},null,"","","","",""]
[{"$nulls":44},"","","","",{"$f":"IF(AS297=\"\",\"\",IF(AQ297=\"\",\"UNKNOWN\",AQ297))","v":""},null,"","","","",""]
[{"$nulls":44},"","","","",{"$f":"IF(AS298=\"\",\"\",IF(AQ298=\"\",\"UNKNOWN\",AQ298))","v":""},null,"","","","",""]
[{"$nulls":44},"","","","",{"$f":"IF(AS299=\"\",\"\",IF(AQ299=\"\",\"UNKNOWN\",AQ299))","v":""},null,"","","","",""]
[{"$nulls":44},"","","","",{"$f":"IF(AS300=\"\",\"\",IF(AQ300=\"\",\"UNKNOWN\",AQ300))","v":""},null,"","","","",""]
[{"$nulls":44},"","","","",{"$f":"IF(AS301=\"\",\"\",IF(AQ301=\"\",\"UNKNOWN\",AQ301))","v":""},null,"","","","",""]
[{"$nulls":44},"","","","",{"$f":"IF(AS302=\"\",\"\",IF(AQ302=\"\",\"UNKNOWN\",AQ302))","v":""},null,"","","","",""]
[{"$nulls":44},"","","","",{"$f":"IF(AS303=\"\",\"\",IF(AQ303=\"\",\"UNKNOWN\",AQ303))","v":""},null,"","","","",""]
[{"$nulls":44},"","","","",{"$f":"IF(AS304=\"\",\"\",IF(AQ304=\"\",\"UNKNOWN\",AQ304))","v":""},null,"","","","",""]
[{"$nulls":44},"","","","",{"$f":"IF(AS305=\"\",\"\",IF(AQ305=\"\",\"UNKNOWN\",AQ305))","v":""},{"$nulls":4},"",""]

{"sheet":"Review","index":1,"n_rows":301,"n_cols":40,"rows_kept":301,"cut":false,"hidden":false,"merged":[[0,3,0,4],[1,3,1,4],[0,11,0,15],[1,11,1,15]]}
["2012-01-27","Types","Code","Track",null,"Race","Mtrs","Field","Cond","Jump","Now","Race Name",{"$nulls":4},"TF Pool","WIN Pool",{"$nulls":12},"Date",1,{"$f":"IF(AI1=\"\",\"\",CONCATENATE(TEXT(AH1,\"HH:MM AM/PM\"),\"-\",AI1,\"-\",AJ1))","v":"01:00 PM-MORNINGTON-01"},{"$f":"IF(RaceCard!AY2=\"\",\"\",RaceCard!AY2)","v":"13:00:00"},{"$f":"IF(RaceCard!AZ2=\"\",\"\",RaceCard!AZ2)","v":"MORNINGTON"},{"$f":"IF(RaceCard!BA2=\"\",\"\",RaceCard!BA2)","v":"01"},{"$f":"IF(RaceCard!BB2=\"\",\"\",RaceCard!BB2)","v":"LAND ENGINEERING MDN PLT"},{"$f":"IF(RaceCard!BC2=\"\",\"\",RaceCard!BC2)","v":"MDN"},{"$f":"IF(AI1=\"\",\"\",IF(ISERROR(VLOOKUP(AI1,RaceCard!$AD$2:$AF$48,2,FALSE)),\"X\",VLOOKUP(AI1,RaceCard!$AD$2:$AF$48,3,FALSE)))","v":"VR"},{"$f":"IF(AG1=\"\",\"\",CONCATENATE(AM1,\"-\",TEXT(AJ1,\"00\")))","v":"VR-01"}]
[7,"R",{"$f":"VLOOKUP(A2,racecodes,9,FALSE)","v":"CR-03"},{"$f":"VLOOKUP(A2,racecodes,4,FALSE)","v":"CANBERRA"},null,{"$f":"VALUE(VLOOKUP(A2,racecodes,5,FALSE))","v":3},{"$f":"VALUE(RaceCard!D4)","v":1000},{"$f":"COUNTIF(RaceCard!AA2:AA25,\">0\")","v":7},{"$f":"RaceCard!C2","v":"Good"},{"$f":"VLOOKUP(A2,racecodes,3,FALSE)","v":"14:18:00"},{"$f":"NOW()+TIME(0,30,0)","v":40935.51099594908},{"$f":"VLOOKUP(A2,racecodes,6,FALSE)","v":"GRASS FX BM 70 HCP"},{"$nulls":4},{"$f":"RaceCard!A26","v":40},{"$nulls":13},{"$f":"TEXT($A$1,\"yyyy/m/d\")","v":"2012/1/27"},2,{"$f":"IF(AI2=\"\",\"\",CONCATENATE(TEXT(AH2,\"HH:MM AM/PM\"),\"-\",AI2,\"-\",AJ2))","v":"01:08 PM-CANBERRA-01"},{"$f":"IF(RaceCard!AY3=\"\",\"\",RaceCard!AY3)","v":"13:08:00"},{"$f":"IF(RaceCard!AZ3=\"\",\"\",RaceCard!AZ3)","v":"CANBERRA"},{"$f":"IF(RaceCard!BA3=\"\",\"\",RaceCard!BA3)","v":"01"},{"$f":"IF(RaceCard!BB3=\"\",\"\",RaceCard!BB3)","v":"KENNARDS HIRE 2YO HCP"},{"$f":"IF(RaceCard!BC3=\"\",\"\",RaceCard!BC3)","v":"UNKNOWN"},{"$f":"IF(AI2=\"\",\"\",IF(ISERROR(VLOOKUP(AI2,RaceCard!$AD$2:$AF$48,2,FALSE)),\"X\",VLOOKUP(AI2,RaceCard!$AD$2:$AF$48,3,FALSE)))","v":"CR"},"CR-01"]
[null,"TAB","Name","Win Odds","Plc Odds","Last Odds","Odds +/-","Weight","QTP","Tipster","Qrating","Late Mail","LS3 Form","LS1","LS2","LS3","Form","Jockey",{"$nulls":12},{"$f":"TEXT(A1,\"yyyy\")","v":"2012"},3,"01:35 PM-MORNINGTON-02",{"$f":"IF(RaceCard!AY4=\"\",\"\",RaceCard!AY4)","v":"13:35:00"},{"$f":"IF(RaceCard!AZ4=\"\",\"\",RaceCard!AZ4)","v":"MORNINGTON"},{"$f":"IF(RaceCard!BA4=\"\",\"\",RaceCard!BA4)","v":"02"},{"$f":"IF(RaceCard!BB4=\"\",\"\",RaceCard!BB4)","v":"LAND ENGINEERING F&M MDN PLT"},{"$f":"IF(RaceCard!BC4=\"\",\"\",RaceCard!BC4)","v":"MDN"},{"$f":"IF(AI3=\"\",\"\",IF(ISERROR(VLOOKUP(AI3,RaceCard!$AD$2:$AF$48,2,FALSE)),\"X\",VLOOKUP(AI3,RaceCard!$AD$2:$AF$48,3,FALSE)))","v":"VR"},"VR-02"]
[null,{"$f":"IF(OR(RaceCard!$V2=0,RaceCard!$V2=\"\",RaceCard!$V2>1000),\"\",RaceCard!M2)","v":1},{"$f":"IF(B4=\"\",\"\",RaceCard!N2)","v":"RAVNA GORA"},{"$f":"IF(B4=\"\",\"\",RaceCard!V2)","v":3.2},{"$f":"IF(B4=\"\",\"\",RaceCard!W2)","v":3},{"$f":"IF(B4=\"\",\"\",RaceCard!U2)","v":3},{"$f":"IF(OR(D4=\"\",D4=0,F4=0),\"\",(D4-F4)/F4)","v":6.6666666666666721E-2},{"$f":"IF(B4=\"\",\"\",RaceCard!O2)","v":60.5},{"$f":"IF(B4=\"\",\"\",IF($B4=RaceCard!$B$13,1,IF($B4=RaceCard!$C$13,2,IF($B4=RaceCard!$D$13,3,IF($B4=RaceCard!$E$13,4,\"\")))))","v":""},{"$f":"IF($B4=\"\",\"\",IF($B4=RaceCard!$B$14,1,IF($B4=RaceCard!$C$14,2,IF($B4=RaceCard!$D$14,3,IF($B4=RaceCard!$E$14,4,\"\")))))","v":3},{"$f":"IF(B4=\"\",\"\",RaceCard!T2)","v":94},{"$f":"IF(B4=\"\",\"\",IF($B4=RaceCard!$B$12,1,\"\"))","v":""},{"$f":"IF(B4=\"\",\"\",IF(RaceCard!S2=\"\",\"\",RaceCard!S2))","v":434},{"$f":"IF(B4=\"\",\"\",IF(RaceCard!X2=\"\",\"\",VALUE(RaceCard!X2)))","v":4},{"$f":"IF(B4=\"\",\"\",IF(RaceCard!Y2=\"\",\"\",VALUE(RaceCard!Y2)))","v":3},{"$f":"IF(B4=\"\",\"\",IF(RaceCard!Z2=\"\",\"\",VALUE(RaceCard!Z2)))","v":4},{"$f":"IF(B4=\"\",\"\",IF(RaceCard!Q2=\"\",\"\",RaceCard!Q2))","v":"DWTC"},{"$f":"IF(B4=\"\",\"\",IF(RaceCard!P2=\"\",\"\",RaceCard!P2))","v":"J KISSICK(A)"},{"$nulls":12},{"$f":"TEXT(A1,\"m\")","v":"1"},4,"01:43 PM-CANBERRA-02",{"$f":"IF(RaceCard!AY5=\"\",\"\",RaceCard!AY5)","v":"13:43:00"},{"$f":"IF(RaceCard!AZ5=\"\",\"\",RaceCard!AZ5)","v":"CANBERRA"},{"$f":"IF(RaceCard!BA5=\"\",\"\",RaceCard!BA5)","v":"02"},{"$f":"IF(RaceCard!BB5=\"\",\"\",RaceCard!BB5)","v":"ALAN RUMMERY MDN PLT"},{"$f":"IF(RaceCard!BC5=\"\",\"\",RaceCard!BC5)","v":"MDN"},{"$f":"IF(AI4=\"\",\"\",IF(ISERROR(VLOOKUP(AI4,RaceCard!$AD$2:$AF$48,2,FALSE)),\"X\",VLOOKUP(AI4,RaceCard!$AD$2:$AF$48,3,FALSE)))","v":"CR"},"CR-02"]
[null,{"$f":"IF(OR(RaceCard!$V3=0,RaceCard!$V3=\"\",RaceCard!$V3>1000),\"\",RaceCard!M3)","v":2},{"$f":"IF(B5=\"\",\"\",RaceCard!N3)","v":"JOLLY JOKER"},{"$f":"IF(B5=\"\",\"\",RaceCard!V3)","v":108.5},{"$f":"IF(B5=\"\",\"\",RaceCard!W3)","v":6},{"$f":"IF(B5=\"\",\"\",RaceCard!U3)","v":0},{"$f":"IF(OR(D5=\"\",D5=0,F5=0),\"\",(D5-F5)/F5)","v":""},{"$f":"IF(B5=\"\",\"\",RaceCard!O3)","v":58.5},{"$f":"IF(B5=\"\",\"\",IF($B5=RaceCard!$B$13,1,IF($B5=RaceCard!$C$13,2,IF($B5=RaceCard!$D$13,3,IF($B5=RaceCard!$E$13,4,\"\")))))","v":3},{"$f":"IF($B5=\"\",\"\",IF($B5=RaceCard!$B$14,1,IF($B5=RaceCard!$C$14,2,IF($B5=RaceCard!$D$14,3,IF($B5=RaceCard!$E$14,4,\"\")))))","v":""},{"$f":"IF(B5=\"\",\"\",RaceCard!T3)","v":94},{"$f":"IF(B5=\"\",\"\",IF($B5=RaceCard!$B$12,1,\"\"))","v":""},{"$f":"IF(B5=\"\",\"\",IF(RaceCard!S3=\"\",\"\",RaceCard!S3))","v":135},{"$f":"IF(B5=\"\",\"\",IF(RaceCard!X3=\"\",\"\",VALUE(RaceCard!X3)))","v":1},{"$f":"IF(B5=\"\",\"\",IF(RaceCard!Y3=\"\",\"\",VALUE(RaceCard!Y3)))","v":3},{"$f":"IF(B5=\"\",\"\",IF(RaceCard!Z3=\"\",\"\",VALUE(RaceCard!Z3)))","v":5},{"$f":"IF(B5=\"\",\"\",IF(RaceCard!Q3=\"\",\"\",RaceCard!Q3))","v":"DWC"},{"$f":"IF(B5=\"\",\"\",IF(RaceCard!P3=\"\",\"\",RaceCard!P3))","v":"A KING(A)"},{"$nulls":12},{"$f":"TEXT(A1,\"d\")","v":"27"},5,"02:00 PM-IPSWICH-01",{"$f":"IF(RaceCard!AY6=\"\",\"\",RaceCard!AY6)","v":"14:00:00"},{"$f":"IF(RaceCard!AZ6=\"\",\"\",RaceCard!AZ6)","v":"IPSWICH"},{"$f":"IF(RaceCard!BA6=\"\",\"\",RaceCard!BA6)","v":"01"},{"$f":"IF(RaceCard!BB6=\"\",\"\",RaceCard!BB6)","v":"SKY RACING BM 75 HCP"},{"$f":"IF(RaceCard!BC6=\"\",\"\",RaceCard!BC6)","v":"UNKNOWN"},{"$f":"IF(AI5=\"\",\"\",IF(ISERROR(VLOOKUP(AI5,RaceCard!$AD$2:$AF$48,2,FALSE)),\"X\",VLOOKUP(AI5,RaceCard!$AD$2:$AF$48,3,FALSE)))","v":"BR"},"BR-01"]
[null,{"$f":"IF(OR(RaceCard!$V4=0,RaceCard!$V4=\"\",RaceCard!$V4>1000),\"\",RaceCard!M4)","v":""},{"$f":"IF(B6=\"\",\"\",RaceCard!N4)","v":""},{"$f":"IF(B6=\"\",\"\",RaceCard!V4)","v":""},{"$f":"IF(B6=\"\",\"\",RaceCard!W4)","v":""},{"$f":"IF(B6=\"\",\"\",RaceCard!U4)","v":""},"",{"$f":"IF(B6=\"\",\"\",RaceCard!O4)","v":""},{"$f":"IF(B6=\"\",\"\",IF($B6=RaceCard!$B$13,1,IF($B6=RaceCard!$C$13,2,IF($B6=RaceCard!$D$13,3,IF($B6=RaceCard!$E$13,4,\"\")))))","v":""},{"$f":"IF($B6=\"\",\"\",IF($B6=RaceCard!$B$14,1,IF($B6=RaceCard!$C$14,2,IF($B6=RaceCard!$D$14,3,IF($B6=RaceCard!$E$14,4,\"\")))))","v":""},{"$f":"IF(B6=\"\",\"\",RaceCard!T4)","v":""},{"$f":"IF(B6=\"\",\"\",IF($B6=RaceCard!$B$12,1,\"\"))","v":""},{"$f":"IF(B6=\"\",\"\",IF(RaceCard!S4=\"\",\"\",RaceCard!S4))","v":""},{"$f":"IF(B6=\"\",\"\",IF(RaceCard!X4=\"\",\"\",VALUE(RaceCard!X4)))","v":""},{"$f":"IF(B6=\"\",\"\",IF(RaceCard!Y4=\"\",\"\",VALUE(RaceCard!Y4)))","v":""},{"$f":"IF(B6=\"\",\"\",IF(RaceCard!Z4=\"\",\"\",VALUE(RaceCard!Z4)))","v":""},{"$f":"IF(B6=\"\",\"\",IF(RaceCard!Q4=\"\",\"\",RaceCard!Q4))","v":""},{"$f":"IF(B6=\"\",\"\",IF(RaceCard!P4=\"\",\"\",RaceCard!P4))","v":""},{"$nulls":12},{"$f":"IF(A2=\"\",\"\",VLOOKUP(A2,racecodes,8,FALSE))","v":"CR"},6,"02:10 PM-MORNINGTON-03",{"$f":"IF(RaceCard!AY7=\"\",\"\",RaceCard!AY7)","v":"14:10:00"},{"$f":"IF(RaceCard!AZ7=\"\",\"\",RaceCard!AZ7)","v":"MORNINGTON"},{"$f":"IF(RaceCard!BA7=\"\",\"\",RaceCard!BA7)","v":"03"},{"$f":"IF(RaceCard!BB7=\"\",\"\",RaceCard!BB7)","v":"ADAM DOWER MEMORIAL MDN PLT"},{"$f":"IF(RaceCard!BC7=\"\",\"\",RaceCard!BC7)","v":"MDN"},{"$f":"IF(AI6=\"\",\"\",IF(ISERROR(VLOOKUP(AI6,RaceCard!$AD$2:$AF$48,2,FALSE)),\"X\",VLOOKUP(AI6,RaceCard!$AD$2:$AF$48,3,FALSE)))","v":"VR"},"VR-03"]
[null,{"$f":"IF(OR(RaceCard!$V5=0,RaceCard!$V5=\"\",RaceCard!$V5>1000),\"\",RaceCard!M5)","v":4},{"$f":"IF(B7=\"\",\"\",RaceCard!N5)","v":"MY DEAR FRIEND"},{"$f":"IF(B7=\"\",\"\",RaceCard!V5)","v":54.2},{"$f":"IF(B7=\"\",\"\",RaceCard!W5)","v":0},{"$f":"IF(B7=\"\",\"\",RaceCard!U5)","v":0},"",{"$f":"IF(B7=\"\",\"\",RaceCard!O5)","v":57},{"$f":"IF(B7=\"\",\"\",IF($B7=RaceCard!$B$13,1,IF($B7=RaceCard!$C$13,2,IF($B7=RaceCard!$D$13,3,IF($B7=RaceCard!$E$13,4,\"\")))))","v":""},{"$f":"IF($B7=\"\",\"\",IF($B7=RaceCard!$B$14,1,IF($B7=RaceCard!$C$14,2,IF($B7=RaceCard!$D$14,3,IF($B7=RaceCard!$E$14,4,\"\")))))","v":""},{"$f":"IF(B7=\"\",\"\",RaceCard!T5)","v":95},{"$f":"IF(B7=\"\",\"\",IF($B7=RaceCard!$B$12,1,\"\"))","v":""},{"$f":"IF(B7=\"\",\"\",IF(RaceCard!S5=\"\",\"\",RaceCard!S5))","v":"17X"},{"$f":"IF(B7=\"\",\"\",IF(RaceCard!X5=\"\",\"\",VALUE(RaceCard!X5)))","v":1},{"$f":"IF(B7=\"\",\"\",IF(RaceCard!Y5=\"\",\"\",VALUE(RaceCard!Y5)))","v":7},{"$f":"IF(B7=\"\",\"\",IF(RaceCard!Z5=\"\",\"\",VALUE(RaceCard!Z5)))","v":""},{"$f":"IF(B7=\"\",\"\",IF(RaceCard!Q5=\"\",\"\",RaceCard!Q5))","v":"W"},{"$f":"IF(B7=\"\",\"\",IF(RaceCard!P5=\"\",\"\",RaceCard!P5))","v":"B MURPHY"},{"$nulls":12},{"$f":"F2","v":3},7,"02:18 PM-CANBERRA-03",{"$f":"IF(RaceCard!AY8=\"\",\"\",RaceCard!AY8)","v":"14:18:00"},{"$f":"IF(RaceCard!AZ8=\"\",\"\",RaceCard!AZ8)","v":"CANBERRA"},{"$f":"IF(RaceCard!BA8=\"\",\"\",RaceCard!BA8)","v":"03"},{"$f":"IF(RaceCard!BB8=\"\",\"\",RaceCard!BB8)","v":"GRASS FX BM 70 HCP"},{"$f":"IF(RaceCard!BC8=\"\",\"\",RaceCard!BC8)","v":"BM70"},{"$f":"IF(AI7=\"\",\"\",IF(ISERROR(VLOOKUP(AI7,RaceCard!$AD$2:$AF$48,2,FALSE)),\"X\",VLOOKUP(AI7,RaceCard!$AD$2:$AF$48,3,FALSE)))","v":"CR"},"CR-03"]
[null,{"$f":"IF(OR(RaceCard!$V6=0,RaceCard!$V6=\"\",RaceCard!$V6>1000),\"\",RaceCard!M6)","v":5},{"$f":"IF(B8=\"\",\"\",RaceCard!N6)","v":"BATTLE READY"},{"$f":"IF(B8=\"\",\"\",RaceCard!V6)","v":9},{"$f":"IF(B8=\"\",\"\",RaceCard!W6)","v":2},{"$f":"IF(B8=\"\",\"\",RaceCard!U6)","v":7.3},0.23287671232876717,{"$f":"IF(B8=\"\",\"\",RaceCard!O6)","v":55.5},{"$f":"IF(B8=\"\",\"\",IF($B8=RaceCard!$B$13,1,IF($B8=RaceCard!$C$13,2,IF($B8=RaceCard!$D$13,3,IF($B8=RaceCard!$E$13,4,\"\")))))","v":""},{"$f":"IF($B8=\"\",\"\",IF($B8=RaceCard!$B$14,1,IF($B8=RaceCard!$C$14,2,IF($B8=RaceCard!$D$14,3,IF($B8=RaceCard!$E$14,4,\"\")))))","v":""},{"$f":"IF(B8=\"\",\"\",RaceCard!T6)","v":96},{"$f":"IF(B8=\"\",\"\",IF($B8=RaceCard!$B$12,1,\"\"))","v":""},{"$f":"IF(B8=\"\",\"\",IF(RaceCard!S6=\"\",\"\",RaceCard!S6))","v":"X6X"},{"$f":"IF(B8=\"\",\"\",IF(RaceCard!X6=\"\",\"\",VALUE(RaceCard!X6)))","v":""},{"$f":"IF(B8=\"\",\"\",IF(RaceCard!Y6=\"\",\"\",VALUE(RaceCard!Y6)))","v":6},{"$f":"IF(B8=\"\",\"\",IF(RaceCard!Z6=\"\",\"\",VALUE(RaceCard!Z6)))","v":""},{"$f":"IF(B8=\"\",\"\",IF(RaceCard!Q6=\"\",\"\",RaceCard!Q6))","v":"DW"},{"$f":"IF(B8=\"\",\"\",IF(RaceCard!P6=\"\",\"\",RaceCard!P6))","v":"G BUCKLEY"},{"$nulls":12},{"$f":"CONCATENATE(AE6,TEXT(AE7,\"0\"))","v":"CR3"},8,"02:30 PM-ARMIDALE-01",{"$f":"IF(RaceCard!AY9=\"\",\"\",RaceCard!AY9)","v":"14:30:00"},{"$f":"IF(RaceCard!AZ9=\"\",\"\",RaceCard!AZ9)","v":"ARMIDALE"},{"$f":"IF(RaceCard!BA9=\"\",\"\",RaceCard!BA9)","v":"01"},{"$f":"IF(RaceCard!BB9=\"\",\"\",RaceCard!BB9)","v":"ARMIDALE CUP DAY 19/3 MDN PLT"},{"$f":"IF(RaceCard!BC9=\"\",\"\",RaceCard!BC9)","v":"MDN"},{"$f":"IF(AI8=\"\",\"\",IF(ISERROR(VLOOKUP(AI8,RaceCard!$AD$2:$AF$48,2,FALSE)),\"X\",VLOOKUP(AI8,RaceCard!$AD$2:$AF$48,3,FALSE)))","v":"NR"},"NR-01"]
[null,{"$f":"IF(OR(RaceCard!$V7=0,RaceCard!$V7=\"\",RaceCard!$V7>1000),\"\",RaceCard!M7)","v":6},{"$f":"IF(B9=\"\",\"\",RaceCard!N7)","v":"TANYA JEAN"},{"$f":"IF(B9=\"\",\"\",RaceCard!V7)","v":2.6},{"$f":"IF(B9=\"\",\"\",RaceCard!W7)","v":3},{"$f":"IF(B9=\"\",\"\",RaceCard!U7)","v":1.8},0.44444444444444448,{"$f":"IF(B9=\"\",\"\",RaceCard!O7)","v":55.5},{"$f":"IF(B9=\"\",\"\",IF($B9=RaceCard!$B$13,1,IF($B9=RaceCard!$C$13,2,IF($B9=RaceCard!$D$13,3,IF($B9=RaceCard!$E$13,4,\"\")))))","v":2},{"$f":"IF($B9=\"\",\"\",IF($B9=RaceCard!$B$14,1,IF($B9=RaceCard!$C$14,2,IF($B9=RaceCard!$D$14,3,IF($B9=RaceCard!$E$14,4,\"\")))))","v":1},{"$f":"IF(B9=\"\",\"\",RaceCard!T7)","v":100},{"$f":"IF(B9=\"\",\"\",IF($B9=RaceCard!$B$12,1,\"\"))","v":""},{"$f":"IF(B9=\"\",\"\",IF(RaceCard!S7=\"\",\"\",RaceCard!S7))","v":51},{"$f":"IF(B9=\"\",\"\",IF(RaceCard!X7=\"\",\"\",VALUE(RaceCard!X7)))","v":5},{"$f":"IF(B9=\"\",\"\",IF(RaceCard!Y7=\"\",\"\",VALUE(RaceCard!Y7)))","v":1},{"$f":"IF(B9=\"\",\"\",IF(RaceCard!Z7=\"\",\"\",VALUE(RaceCard!Z7)))","v":""},{"$f":"IF(B9=\"\",\"\",IF(RaceCard!Q7=\"\",\"\",RaceCard!Q7))","v":"TC"},{"$f":"IF(B9=\"\",\"\",IF(RaceCard!P7=\"\",\"\",RaceCard!P7))","v":"MATHEW CAHILL"},{"$nulls":13},9,"02:35 PM-IPSWICH-02",{"$f":"IF(RaceCard!AY10=\"\",\"\",RaceCard!AY10)","v":"14:35:00"},{"$f":"IF(RaceCard!AZ10=\"\",\"\",RaceCard!AZ10)","v":"IPSWICH"},{"$f":"IF(RaceCard!BA10=\"\",\"\",RaceCard!BA10)","v":"02"},{"$f":"IF(RaceCard!BB10=\"\",\"\",RaceCard!BB10)","v":"KEVIN KEIDGE MEM 2YO MDN HCP"},{"$f":"IF(RaceCard!BC10=\"\",\"\",RaceCard!BC10)","v":"UNKNOWN"},{"$f":"IF(AI9=\"\",\"\",IF(ISERROR(VLOOKUP(AI9,RaceCard!$AD$2:$AF$48,2,FALSE)),\"X\",VLOOKUP(AI9,RaceCard!$AD$2:$AF$48,3,FALSE)))","v":"BR"},"BR-02"]
[null,{"$f":"IF(OR(RaceCard!$V8=0,RaceCard!$V8=\"\",RaceCard!$V8>1000),\"\",RaceCard!M8)","v":7},{"$f":"IF(B10=\"\",\"\",RaceCard!N8)","v":"MATERIAL MATTERS"},{"$f":"IF(B10=\"\",\"\",RaceCard!V8)","v":3.1},{"$f":"IF(B10=\"\",\"\",RaceCard!W8)","v":1},{"$f":"IF(B10=\"\",\"\",RaceCard!U8)","v":5.6},-0.4464285714285714,{"$f":"IF(B10=\"\",\"\",RaceCard!O8)","v":54},{"$f":"IF(B10=\"\",\"\",IF($B10=RaceCard!$B$13,1,IF($B10=RaceCard!$C$13,2,IF($B10=RaceCard!$D$13,3,IF($B10=RaceCard!$E$13,4,\"\")))))","v":1},{"$f":"IF($B10=\"\",\"\",IF($B10=RaceCard!$B$14,1,IF($B10=RaceCard!$C$14,2,IF($B10=RaceCard!$D$14,3,IF($B10=RaceCard!$E$14,4,\"\")))))","v":2},{"$f":"IF(B10=\"\",\"\",RaceCard!T8)","v":96},{"$f":"IF(B10=\"\",\"\",IF($B10=RaceCard!$B$12,1,\"\"))","v":""},{"$f":"IF(B10=\"\",\"\",IF(RaceCard!S8=\"\",\"\",RaceCard!S8))","v":232},{"$f":"IF(B10=\"\",\"\",IF(RaceCard!X8=\"\",\"\",VALUE(RaceCard!X8)))","v":2},{"$f":"IF(B10=\"\",\"\",IF(RaceCard!Y8=\"\",\"\",VALUE(RaceCard!Y8)))","v":3},{"$f":"IF(B10=\"\",\"\",IF(RaceCard!Z8=\"\",\"\",VALUE(RaceCard!Z8)))","v":2},{"$f":"IF(B10=\"\",\"\",IF(RaceCard!Q8=\"\",\"\",RaceCard!Q8))","v":"C"},{"$f":"IF(B10=\"\",\"\",IF(RaceCard!P8=\"\",\"\",RaceCard!P8))","v":"J PENZA"},{"$nulls":13},10,"02:45 PM-MORNINGTON-04",{"$f":"IF(RaceCard!AY11=\"\",\"\",RaceCard!AY11)","v":"14:45:00"},{"$f":"IF(RaceCard!AZ11=\"\",\"\",RaceCard!AZ11)","v":"MORNINGTON"},{"$f":"IF(RaceCard!BA11=\"\",\"\",RaceCard!BA11)","v":"04"},{"$f":"IF(RaceCard!BB11=\"\",\"\",RaceCard!BB11)","v":"LAND ENGINEERING F&M 0-62 HCP"},{"$f":"IF(RaceCard!BC11=\"\",\"\",RaceCard!BC11)","v":"RB62"},{"$f":"IF(AI10=\"\",\"\",IF(ISERROR(VLOOKUP(AI10,RaceCard!$AD$2:$AF$48,2,FALSE)),\"X\",VLOOKUP(AI10,RaceCard!$AD$2:$AF$48,3,FALSE)))","v":"VR"},"VR-04"]
[null,{"$f":"IF(OR(RaceCard!$V9=0,RaceCard!$V9=\"\",RaceCard!$V9>1000),\"\",RaceCard!M9)","v":8},{"$f":"IF(B11=\"\",\"\",RaceCard!N9)","v":"BLUE WREN"},{"$f":"IF(B11=\"\",\"\",RaceCard!V9)","v":36.1},{"$f":"IF(B11=\"\",\"\",RaceCard!W9)","v":0},{"$f":"IF(B11=\"\",\"\",RaceCard!U9)","v":0},"",{"$f":"IF(B11=\"\",\"\",RaceCard!O9)","v":54},{"$f":"IF(B11=\"\",\"\",IF($B11=RaceCard!$B$13,1,IF($B11=RaceCard!$C$13,2,IF($B11=RaceCard!$D$13,3,IF($B11=RaceCard!$E$13,4,\"\")))))","v":""},{"$f":"IF($B11=\"\",\"\",IF($B11=RaceCard!$B$14,1,IF($B11=RaceCard!$C$14,2,IF($B11=RaceCard!$D$14,3,IF($B11=RaceCard!$E$14,4,\"\")))))","v":""},{"$f":"IF(B11=\"\",\"\",RaceCard!T9)","v":86},{"$f":"IF(B11=\"\",\"\",IF($B11=RaceCard!$B$12,1,\"\"))","v":""},{"$f":"IF(B11=\"\",\"\",IF(RaceCard!S9=\"\",\"\",RaceCard!S9))","v":"71X"},{"$f":"IF(B11=\"\",\"\",IF(RaceCard!X9=\"\",\"\",VALUE(RaceCard!X9)))","v":7},{"$f":"IF(B11=\"\",\"\",IF(RaceCard!Y9=\"\",\"\",VALUE(RaceCard!Y9)))","v":1},{"$f":"IF(B11=\"\",\"\",IF(RaceCard!Z9=\"\",\"\",VALUE(RaceCard!Z9)))","v":""},{"$f":"IF(B11=\"\",\"\",IF(RaceCard!Q9=\"\",\"\",RaceCard!Q9))","v":""},{"$f":"IF(B11=\"\",\"\",IF(RaceCard!P9=\"\",\"\",RaceCard!P9))","v":"S GUYMER(A)"},{"$nulls":13},11,"02:53 PM-CANBERRA-04",{"$f":"IF(RaceCard!AY12=\"\",\"\",RaceCard!AY12)","v":"14:53:00"},{"$f":"IF(RaceCard!AZ12=\"\",\"\",RaceCard!AZ12)","v":"CANBERRA"},{"$f":"IF(RaceCard!BA12=\"\",\"\",RaceCard!BA12)","v":"04"},{"$f":"IF(RaceCard!BB12=\"\",\"\",RaceCard!BB12)","v":"AUST HEALTH & SAFETY MDN PLT"},{"$f":"IF(RaceCard!BC12=\"\",\"\",RaceCard!BC12)","v":"MDN"},{"$f":"IF(AI11=\"\",\"\",IF(ISERROR(VLOOKUP(AI11,RaceCard!$AD$2:$AF$48,2,FALSE)),\"X\",VLOOKUP(AI11,RaceCard!$AD$2:$AF$48,3,FALSE)))","v":"CR"},"CR-04"]
[null,{"$f":"IF(OR(RaceCard!$V10=0,RaceCard!$V10=\"\",RaceCard!$V10>1000),\"\",RaceCard!M10)","v":""},{"$f":"IF(B12=\"\",\"\",RaceCard!N10)","v":""},{"$f":"IF(B12=\"\",\"\",RaceCard!V10)","v":""},{"$f":"IF(B12=\"\",\"\",RaceCard!W10)","v":""},{"$f":"IF(B12=\"\",\"\",RaceCard!U10)","v":""},"",{"$f":"IF(B12=\"\",\"\",RaceCard!O10)","v":""},{"$f":"IF(B12=\"\",\"\",IF($B12=RaceCard!$B$13,1,IF($B12=RaceCard!$C$13,2,IF($B12=RaceCard!$D$13,3,IF($B12=RaceCard!$E$13,4,\"\")))))","v":""},{"$f":"IF($B12=\"\",\"\",IF($B12=RaceCard!$B$14,1,IF($B12=RaceCard!$C$14,2,IF($B12=RaceCard!$D$14,3,IF($B12=RaceCard!$E$14,4,\"\")))))","v":""},{"$f":"IF(B12=\"\",\"\",RaceCard!T10)","v":""},{"$f":"IF(B12=\"\",\"\",IF($B12=RaceCard!$B$12,1,\"\"))","v":""},{"$f":"IF(B12=\"\",\"\",IF(RaceCard!S10=\"\",\"\",RaceCard!S10))","v":""},{"$f":"IF(B12=\"\",\"\",IF(RaceCard!X10=\"\",\"\",VALUE(RaceCard!X10)))","v":""},{"$f":"IF(B12=\"\",\"\",IF(RaceCard!Y10=\"\",\"\",VALUE(RaceCard!Y10)))","v":""},{"$f":"IF(B12=\"\",\"\",IF(RaceCard!Z10=\"\",\"\",VALUE(RaceCard!Z10)))","v":""},{"$f":"IF(B12=\"\",\"\",IF(RaceCard!Q10=\"\",\"\",RaceCard!Q10))","v":""},{"$f":"IF(B12=\"\",\"\",IF(RaceCard!P10=\"\",\"\",RaceCard!P10))","v":""},{"$nulls":13},12,"03:05 PM-ARMIDALE-02",{"$f":"IF(RaceCard!AY13=\"\",\"\",RaceCard!AY13)","v":"15:05:00"},{"$f":"IF(RaceCard!AZ13=\"\",\"\",RaceCard!AZ13)","v":"ARMIDALE"},{"$f":"IF(RaceCard!BA13=\"\",\"\",RaceCard!BA13)","v":"02"},{"$f":"IF(RaceCard!BB13=\"\",\"\",RaceCard!BB13)","v":"GUYRA CUP DAY 4/3 MDN HCP"},{"$f":"IF(RaceCard!BC13=\"\",\"\",RaceCard!BC13)","v":"MDN"},{"$f":"IF(AI12=\"\",\"\",IF(ISERROR(VLOOKUP(AI12,RaceCard!$AD$2:$AF$48,2,FALSE)),\"X\",VLOOKUP(AI12,RaceCard!$AD$2:$AF$48,3,FALSE)))","v":"NR"},"NR-02"]
[null,{"$f":"IF(OR(RaceCard!$V11=0,RaceCard!$V11=\"\",RaceCard!$V11>1000),\"\",RaceCard!M11)","v":""},{"$f":"IF(B13=\"\",\"\",RaceCard!N11)","v":""},{"$f":"IF(B13=\"\",\"\",RaceCard!V11)","v":""},{"$f":"IF(B13=\"\",\"\",RaceCard!W11)","v":""},{"$f":"IF(B13=\"\",\"\",RaceCard!U11)","v":""},"",{"$f":"IF(B13=\"\",\"\",RaceCard!O11)","v":""},{"$f":"IF(B13=\"\",\"\",IF($B13=RaceCard!$B$13,1,IF($B13=RaceCard!$C$13,2,IF($B13=RaceCard!$D$13,3,IF($B13=RaceCard!$E$13,4,\"\")))))","v":""},{"$f":"IF($B13=\"\",\"\",IF($B13=RaceCard!$B$14,1,IF($B13=RaceCard!$C$14,2,IF($B13=RaceCard!$D$14,3,IF($B13=RaceCard!$E$14,4,\"\")))))","v":""},{"$f":"IF(B13=\"\",\"\",RaceCard!T11)","v":""},{"$f":"IF(B13=\"\",\"\",IF($B13=RaceCard!$B$12,1,\"\"))","v":""},{"$f":"IF(B13=\"\",\"\",IF(RaceCard!S11=\"\",\"\",RaceCard!S11))","v":""},{"$f":"IF(B13=\"\",\"\",IF(RaceCard!X11=\"\",\"\",VALUE(RaceCard!X11)))","v":""},{"$f":"IF(B13=\"\",\"\",IF(RaceCard!Y11=\"\",\"\",VALUE(RaceCard!Y11)))","v":""},{"$f":"IF(B13=\"\",\"\",IF(RaceCard!Z11=\"\",\"\",VALUE(RaceCard!Z11)))","v":""},{"$f":"IF(B13=\"\",\"\",IF(RaceCard!Q11=\"\",\"\",RaceCard!Q11))","v":""},{"$f":"IF(B13=\"\",\"\",IF(RaceCard!P11=\"\",\"\",RaceCard!P11))","v":""},{"$nulls":13},13,"03:10 PM-IPSWICH-03",{"$f":"IF(RaceCard!AY14=\"\",\"\",RaceCard!AY14)","v":"15:10:00"},{"$f":"IF(RaceCard!AZ14=\"\",\"\",RaceCard!AZ14)","v":"IPSWICH"},{"$f":"IF(RaceCard!BA14=\"\",\"\",RaceCard!BA14)","v":"03"},{"$f":"IF(RaceCard!BB14=\"\",\"\",RaceCard!BB14)","v":"TERRY NEALE MEM CL2 HCP"},{"$f":"IF(RaceCard!BC14=\"\",\"\",RaceCard!BC14)","v":"UNKNOWN"},{"$f":"IF(AI13=\"\",\"\",IF(ISERROR(VLOOKUP(AI13,RaceCard!$AD$2:$AF$48,2,FALSE)),\"X\",VLOOKUP(AI13,RaceCard!$AD$2:$AF$48,3,FALSE)))","v":"BR"},"BR-03"]
[null,{"$f":"IF(OR(RaceCard!$V12=0,RaceCard!$V12=\"\",RaceCard!$V12>1000),\"\",RaceCard!M12)","v":""},{"$f":"IF(B14=\"\",\"\",RaceCard!N12)","v":""},{"$f":"IF(B14=\"\",\"\",RaceCard!V12)","v":""},{"$f":"IF(B14=\"\",\"\",RaceCard!W12)","v":""},{"$f":"IF(B14=\"\",\"\",RaceCard!U12)","v":""},"",{"$f":"IF(B14=\"\",\"\",RaceCard!O12)","v":""},{"$f":"IF(B14=\"\",\"\",IF($B14=RaceCard!$B$13,1,IF($B14=RaceCard!$C$13,2,IF($B14=RaceCard!$D$13,3,IF($B14=RaceCard!$E$13,4,\"\")))))","v":""},{"$f":"IF($B14=\"\",\"\",IF($B14=RaceCard!$B$14,1,IF($B14=RaceCard!$C$14,2,IF($B14=RaceCard!$D$14,3,IF($B14=RaceCard!$E$14,4,\"\")))))","v":""},{"$f":"IF(B14=\"\",\"\",RaceCard!T12)","v":""},{"$f":"IF(B14=\"\",\"\",IF($B14=RaceCard!$B$12,1,\"\"))","v":""},{"$f":"IF(B14=\"\",\"\",IF(RaceCard!S12=\"\",\"\",RaceCard!S12))","v":""},{"$f":"IF(B14=\"\",\"\",IF(RaceCard!X12=\"\",\"\",VALUE(RaceCard!X12)))","v":""},{"$f":"IF(B14=\"\",\"\",IF(RaceCard!Y12=\"\",\"\",VALUE(RaceCard!Y12)))","v":""},{"$f":"IF(B14=\"\",\"\",IF(RaceCard!Z12=\"\",\"\",VALUE(RaceCard!Z12)))","v":""},{"$f":"IF(B14=\"\",\"\",IF(RaceCard!Q12=\"\",\"\",RaceCard!Q12))","v":""},{"$f":"IF(B14=\"\",\"\",IF(RaceCard!P12=\"\",\"\",RaceCard!P12))","v":""},{"$nulls":13},14,"03:20 PM-MORNINGTON-05",{"$f":"IF(RaceCard!AY15=\"\",\"\",RaceCard!AY15)","v":"15:20:00"},{"$f":"IF(RaceCard!AZ15=\"\",\"\",RaceCard!AZ15)","v":"MORNINGTON"},{"$f":"IF(RaceCard!BA15=\"\",\"\",RaceCard!BA15)","v":"05"},{"$f":"IF(RaceCard!BB15=\"\",\"\",RaceCard!BB15)","v":"LAND ENGINEERING TOUR VIC 0-68"},{"$f":"IF(RaceCard!BC15=\"\",\"\",RaceCard!BC15)","v":"RB68"},{"$f":"IF(AI14=\"\",\"\",IF(ISERROR(VLOOKUP(AI14,RaceCard!$AD$2:$AF$48,2,FALSE)),\"X\",VLOOKUP(AI14,RaceCard!$AD$2:$AF$48,3,FALSE)))","v":"VR"},"VR-05"]
[null,{"$f":"IF(OR(RaceCard!$V13=0,RaceCard!$V13=\"\",RaceCard!$V13>1000),\"\",RaceCard!M13)","v":""},{"$f":"IF(B15=\"\",\"\",RaceCard!N13)","v":""},{"$f":"IF(B15=\"\",\"\",RaceCard!V13)","v":""},{"$f":"IF(B15=\"\",\"\",RaceCard!W13)","v":""},{"$f":"IF(B15=\"\",\"\",RaceCard!U13)","v":""},"",{"$f":"IF(B15=\"\",\"\",RaceCard!O13)","v":""},{"$f":"IF(B15=\"\",\"\",IF($B15=RaceCard!$B$13,1,IF($B15=RaceCard!$C$13,2,IF($B15=RaceCard!$D$13,3,IF($B15=RaceCard!$E$13,4,\"\")))))","v":""},{"$f":"IF($B15=\"\",\"\",IF($B15=RaceCard!$B$14,1,IF($B15=RaceCard!$C$14,2,IF($B15=RaceCard!$D$14,3,IF($B15=RaceCard!$E$14,4,\"\")))))","v":""},{"$f":"IF(B15=\"\",\"\",RaceCard!T13)","v":""},{"$f":"IF(B15=\"\",\"\",IF($B15=RaceCard!$B$12,1,\"\"))","v":""},{"$f":"IF(B15=\"\",\"\",IF(RaceCard!S13=\"\",\"\",RaceCard!S13))","v":""},{"$f":"IF(B15=\"\",\"\",IF(RaceCard!X13=\"\",\"\",VALUE(RaceCard!X13)))","v":""},{"$f":"IF(B15=\"\",\"\",IF(RaceCard!Y13=\"\",\"\",VALUE(RaceCard!Y13)))","v":""},{"$f":"IF(B15=\"\",\"\",IF(RaceCard!Z13=\"\",\"\",VALUE(RaceCard!Z13)))","v":""},{"$f":"IF(B15=\"\",\"\",IF(RaceCard!Q13=\"\",\"\",RaceCard!Q13))","v":""},{"$f":"IF(B15=\"\",\"\",IF(RaceCard!P13=\"\",\"\",RaceCard!P13))","v":""},{"$nulls":13},15,"03:30 PM-CANBERRA-05",{"$f":"IF(RaceCard!AY16=\"\",\"\",RaceCard!AY16)","v":"15:30:00"},{"$f":"IF(RaceCard!AZ16=\"\",\"\",RaceCard!AZ16)","v":"CANBERRA"},{"$f":"IF(RaceCard!BA16=\"\",\"\",RaceCard!BA16)","v":"05"},{"$f":"IF(RaceCard!BB16=\"\",\"\",RaceCard!BB16)","v":"RICHARD KEELEY LUTON BM 65 HCP"},{"$f":"IF(RaceCard!BC16=\"\",\"\",RaceCard!BC16)","v":"BM65"},{"$f":"IF(AI15=\"\",\"\",IF(ISERROR(VLOOKUP(AI15,RaceCard!$AD$2:$AF$48,2,FALSE)),\"X\",VLOOKUP(AI15,RaceCard!$AD$2:$AF$48,3,FALSE)))","v":"CR"},"CR-05"]
[null,{"$f":"IF(OR(RaceCard!$V14=0,RaceCard!$V14=\"\",RaceCard!$V14>1000),\"\",RaceCard!M14)","v":""},{"$f":"IF(B16=\"\",\"\",RaceCard!N14)","v":""},{"$f":"IF(B16=\"\",\"\",RaceCard!V14)","v":""},{"$f":"IF(B16=\"\",\"\",RaceCard!W14)","v":""},{"$f":"IF(B16=\"\",\"\",RaceCard!U14)","v":""},"",{"$f":"IF(B16=\"\",\"\",RaceCard!O14)","v":""},{"$f":"IF(B16=\"\",\"\",IF($B16=RaceCard!$B$13,1,IF($B16=RaceCard!$C$13,2,IF($B16=RaceCard!$D$13,3,IF($B16=RaceCard!$E$13,4,\"\")))))","v":""},{"$f":"IF($B16=\"\",\"\",IF($B16=RaceCard!$B$14,1,IF($B16=RaceCard!$C$14,2,IF($B16=RaceCard!$D$14,3,IF($B16=RaceCard!$E$14,4,\"\")))))","v":""},{"$f":"IF(B16=\"\",\"\",RaceCard!T14)","v":""},{"$f":"IF(B16=\"\",\"\",IF($B16=RaceCard!$B$12,1,\"\"))","v":""},{"$f":"IF(B16=\"\",\"\",IF(RaceCard!S14=\"\",\"\",RaceCard!S14))","v":""},{"$f":"IF(B16=\"\",\"\",IF(RaceCard!X14=\"\",\"\",VALUE(RaceCard!X14)))","v":""},{"$f":"IF(B16=\"\",\"\",IF(RaceCard!Y14=\"\",\"\",VALUE(RaceCard!Y14)))","v":""},{"$f":"IF(B16=\"\",\"\",IF(RaceCard!Z14=\"\",\"\",VALUE(RaceCard!Z14)))","v":""},{"$f":"IF(B16=\"\",\"\",IF(RaceCard!Q14=\"\",\"\",RaceCard!Q14))","v":""},{"$f":"IF(B16=\"\",\"\",IF(RaceCard!P14=\"\",\"\",RaceCard!P14))","v":""},{"$nulls":13},16,"03:40 PM-ARMIDALE-03",{"$f":"IF(RaceCard!AY17=\"\",\"\",RaceCard!AY17)","v":"15:40:00"},{"$f":"IF(RaceCard!AZ17=\"\",\"\",RaceCard!AZ17)","v":"ARMIDALE"},{"$f":"IF(RaceCard!BA17=\"\",\"\",RaceCard!BA17)","v":"03"},{"$f":"IF(RaceCard!BB17=\"\",\"\",RaceCard!BB17)","v":"SCHWEPPES MDN PLT"},{"$f":"IF(RaceCard!BC17=\"\",\"\",RaceCard!BC17)","v":"MDN"},{"$f":"IF(AI16=\"\",\"\",IF(ISERROR(VLOOKUP(AI16,RaceCard!$AD$2:$AF$48,2,FALSE)),\"X\",VLOOKUP(AI16,RaceCard!$AD$2:$AF$48,3,FALSE)))","v":"NR"},"NR-03"]
[null,{"$f":"IF(OR(RaceCard!$V15=0,RaceCard!$V15=\"\",RaceCard!$V15>1000),\"\",RaceCard!M15)","v":""},{"$f":"IF(B17=\"\",\"\",RaceCard!N15)","v":""},{"$f":"IF(B17=\"\",\"\",RaceCard!V15)","v":""},{"$f":"IF(B17=\"\",\"\",RaceCard!W15)","v":""},{"$f":"IF(B17=\"\",\"\",RaceCard!U15)","v":""},"",{"$f":"IF(B17=\"\",\"\",RaceCard!O15)","v":""},{"$f":"IF(B17=\"\",\"\",IF($B17=RaceCard!$B$13,1,IF($B17=RaceCard!$C$13,2,IF($B17=RaceCard!$D$13,3,IF($B17=RaceCard!$E$13,4,\"\")))))","v":""},{"$f":"IF($B17=\"\",\"\",IF($B17=RaceCard!$B$14,1,IF($B17=RaceCard!$C$14,2,IF($B17=RaceCard!$D$14,3,IF($B17=RaceCard!$E$14,4,\"\")))))","v":""},{"$f":"IF(B17=\"\",\"\",RaceCard!T15)","v":""},{"$f":"IF(B17=\"\",\"\",IF($B17=RaceCard!$B$12,1,\"\"))","v":""},{"$f":"IF(B17=\"\",\"\",IF(RaceCard!S15=\"\",\"\",RaceCard!S15))","v":""},{"$f":"IF(B17=\"\",\"\",IF(RaceCard!X15=\"\",\"\",VALUE(RaceCard!X15)))","v":""},{"$f":"IF(B17=\"\",\"\",IF(RaceCard!Y15=\"\",\"\",VALUE(RaceCard!Y15)))","v":""},{"$f":"IF(B17=\"\",\"\",IF(RaceCard!Z15=\"\",\"\",VALUE(RaceCard!Z15)))","v":""},{"$f":"IF(B17=\"\",\"\",IF(RaceCard!Q15=\"\",\"\",RaceCard!Q15))","v":""},{"$f":"IF(B17=\"\",\"\",IF(RaceCard!P15=\"\",\"\",RaceCard!P15))","v":""},{"$nulls":13},17,"03:50 PM-IPSWICH-04",{"$f":"IF(RaceCard!AY18=\"\",\"\",RaceCard!AY18)","v":"15:50:00"},{"$f":"IF(RaceCard!AZ18=\"\",\"\",RaceCard!AZ18)","v":"IPSWICH"},{"$f":"IF(RaceCard!BA18=\"\",\"\",RaceCard!BA18)","v":"04"},{"$f":"IF(RaceCard!BB18=\"\",\"\",RaceCard!BB18)","v":"COL BAYLISS MEM F&M MDN HCP"},{"$f":"IF(RaceCard!BC18=\"\",\"\",RaceCard!BC18)","v":"UNKNOWN"},{"$f":"IF(AI17=\"\",\"\",IF(ISERROR(VLOOKUP(AI17,RaceCard!$AD$2:$AF$48,2,FALSE)),\"X\",VLOOKUP(AI17,RaceCard!$AD$2:$AF$48,3,FALSE)))","v":"BR"},"BR-04"]
[null,{"$f":"IF(OR(RaceCard!$V16=0,RaceCard!$V16=\"\",RaceCard!$V16>1000),\"\",RaceCard!M16)","v":""},{"$f":"IF(B18=\"\",\"\",RaceCard!N16)","v":""},{"$f":"IF(B18=\"\",\"\",RaceCard!V16)","v":""},{"$f":"IF(B18=\"\",\"\",RaceCard!W16)","v":""},{"$f":"IF(B18=\"\",\"\",RaceCard!U16)","v":""},"",{"$f":"IF(B18=\"\",\"\",RaceCard!O16)","v":""},{"$f":"IF(B18=\"\",\"\",IF($B18=RaceCard!$B$13,1,IF($B18=RaceCard!$C$13,2,IF($B18=RaceCard!$D$13,3,IF($B18=RaceCard!$E$13,4,\"\")))))","v":""},{"$f":"IF($B18=\"\",\"\",IF($B18=RaceCard!$B$14,1,IF($B18=RaceCard!$C$14,2,IF($B18=RaceCard!$D$14,3,IF($B18=RaceCard!$E$14,4,\"\")))))","v":""},{"$f":"IF(B18=\"\",\"\",RaceCard!T16)","v":""},{"$f":"IF(B18=\"\",\"\",IF($B18=RaceCard!$B$12,1,\"\"))","v":""},{"$f":"IF(B18=\"\",\"\",IF(RaceCard!S16=\"\",\"\",RaceCard!S16))","v":""},{"$f":"IF(B18=\"\",\"\",IF(RaceCard!X16=\"\",\"\",VALUE(RaceCard!X16)))","v":""},{"$f":"IF(B18=\"\",\"\",IF(RaceCard!Y16=\"\",\"\",VALUE(RaceCard!Y16)))","v":""},{"$f":"IF(B18=\"\",\"\",IF(RaceCard!Z16=\"\",\"\",VALUE(RaceCard!Z16)))","v":""},{"$f":"IF(B18=\"\",\"\",IF(RaceCard!Q16=\"\",\"\",RaceCard!Q16))","v":""},{"$f":"IF(B18=\"\",\"\",IF(RaceCard!P16=\"\",\"\",RaceCard!P16))","v":""},{"$nulls":13},18,"04:00 PM-MORNINGTON-06",{"$f":"IF(RaceCard!AY19=\"\",\"\",RaceCard!AY19)","v":"16:00:00"},{"$f":"IF(RaceCard!AZ19=\"\",\"\",RaceCard!AZ19)","v":"MORNINGTON"},{"$f":"IF(RaceCard!BA19=\"\",\"\",RaceCard!BA19)","v":"06"},{"$f":"IF(RaceCard!BB19=\"\",\"\",RaceCard!BB19)","v":"MITAVITE SUMMER CHALL. HT6 0-72"},{"$f":"IF(RaceCard!BC19=\"\",\"\",RaceCard!BC19)","v":"RB72"},{"$f":"IF(AI18=\"\",\"\",IF(ISERROR(VLOOKUP(AI18,RaceCard!$AD$2:$AF$48,2,FALSE)),\"X\",VLOOKUP(AI18,RaceCard!$AD$2:$AF$48,3,FALSE)))","v":"VR"},"VR-06"]
[null,{"$f":"IF(OR(RaceCard!$V17=0,RaceCard!$V17=\"\",RaceCard!$V17>1000),\"\",RaceCard!M17)","v":""},{"$f":"IF(B19=\"\",\"\",RaceCard!N17)","v":""},{"$f":"IF(B19=\"\",\"\",RaceCard!V17)","v":""},{"$f":"IF(B19=\"\",\"\",RaceCard!W17)","v":""},{"$f":"IF(B19=\"\",\"\",RaceCard!U17)","v":""},"",{"$f":"IF(B19=\"\",\"\",RaceCard!O17)","v":""},{"$f":"IF(B19=\"\",\"\",IF($B19=RaceCard!$B$13,1,IF($B19=RaceCard!$C$13,2,IF($B19=RaceCard!$D$13,3,IF($B19=RaceCard!$E$13,4,\"\")))))","v":""},{"$f":"IF($B19=\"\",\"\",IF($B19=RaceCard!$B$14,1,IF($B19=RaceCard!$C$14,2,IF($B19=RaceCard!$D$14,3,IF($B19=RaceCard!$E$14,4,\"\")))))","v":""},{"$f":"IF(B19=\"\",\"\",RaceCard!T17)","v":""},{"$f":"IF(B19=\"\",\"\",IF($B19=RaceCard!$B$12,1,\"\"))","v":""},{"$f":"IF(B19=\"\",\"\",IF(RaceCard!S17=\"\",\"\",RaceCard!S17))","v":""},{"$f":"IF(B19=\"\",\"\",IF(RaceCard!X17=\"\",\"\",VALUE(RaceCard!X17)))","v":""},{"$f":"IF(B19=\"\",\"\",IF(RaceCard!Y17=\"\",\"\",VALUE(RaceCard!Y17)))","v":""},{"$f":"IF(B19=\"\",\"\",IF(RaceCard!Z17=\"\",\"\",VALUE(RaceCard!Z17)))","v":""},{"$f":"IF(B19=\"\",\"\",IF(RaceCard!Q17=\"\",\"\",RaceCard!Q17))","v":""},{"$f":"IF(B19=\"\",\"\",IF(RaceCard!P17=\"\",\"\",RaceCard!P17))","v":""},{"$nulls":13},19,"04:10 PM-CANBERRA-06",{"$f":"IF(RaceCard!AY20=\"\",\"\",RaceCard!AY20)","v":"16:10:00"},{"$f":"IF(RaceCard!AZ20=\"\",\"\",RaceCard!AZ20)","v":"CANBERRA"},{"$f":"IF(RaceCard!BA20=\"\",\"\",RaceCard!BA20)","v":"06"},{"$f":"IF(RaceCard!BB20=\"\",\"\",RaceCard!BB20)","v":"DUB DESIGN CL1 HCP"},{"$f":"IF(RaceCard!BC20=\"\",\"\",RaceCard!BC20)","v":"CL1"},{"$f":"IF(AI19=\"\",\"\",IF(ISERROR(VLOOKUP(AI19,RaceCard!$AD$2:$AF$48,2,FALSE)),\"X\",VLOOKUP(AI19,RaceCard!$AD$2:$AF$48,3,FALSE)))","v":"CR"},"CR-06"]
[null,{"$f":"IF(OR(RaceCard!$V18=0,RaceCard!$V18=\"\",RaceCard!$V18>1000),\"\",RaceCard!M18)","v":""},{"$f":"IF(B20=\"\",\"\",RaceCard!N18)","v":""},{"$f":"IF(B20=\"\",\"\",RaceCard!V18)","v":""},{"$f":"IF(B20=\"\",\"\",RaceCard!W18)","v":""},{"$f":"IF(B20=\"\",\"\",RaceCard!U18)","v":""},"",{"$f":"IF(B20=\"\",\"\",RaceCard!O18)","v":""},{"$f":"IF(B20=\"\",\"\",IF($B20=RaceCard!$B$13,1,IF($B20=RaceCard!$C$13,2,IF($B20=RaceCard!$D$13,3,IF($B20=RaceCard!$E$13,4,\"\")))))","v":""},{"$f":"IF($B20=\"\",\"\",IF($B20=RaceCard!$B$14,1,IF($B20=RaceCard!$C$14,2,IF($B20=RaceCard!$D$14,3,IF($B20=RaceCard!$E$14,4,\"\")))))","v":""},{"$f":"IF(B20=\"\",\"\",RaceCard!T18)","v":""},{"$f":"IF(B20=\"\",\"\",IF($B20=RaceCard!$B$12,1,\"\"))","v":""},{"$f":"IF(B20=\"\",\"\",IF(RaceCard!S18=\"\",\"\",RaceCard!S18))","v":""},{"$f":"IF(B20=\"\",\"\",IF(RaceCard!X18=\"\",\"\",VALUE(RaceCard!X18)))","v":""},{"$f":"IF(B20=\"\",\"\",IF(RaceCard!Y18=\"\",\"\",VALUE(RaceCard!Y18)))","v":""},{"$f":"IF(B20=\"\",\"\",IF(RaceCard!Z18=\"\",\"\",VALUE(RaceCard!Z18)))","v":""},{"$f":"IF(B20=\"\",\"\",IF(RaceCard!Q18=\"\",\"\",RaceCard!Q18))","v":""},{"$f":"IF(B20=\"\",\"\",IF(RaceCard!P18=\"\",\"\",RaceCard!P18))","v":""},{"$nulls":13},20,"04:20 PM-ARMIDALE-04",{"$f":"IF(RaceCard!AY21=\"\",\"\",RaceCard!AY21)","v":"16:20:00"},{"$f":"IF(RaceCard!AZ21=\"\",\"\",RaceCard!AZ21)","v":"ARMIDALE"},{"$f":"IF(RaceCard!BA21=\"\",\"\",RaceCard!BA21)","v":"04"},{"$f":"IF(RaceCard!BB21=\"\",\"\",RaceCard!BB21)","v":"HAHN SUPER DRY CL1 HCP"},{"$f":"IF(RaceCard!BC21=\"\",\"\",RaceCard!BC21)","v":"CL1"},{"$f":"IF(AI20=\"\",\"\",IF(ISERROR(VLOOKUP(AI20,RaceCard!$AD$2:$AF$48,2,FALSE)),\"X\",VLOOKUP(AI20,RaceCard!$AD$2:$AF$48,3,FALSE)))","v":"NR"},"NR-04"]
[null,{"$f":"IF(OR(RaceCard!$V19=0,RaceCard!$V19=\"\",RaceCard!$V19>1000),\"\",RaceCard!M19)","v":""},{"$f":"IF(B21=\"\",\"\",RaceCard!N19)","v":""},{"$f":"IF(B21=\"\",\"\",RaceCard!V19)","v":""},{"$f":"IF(B21=\"\",\"\",RaceCard!W19)","v":""},{"$f":"IF(B21=\"\",\"\",RaceCard!U19)","v":""},"",{"$f":"IF(B21=\"\",\"\",RaceCard!O19)","v":""},{"$f":"IF(B21=\"\",\"\",IF($B21=RaceCard!$B$13,1,IF($B21=RaceCard!$C$13,2,IF($B21=RaceCard!$D$13,3,IF($B21=RaceCard!$E$13,4,\"\")))))","v":""},{"$f":"IF($B21=\"\",\"\",IF($B21=RaceCard!$B$14,1,IF($B21=RaceCard!$C$14,2,IF($B21=RaceCard!$D$14,3,IF($B21=RaceCard!$E$14,4,\"\")))))","v":""},{"$f":"IF(B21=\"\",\"\",RaceCard!T19)","v":""},{"$f":"IF(B21=\"\",\"\",IF($B21=RaceCard!$B$12,1,\"\"))","v":""},{"$f":"IF(B21=\"\",\"\",IF(RaceCard!S19=\"\",\"\",RaceCard!S19))","v":""},{"$f":"IF(B21=\"\",\"\",IF(RaceCard!X19=\"\",\"\",VALUE(RaceCard!X19)))","v":""},{"$f":"IF(B21=\"\",\"\",IF(RaceCard!Y19=\"\",\"\",VALUE(RaceCard!Y19)))","v":""},{"$f":"IF(B21=\"\",\"\",IF(RaceCard!Z19=\"\",\"\",VALUE(RaceCard!Z19)))","v":""},{"$f":"IF(B21=\"\",\"\",IF(RaceCard!Q19=\"\",\"\",RaceCard!Q19))","v":""},{"$f":"IF(B21=\"\",\"\",IF(RaceCard!P19=\"\",\"\",RaceCard!P19))","v":""},{"$nulls":13},21,"04:30 PM-IPSWICH-05",{"$f":"IF(RaceCard!AY22=\"\",\"\",RaceCard!AY22)","v":"16:30:00"},{"$f":"IF(RaceCard!AZ22=\"\",\"\",RaceCard!AZ22)","v":"IPSWICH"},{"$f":"IF(RaceCard!BA22=\"\",\"\",RaceCard!BA22)","v":"05"},{"$f":"IF(RaceCard!BB22=\"\",\"\",RaceCard!BB22)","v":"MAX STANDFIELD MEM C,G&E MDN HCP"},{"$f":"IF(RaceCard!BC22=\"\",\"\",RaceCard!BC22)","v":"UNKNOWN"},{"$f":"IF(AI21=\"\",\"\",IF(ISERROR(VLOOKUP(AI21,RaceCard!$AD$2:$AF$48,2,FALSE)),\"X\",VLOOKUP(AI21,RaceCard!$AD$2:$AF$48,3,FALSE)))","v":"BR"},"BR-05"]
[null,{"$f":"IF(OR(RaceCard!$V20=0,RaceCard!$V20=\"\",RaceCard!$V20>1000),\"\",RaceCard!M20)","v":""},{"$f":"IF(B22=\"\",\"\",RaceCard!N20)","v":""},{"$f":"IF(B22=\"\",\"\",RaceCard!V20)","v":""},{"$f":"IF(B22=\"\",\"\",RaceCard!W20)","v":""},{"$f":"IF(B22=\"\",\"\",RaceCard!U20)","v":""},"",{"$f":"IF(B22=\"\",\"\",RaceCard!O20)","v":""},{"$f":"IF(B22=\"\",\"\",IF($B22=RaceCard!$B$13,1,IF($B22=RaceCard!$C$13,2,IF($B22=RaceCard!$D$13,3,IF($B22=RaceCard!$E$13,4,\"\")))))","v":""},{"$f":"IF($B22=\"\",\"\",IF($B22=RaceCard!$B$14,1,IF($B22=RaceCard!$C$14,2,IF($B22=RaceCard!$D$14,3,IF($B22=RaceCard!$E$14,4,\"\")))))","v":""},{"$f":"IF(B22=\"\",\"\",RaceCard!T20)","v":""},{"$f":"IF(B22=\"\",\"\",IF($B22=RaceCard!$B$12,1,\"\"))","v":""},{"$f":"IF(B22=\"\",\"\",IF(RaceCard!S20=\"\",\"\",RaceCard!S20))","v":""},{"$f":"IF(B22=\"\",\"\",IF(RaceCard!X20=\"\",\"\",VALUE(RaceCard!X20)))","v":""},{"$f":"IF(B22=\"\",\"\",IF(RaceCard!Y20=\"\",\"\",VALUE(RaceCard!Y20)))","v":""},{"$f":"IF(B22=\"\",\"\",IF(RaceCard!Z20=\"\",\"\",VALUE(RaceCard!Z20)))","v":""},{"$f":"IF(B22=\"\",\"\",IF(RaceCard!Q20=\"\",\"\",RaceCard!Q20))","v":""},{"$f":"IF(B22=\"\",\"\",IF(RaceCard!P20=\"\",\"\",RaceCard!P20))","v":""},{"$nulls":13},22,"04:40 PM-MORNINGTON-07",{"$f":"IF(RaceCard!AY23=\"\",\"\",RaceCard!AY23)","v":"16:40:00"},{"$f":"IF(RaceCard!AZ23=\"\",\"\",RaceCard!AZ23)","v":"MORNINGTON"},{"$f":"IF(RaceCard!BA23=\"\",\"\",RaceCard!BA23)","v":"07"},{"$f":"IF(RaceCard!BB23=\"\",\"\",RaceCard!BB23)","v":"BELMARK MORNINGTON 0-58 HCP"},{"$f":"IF(RaceCard!BC23=\"\",\"\",RaceCard!BC23)","v":"RB58"},{"$f":"IF(AI22=\"\",\"\",IF(ISERROR(VLOOKUP(AI22,RaceCard!$AD$2:$AF$48,2,FALSE)),\"X\",VLOOKUP(AI22,RaceCard!$AD$2:$AF$48,3,FALSE)))","v":"VR"},"VR-07"]
[null,{"$f":"IF(OR(RaceCard!$V21=0,RaceCard!$V21=\"\",RaceCard!$V21>1000),\"\",RaceCard!M21)","v":""},{"$f":"IF(B23=\"\",\"\",RaceCard!N21)","v":""},{"$f":"IF(B23=\"\",\"\",RaceCard!V21)","v":""},{"$f":"IF(B23=\"\",\"\",RaceCard!W21)","v":""},{"$f":"IF(B23=\"\",\"\",RaceCard!U21)","v":""},"",{"$f":"IF(B23=\"\",\"\",RaceCard!O21)","v":""},{"$f":"IF(B23=\"\",\"\",IF($B23=RaceCard!$B$13,1,IF($B23=RaceCard!$C$13,2,IF($B23=RaceCard!$D$13,3,IF($B23=RaceCard!$E$13,4,\"\")))))","v":""},{"$f":"IF($B23=\"\",\"\",IF($B23=RaceCard!$B$14,1,IF($B23=RaceCard!$C$14,2,IF($B23=RaceCard!$D$14,3,IF($B23=RaceCard!$E$14,4,\"\")))))","v":""},{"$f":"IF(B23=\"\",\"\",RaceCard!T21)","v":""},{"$f":"IF(B23=\"\",\"\",IF($B23=RaceCard!$B$12,1,\"\"))","v":""},{"$f":"IF(B23=\"\",\"\",IF(RaceCard!S21=\"\",\"\",RaceCard!S21))","v":""},{"$f":"IF(B23=\"\",\"\",IF(RaceCard!X21=\"\",\"\",VALUE(RaceCard!X21)))","v":""},{"$f":"IF(B23=\"\",\"\",IF(RaceCard!Y21=\"\",\"\",VALUE(RaceCard!Y21)))","v":""},{"$f":"IF(B23=\"\",\"\",IF(RaceCard!Z21=\"\",\"\",VALUE(RaceCard!Z21)))","v":""},{"$f":"IF(B23=\"\",\"\",IF(RaceCard!Q21=\"\",\"\",RaceCard!Q21))","v":""},{"$f":"IF(B23=\"\",\"\",IF(RaceCard!P21=\"\",\"\",RaceCard!P21))","v":""},{"$nulls":13},23,"04:50 PM-CANBERRA-07",{"$f":"IF(RaceCard!AY24=\"\",\"\",RaceCard!AY24)","v":"16:50:00"},{"$f":"IF(RaceCard!AZ24=\"\",\"\",RaceCard!AZ24)","v":"CANBERRA"},{"$f":"IF(RaceCard!BA24=\"\",\"\",RaceCard!BA24)","v":"07"},{"$f":"IF(RaceCard!BB24=\"\",\"\",RaceCard!BB24)","v":"UPTON & WIGGAN BM 55 HCP"},{"$f":"IF(RaceCard!BC24=\"\",\"\",RaceCard!BC24)","v":"BM55"},{"$f":"IF(AI23=\"\",\"\",IF(ISERROR(VLOOKUP(AI23,RaceCard!$AD$2:$AF$48,2,FALSE)),\"X\",VLOOKUP(AI23,RaceCard!$AD$2:$AF$48,3,FALSE)))","v":"CR"},{"$f":"IF(AG23=\"\",\"\",CONCATENATE(AM23,\"-\",TEXT(AJ23,\"00\")))","v":"CR-07"}]
[null,{"$f":"IF(OR(RaceCard!$V22=0,RaceCard!$V22=\"\",RaceCard!$V22>1000),\"\",RaceCard!M22)","v":""},{"$f":"IF(B24=\"\",\"\",RaceCard!N22)","v":""},{"$f":"IF(B24=\"\",\"\",RaceCard!V22)","v":""},{"$f":"IF(B24=\"\",\"\",RaceCard!W22)","v":""},{"$f":"IF(B24=\"\",\"\",RaceCard!U22)","v":""},"",{"$f":"IF(B24=\"\",\"\",RaceCard!O22)","v":""},{"$f":"IF(B24=\"\",\"\",IF($B24=RaceCard!$B$13,1,IF($B24=RaceCard!$C$13,2,IF($B24=RaceCard!$D$13,3,IF($B24=RaceCard!$E$13,4,\"\")))))","v":""},{"$f":"IF($B24=\"\",\"\",IF($B24=RaceCard!$B$14,1,IF($B24=RaceCard!$C$14,2,IF($B24=RaceCard!$D$14,3,IF($B24=RaceCard!$E$14,4,\"\")))))","v":""},{"$f":"IF(B24=\"\",\"\",RaceCard!T22)","v":""},{"$f":"IF(B24=\"\",\"\",IF($B24=RaceCard!$B$12,1,\"\"))","v":""},{"$f":"IF(B24=\"\",\"\",IF(RaceCard!S22=\"\",\"\",RaceCard!S22))","v":""},{"$f":"IF(B24=\"\",\"\",IF(RaceCard!X22=\"\",\"\",VALUE(RaceCard!X22)))","v":""},{"$f":"IF(B24=\"\",\"\",IF(RaceCard!Y22=\"\",\"\",VALUE(RaceCard!Y22)))","v":""},{"$f":"IF(B24=\"\",\"\",IF(RaceCard!Z22=\"\",\"\",VALUE(RaceCard!Z22)))","v":""},{"$f":"IF(B24=\"\",\"\",IF(RaceCard!Q22=\"\",\"\",RaceCard!Q22))","v":""},{"$f":"IF(B24=\"\",\"\",IF(RaceCard!P22=\"\",\"\",RaceCard!P22))","v":""},{"$nulls":13},24,"05:00 PM-ARMIDALE-05",{"$f":"IF(RaceCard!AY25=\"\",\"\",RaceCard!AY25)","v":"17:00:00"},{"$f":"IF(RaceCard!AZ25=\"\",\"\",RaceCard!AZ25)","v":"ARMIDALE"},{"$f":"IF(RaceCard!BA25=\"\",\"\",RaceCard!BA25)","v":"05"},{"$f":"IF(RaceCard!BB25=\"\",\"\",RaceCard!BB25)","v":"XXXX GOLD BM 56 HCP"},{"$f":"IF(RaceCard!BC25=\"\",\"\",RaceCard!BC25)","v":"BM56"},{"$f":"IF(AI24=\"\",\"\",IF(ISERROR(VLOOKUP(AI24,RaceCard!$AD$2:$AF$48,2,FALSE)),\"X\",VLOOKUP(AI24,RaceCard!$AD$2:$AF$48,3,FALSE)))","v":"NR"},{"$f":"IF(AG24=\"\",\"\",CONCATENATE(AM24,\"-\",TEXT(AJ24,\"00\")))","v":"NR-05"}]
[null,{"$f":"IF(OR(RaceCard!$V23=0,RaceCard!$V23=\"\",RaceCard!$V23>1000),\"\",RaceCard!M23)","v":""},{"$f":"IF(B25=\"\",\"\",RaceCard!N23)","v":""},{"$f":"IF(B25=\"\",\"\",RaceCard!V23)","v":""},{"$f":"IF(B25=\"\",\"\",RaceCard!W23)","v":""},{"$f":"IF(B25=\"\",\"\",RaceCard!U23)","v":""},"",{"$f":"IF(B25=\"\",\"\",RaceCard!O23)","v":""},{"$f":"IF(B25=\"\",\"\",IF($B25=RaceCard!$B$13,1,IF($B25=RaceCard!$C$13,2,IF($B25=RaceCard!$D$13,3,IF($B25=RaceCard!$E$13,4,\"\")))))","v":""},{"$f":"IF($B25=\"\",\"\",IF($B25=RaceCard!$B$14,1,IF($B25=RaceCard!$C$14,2,IF($B25=RaceCard!$D$14,3,IF($B25=RaceCard!$E$14,4,\"\")))))","v":""},{"$f":"IF(B25=\"\",\"\",RaceCard!T23)","v":""},{"$f":"IF(B25=\"\",\"\",IF($B25=RaceCard!$B$12,1,\"\"))","v":""},{"$f":"IF(B25=\"\",\"\",IF(RaceCard!S23=\"\",\"\",RaceCard!S23))","v":""},{"$f":"IF(B25=\"\",\"\",IF(RaceCard!X23=\"\",\"\",VALUE(RaceCard!X23)))","v":""},{"$f":"IF(B25=\"\",\"\",IF(RaceCard!Y23=\"\",\"\",VALUE(RaceCard!Y23)))","v":""},{"$f":"IF(B25=\"\",\"\",IF(RaceCard!Z23=\"\",\"\",VALUE(RaceCard!Z23)))","v":""},{"$f":"IF(B25=\"\",\"\",IF(RaceCard!Q23=\"\",\"\",RaceCard!Q23))","v":""},{"$f":"IF(B25=\"\",\"\",IF(RaceCard!P23=\"\",\"\",RaceCard!P23))","v":""},{"$nulls":13},25,"05:10 PM-IPSWICH-06",{"$f":"IF(RaceCard!AY26=\"\",\"\",RaceCard!AY26)","v":"17:10:00"},{"$f":"IF(RaceCard!AZ26=\"\",\"\",RaceCard!AZ26)","v":"IPSWICH"},{"$f":"IF(RaceCard!BA26=\"\",\"\",RaceCard!BA26)","v":"06"},{"$f":"IF(RaceCard!BB26=\"\",\"\",RaceCard!BB26)","v":"DR MERVYN FISH MEM CL1 HCP"},{"$f":"IF(RaceCard!BC26=\"\",\"\",RaceCard!BC26)","v":"UNKNOWN"},{"$f":"IF(AI25=\"\",\"\",IF(ISERROR(VLOOKUP(AI25,RaceCard!$AD$2:$AF$48,2,FALSE)),\"X\",VLOOKUP(AI25,RaceCard!$AD$2:$AF$48,3,FALSE)))","v":"BR"},"BR-06"]
[null,{"$f":"IF(OR(RaceCard!$V24=0,RaceCard!$V24=\"\",RaceCard!$V24>1000),\"\",RaceCard!M24)","v":""},{"$f":"IF(B26=\"\",\"\",RaceCard!N24)","v":""},{"$f":"IF(B26=\"\",\"\",RaceCard!V24)","v":""},{"$f":"IF(B26=\"\",\"\",RaceCard!W24)","v":""},{"$f":"IF(B26=\"\",\"\",RaceCard!U24)","v":""},"",{"$f":"IF(B26=\"\",\"\",RaceCard!O24)","v":""},{"$f":"IF(B26=\"\",\"\",IF($B26=RaceCard!$B$13,1,IF($B26=RaceCard!$C$13,2,IF($B26=RaceCard!$D$13,3,IF($B26=RaceCard!$E$13,4,\"\")))))","v":""},{"$f":"IF($B26=\"\",\"\",IF($B26=RaceCard!$B$14,1,IF($B26=RaceCard!$C$14,2,IF($B26=RaceCard!$D$14,3,IF($B26=RaceCard!$E$14,4,\"\")))))","v":""},{"$f":"IF(B26=\"\",\"\",RaceCard!T24)","v":""},{"$f":"IF(B26=\"\",\"\",IF($B26=RaceCard!$B$12,1,\"\"))","v":""},{"$f":"IF(B26=\"\",\"\",IF(RaceCard!S24=\"\",\"\",RaceCard!S24))","v":""},{"$f":"IF(B26=\"\",\"\",IF(RaceCard!X24=\"\",\"\",VALUE(RaceCard!X24)))","v":""},{"$f":"IF(B26=\"\",\"\",IF(RaceCard!Y24=\"\",\"\",VALUE(RaceCard!Y24)))","v":""},{"$f":"IF(B26=\"\",\"\",IF(RaceCard!Z24=\"\",\"\",VALUE(RaceCard!Z24)))","v":""},{"$f":"IF(B26=\"\",\"\",IF(RaceCard!Q24=\"\",\"\",RaceCard!Q24))","v":""},{"$f":"IF(B26=\"\",\"\",IF(RaceCard!P24=\"\",\"\",RaceCard!P24))","v":""},{"$nulls":13},26,"05:20 PM-MORNINGTON-08",{"$f":"IF(RaceCard!AY27=\"\",\"\",RaceCard!AY27)","v":"17:20:00"},{"$f":"IF(RaceCard!AZ27=\"\",\"\",RaceCard!AZ27)","v":"MORNINGTON"},{"$f":"IF(RaceCard!BA27=\"\",\"\",RaceCard!BA27)","v":"08"},{"$f":"IF(RaceCard!BB27=\"\",\"\",RaceCard!BB27)","v":"LAND ENGINEERING 0-58 HCP"},{"$f":"IF(RaceCard!BC27=\"\",\"\",RaceCard!BC27)","v":"RB58"},{"$f":"IF(AI26=\"\",\"\",IF(ISERROR(VLOOKUP(AI26,RaceCard!$AD$2:$AF$48,2,FALSE)),\"X\",VLOOKUP(AI26,RaceCard!$AD$2:$AF$48,3,FALSE)))","v":"VR"},"VR-08"]
[null,{"$f":"IF(OR(RaceCard!$V25=0,RaceCard!$V25=\"\",RaceCard!$V25>1000),\"\",RaceCard!M25)","v":""},{"$f":"IF(B27=\"\",\"\",RaceCard!N25)","v":""},{"$f":"IF(B27=\"\",\"\",RaceCard!V25)","v":""},{"$f":"IF(B27=\"\",\"\",RaceCard!W25)","v":""},{"$f":"IF(B27=\"\",\"\",RaceCard!U25)","v":""},"",{"$f":"IF(B27=\"\",\"\",RaceCard!O25)","v":""},{"$f":"IF(B27=\"\",\"\",IF($B27=RaceCard!$B$13,1,IF($B27=RaceCard!$C$13,2,IF($B27=RaceCard!$D$13,3,IF($B27=RaceCard!$E$13,4,\"\")))))","v":""},{"$f":"IF($B27=\"\",\"\",IF($B27=RaceCard!$B$14,1,IF($B27=RaceCard!$C$14,2,IF($B27=RaceCard!$D$14,3,IF($B27=RaceCard!$E$14,4,\"\")))))","v":""},{"$f":"IF(B27=\"\",\"\",RaceCard!T25)","v":""},{"$f":"IF(B27=\"\",\"\",IF($B27=RaceCard!$B$12,1,\"\"))","v":""},{"$f":"IF(B27=\"\",\"\",IF(RaceCard!S25=\"\",\"\",RaceCard!S25))","v":""},{"$f":"IF(B27=\"\",\"\",IF(RaceCard!X25=\"\",\"\",VALUE(RaceCard!X25)))","v":""},{"$f":"IF(B27=\"\",\"\",IF(RaceCard!Y25=\"\",\"\",VALUE(RaceCard!Y25)))","v":""},{"$f":"IF(B27=\"\",\"\",IF(RaceCard!Z25=\"\",\"\",VALUE(RaceCard!Z25)))","v":""},{"$f":"IF(B27=\"\",\"\",IF(RaceCard!Q25=\"\",\"\",RaceCard!Q25))","v":""},{"$f":"IF(B27=\"\",\"\",IF(RaceCard!P25=\"\",\"\",RaceCard!P25))","v":""},{"$nulls":13},27,"05:30 PM-CANBERRA-08",{"$f":"IF(RaceCard!AY28=\"\",\"\",RaceCard!AY28)","v":"17:30:00"},{"$f":"IF(RaceCard!AZ28=\"\",\"\",RaceCard!AZ28)","v":"CANBERRA"},{"$f":"IF(RaceCard!BA28=\"\",\"\",RaceCard!BA28)","v":"08"},{"$f":"IF(RaceCard!BB28=\"\",\"\",RaceCard!BB28)","v":"CUSTOM SECURITY BM 65 HCP"},{"$f":"IF(RaceCard!BC28=\"\",\"\",RaceCard!BC28)","v":"BM65"},{"$f":"IF(AI27=\"\",\"\",IF(ISERROR(VLOOKUP(AI27,RaceCard!$AD$2:$AF$48,2,FALSE)),\"X\",VLOOKUP(AI27,RaceCard!$AD$2:$AF$48,3,FALSE)))","v":"CR"},"CR-08"]
[null,{"$f":"IF(OR(RaceCard!$V26=0,RaceCard!$V26=\"\",RaceCard!$V26>1000),\"\",RaceCard!M26)","v":""},{"$f":"IF(B28=\"\",\"\",RaceCard!N26)","v":""},{"$f":"IF(B28=\"\",\"\",RaceCard!V26)","v":""},{"$f":"IF(B28=\"\",\"\",RaceCard!W26)","v":""},{"$f":"IF(B28=\"\",\"\",RaceCard!U26)","v":""},"",{"$f":"IF(B28=\"\",\"\",RaceCard!O26)","v":""},{"$f":"IF(B28=\"\",\"\",IF($B28=RaceCard!$B$13,1,IF($B28=RaceCard!$C$13,2,IF($B28=RaceCard!$D$13,3,IF($B28=RaceCard!$E$13,4,\"\")))))","v":""},{"$f":"IF($B28=\"\",\"\",IF($B28=RaceCard!$B$14,1,IF($B28=RaceCard!$C$14,2,IF($B28=RaceCard!$D$14,3,IF($B28=RaceCard!$E$14,4,\"\")))))","v":""},{"$f":"IF(B28=\"\",\"\",RaceCard!T26)","v":""},{"$f":"IF(B28=\"\",\"\",IF($B28=RaceCard!$B$12,1,\"\"))","v":""},{"$f":"IF(B28=\"\",\"\",IF(RaceCard!S26=\"\",\"\",RaceCard!S26))","v":""},{"$f":"IF(B28=\"\",\"\",IF(RaceCard!X26=\"\",\"\",VALUE(RaceCard!X26)))","v":""},{"$f":"IF(B28=\"\",\"\",IF(RaceCard!Y26=\"\",\"\",VALUE(RaceCard!Y26)))","v":""},{"$f":"IF(B28=\"\",\"\",IF(RaceCard!Z26=\"\",\"\",VALUE(RaceCard!Z26)))","v":""},{"$f":"IF(B28=\"\",\"\",IF(RaceCard!Q26=\"\",\"\",RaceCard!Q26))","v":""},{"$f":"IF(B28=\"\",\"\",IF(RaceCard!P26=\"\",\"\",RaceCard!P26))","v":""},{"$nulls":13},28,"05:40 PM-ARMIDALE-06",{"$f":"IF(RaceCard!AY29=\"\",\"\",RaceCard!AY29)","v":"17:40:00"},{"$f":"IF(RaceCard!AZ29=\"\",\"\",RaceCard!AZ29)","v":"ARMIDALE"},{"$f":"IF(RaceCard!BA29=\"\",\"\",RaceCard!BA29)","v":"06"},{"$f":"IF(RaceCard!BB29=\"\",\"\",RaceCard!BB29)","v":"SCHWEPPES CL1 HCP"},{"$f":"IF(RaceCard!BC29=\"\",\"\",RaceCard!BC29)","v":"CL1"},{"$f":"IF(AI28=\"\",\"\",IF(ISERROR(VLOOKUP(AI28,RaceCard!$AD$2:$AF$48,2,FALSE)),\"X\",VLOOKUP(AI28,RaceCard!$AD$2:$AF$48,3,FALSE)))","v":"NR"},"NR-06"]
[{"$nulls":31},29,"05:50 PM-IPSWICH-07",{"$f":"IF(RaceCard!AY30=\"\",\"\",RaceCard!AY30)","v":"17:50:00"},{"$f":"IF(RaceCard!AZ30=\"\",\"\",RaceCard!AZ30)","v":"IPSWICH"},{"$f":"IF(RaceCard!BA30=\"\",\"\",RaceCard!BA30)","v":"07"},{"$f":"IF(RaceCard!BB30=\"\",\"\",RaceCard!BB30)","v":"GEORGE KITCHING MEM CL1 HCP"},{"$f":"IF(RaceCard!BC30=\"\",\"\",RaceCard!BC30)","v":"UNKNOWN"},{"$f":"IF(AI29=\"\",\"\",IF(ISERROR(VLOOKUP(AI29,RaceCard!$AD$2:$AF$48,2,FALSE)),\"X\",VLOOKUP(AI29,RaceCard!$AD$2:$AF$48,3,FALSE)))","v":"BR"},"BR-07"]
[{"$nulls":31},30,"06:20 PM-ARMIDALE-07",{"$f":"IF(RaceCard!AY31=\"\",\"\",RaceCard!AY31)","v":"18:20:00"},{"$f":"IF(RaceCard!AZ31=\"\",\"\",RaceCard!AZ31)","v":"ARMIDALE"},{"$f":"IF(RaceCard!BA31=\"\",\"\",RaceCard!BA31)","v":"07"},{"$f":"IF(RaceCard!BB31=\"\",\"\",RaceCard!BB31)","v":"WALCHA CUP PRELUDE BM 65 HCP"},{"$f":"IF(RaceCard!BC31=\"\",\"\",RaceCard!BC31)","v":"BM65"},{"$f":"IF(AI30=\"\",\"\",IF(ISERROR(VLOOKUP(AI30,RaceCard!$AD$2:$AF$48,2,FALSE)),\"X\",VLOOKUP(AI30,RaceCard!$AD$2:$AF$48,3,FALSE)))","v":"NR"},"NR-07"]
[{"$nulls":31},31,"06:45 PM-MOONEE VALLEY-01",{"$f":"IF(RaceCard!AY32=\"\",\"\",RaceCard!AY32)","v":"18:45:00"},{"$f":"IF(RaceCard!AZ32=\"\",\"\",RaceCard!AZ32)","v":"MOONEE VALLEY"},{"$f":"IF(RaceCard!BA32=\"\",\"\",RaceCard!BA32)","v":"01"},{"$f":"IF(RaceCard!BB32=\"\",\"\",RaceCard!BB32)","v":"MITCHELTON WINES 3YO 0-72 HCP"},{"$f":"IF(RaceCard!BC32=\"\",\"\",RaceCard!BC32)","v":"RB72"},{"$f":"IF(AI31=\"\",\"\",IF(ISERROR(VLOOKUP(AI31,RaceCard!$AD$2:$AF$48,2,FALSE)),\"X\",VLOOKUP(AI31,RaceCard!$AD$2:$AF$48,3,FALSE)))","v":"MR"},"MR-01"]
[{"$nulls":31},32,"06:55 PM-ARMIDALE-08",{"$f":"IF(RaceCard!AY33=\"\",\"\",RaceCard!AY33)","v":"18:55:00"},{"$f":"IF(RaceCard!AZ33=\"\",\"\",RaceCard!AZ33)","v":"ARMIDALE"},{"$f":"IF(RaceCard!BA33=\"\",\"\",RaceCard!BA33)","v":"08"},{"$f":"IF(RaceCard!BB33=\"\",\"\",RaceCard!BB33)","v":"HAHN PREMIUM LIGHT BM 50 HCP"},{"$f":"IF(RaceCard!BC33=\"\",\"\",RaceCard!BC33)","v":"BM50"},{"$f":"IF(AI32=\"\",\"\",IF(ISERROR(VLOOKUP(AI32,RaceCard!$AD$2:$AF$48,2,FALSE)),\"X\",VLOOKUP(AI32,RaceCard!$AD$2:$AF$48,3,FALSE)))","v":"NR"},"NR-08"]
[{"$nulls":31},33,"07:00 PM-SUNSHINE COAST-01",{"$f":"IF(RaceCard!AY34=\"\",\"\",RaceCard!AY34)","v":"19:00:00"},{"$f":"IF(RaceCard!AZ34=\"\",\"\",RaceCard!AZ34)","v":"SUNSHINE COAST"},{"$f":"IF(RaceCard!BA34=\"\",\"\",RaceCard!BA34)","v":"01"},{"$f":"IF(RaceCard!BB34=\"\",\"\",RaceCard!BB34)","v":"CROWNE PLAZA CL3 PLT"},{"$f":"IF(RaceCard!BC34=\"\",\"\",RaceCard!BC34)","v":"UNKNOWN"},{"$f":"IF(AI33=\"\",\"\",IF(ISERROR(VLOOKUP(AI33,RaceCard!$AD$2:$AF$48,2,FALSE)),\"X\",VLOOKUP(AI33,RaceCard!$AD$2:$AF$48,3,FALSE)))","v":"QR"},"QR-01"]
[{"$nulls":31},34,"07:15 PM-MOONEE VALLEY-02",{"$f":"IF(RaceCard!AY35=\"\",\"\",RaceCard!AY35)","v":"19:15:00"},{"$f":"IF(RaceCard!AZ35=\"\",\"\",RaceCard!AZ35)","v":"MOONEE VALLEY"},{"$f":"IF(RaceCard!BA35=\"\",\"\",RaceCard!BA35)","v":"02"},{"$f":"IF(RaceCard!BB35=\"\",\"\",RaceCard!BB35)","v":"AQUANAS FOODS 0-82 HCP"},{"$f":"IF(RaceCard!BC35=\"\",\"\",RaceCard!BC35)","v":"RB82"},{"$f":"IF(AI34=\"\",\"\",IF(ISERROR(VLOOKUP(AI34,RaceCard!$AD$2:$AF$48,2,FALSE)),\"X\",VLOOKUP(AI34,RaceCard!$AD$2:$AF$48,3,FALSE)))","v":"MR"},"MR-02"]
[{"$nulls":31},35,"07:30 PM-SUNSHINE COAST-02",{"$f":"IF(RaceCard!AY36=\"\",\"\",RaceCard!AY36)","v":"19:30:00"},{"$f":"IF(RaceCard!AZ36=\"\",\"\",RaceCard!AZ36)","v":"SUNSHINE COAST"},{"$f":"IF(RaceCard!BA36=\"\",\"\",RaceCard!BA36)","v":"02"},{"$f":"IF(RaceCard!BB36=\"\",\"\",RaceCard!BB36)","v":"WIDE WORLD OF LIGHTS MDN HCP"},{"$f":"IF(RaceCard!BC36=\"\",\"\",RaceCard!BC36)","v":"UNKNOWN"},{"$f":"IF(AI35=\"\",\"\",IF(ISERROR(VLOOKUP(AI35,RaceCard!$AD$2:$AF$48,2,FALSE)),\"X\",VLOOKUP(AI35,RaceCard!$AD$2:$AF$48,3,FALSE)))","v":"QR"},"QR-02"]
[{"$nulls":31},36,"07:45 PM-MOONEE VALLEY-03",{"$f":"IF(RaceCard!AY37=\"\",\"\",RaceCard!AY37)","v":"19:45:00"},{"$f":"IF(RaceCard!AZ37=\"\",\"\",RaceCard!AZ37)","v":"MOONEE VALLEY"},{"$f":"IF(RaceCard!BA37=\"\",\"\",RaceCard!BA37)","v":"03"},{"$f":"IF(RaceCard!BB37=\"\",\"\",RaceCard!BB37)","v":"CORPORATE INTERIORS PREMIUM 0-78"},{"$f":"IF(RaceCard!BC37=\"\",\"\",RaceCard!BC37)","v":"RB78"},{"$f":"IF(AI36=\"\",\"\",IF(ISERROR(VLOOKUP(AI36,RaceCard!$AD$2:$AF$48,2,FALSE)),\"X\",VLOOKUP(AI36,RaceCard!$AD$2:$AF$48,3,FALSE)))","v":"MR"},"MR-03"]
[{"$nulls":31},37,"08:00 PM-SUNSHINE COAST-03",{"$f":"IF(RaceCard!AY38=\"\",\"\",RaceCard!AY38)","v":"20:00:00"},{"$f":"IF(RaceCard!AZ38=\"\",\"\",RaceCard!AZ38)","v":"SUNSHINE COAST"},{"$f":"IF(RaceCard!BA38=\"\",\"\",RaceCard!BA38)","v":"03"},{"$f":"IF(RaceCard!BB38=\"\",\"\",RaceCard!BB38)","v":"LJ HOOKER CALOUNDRA 2YO PLT"},{"$f":"IF(RaceCard!BC38=\"\",\"\",RaceCard!BC38)","v":"UNKNOWN"},{"$f":"IF(AI37=\"\",\"\",IF(ISERROR(VLOOKUP(AI37,RaceCard!$AD$2:$AF$48,2,FALSE)),\"X\",VLOOKUP(AI37,RaceCard!$AD$2:$AF$48,3,FALSE)))","v":"QR"},"QR-03"]
[{"$nulls":31},38,"08:15 PM-MOONEE VALLEY-04",{"$f":"IF(RaceCard!AY39=\"\",\"\",RaceCard!AY39)","v":"20:15:00"},{"$f":"IF(RaceCard!AZ39=\"\",\"\",RaceCard!AZ39)","v":"MOONEE VALLEY"},{"$f":"IF(RaceCard!BA39=\"\",\"\",RaceCard!BA39)","v":"04"},{"$f":"IF(RaceCard!BB39=\"\",\"\",RaceCard!BB39)","v":"ESSENDON MAZDA AUSTRALIA STAKES"},{"$f":"IF(RaceCard!BC39=\"\",\"\",RaceCard!BC39)","v":"UNKNOWN"},{"$f":"IF(AI38=\"\",\"\",IF(ISERROR(VLOOKUP(AI38,RaceCard!$AD$2:$AF$48,2,FALSE)),\"X\",VLOOKUP(AI38,RaceCard!$AD$2:$AF$48,3,FALSE)))","v":"MR"},"MR-04"]
[{"$nulls":31},39,"08:30 PM-SUNSHINE COAST-04",{"$f":"IF(RaceCard!AY40=\"\",\"\",RaceCard!AY40)","v":"20:30:00"},{"$f":"IF(RaceCard!AZ40=\"\",\"\",RaceCard!AZ40)","v":"SUNSHINE COAST"},{"$f":"IF(RaceCard!BA40=\"\",\"\",RaceCard!BA40)","v":"04"},{"$f":"IF(RaceCard!BB40=\"\",\"\",RaceCard!BB40)","v":"SUNSHINE COAST CUP"},{"$f":"IF(RaceCard!BC40=\"\",\"\",RaceCard!BC40)","v":"UNKNOWN"},{"$f":"IF(AI39=\"\",\"\",IF(ISERROR(VLOOKUP(AI39,RaceCard!$AD$2:$AF$48,2,FALSE)),\"X\",VLOOKUP(AI39,RaceCard!$AD$2:$AF$48,3,FALSE)))","v":"QR"},"QR-04"]
[{"$nulls":31},40,"08:45 PM-MOONEE VALLEY-05",{"$f":"IF(RaceCard!AY41=\"\",\"\",RaceCard!AY41)","v":"20:45:00"},{"$f":"IF(RaceCard!AZ41=\"\",\"\",RaceCard!AZ41)","v":"MOONEE VALLEY"},{"$f":"IF(RaceCard!BA41=\"\",\"\",RaceCard!BA41)","v":"05"},{"$f":"IF(RaceCard!BB41=\"\",\"\",RaceCard!BB41)","v":"ESSENDON MAZDA 55 SEC MARES HT11"},{"$f":"IF(RaceCard!BC41=\"\",\"\",RaceCard!BC41)","v":"UNKNOWN"},{"$f":"IF(AI40=\"\",\"\",IF(ISERROR(VLOOKUP(AI40,RaceCard!$AD$2:$AF$48,2,FALSE)),\"X\",VLOOKUP(AI40,RaceCard!$AD$2:$AF$48,3,FALSE)))","v":"MR"},"MR-05"]
[{"$nulls":31},41,"09:00 PM-SUNSHINE COAST-05",{"$f":"IF(RaceCard!AY42=\"\",\"\",RaceCard!AY42)","v":"21:00:00"},{"$f":"IF(RaceCard!AZ42=\"\",\"\",RaceCard!AZ42)","v":"SUNSHINE COAST"},{"$f":"IF(RaceCard!BA42=\"\",\"\",RaceCard!BA42)","v":"05"},{"$f":"IF(RaceCard!BB42=\"\",\"\",RaceCard!BB42)","v":"TIMBER SHADES CL1 HCP"},{"$f":"IF(RaceCard!BC42=\"\",\"\",RaceCard!BC42)","v":"UNKNOWN"},{"$f":"IF(AI41=\"\",\"\",IF(ISERROR(VLOOKUP(AI41,RaceCard!$AD$2:$AF$48,2,FALSE)),\"X\",VLOOKUP(AI41,RaceCard!$AD$2:$AF$48,3,FALSE)))","v":"QR"},"QR-05"]
[{"$nulls":31},42,"09:15 PM-MOONEE VALLEY-06",{"$f":"IF(RaceCard!AY43=\"\",\"\",RaceCard!AY43)","v":"21:15:00"},{"$f":"IF(RaceCard!AZ43=\"\",\"\",RaceCard!AZ43)","v":"MOONEE VALLEY"},{"$f":"IF(RaceCard!BA43=\"\",\"\",RaceCard!BA43)","v":"06"},{"$f":"IF(RaceCard!BB43=\"\",\"\",RaceCard!BB43)","v":"SPORTINGBET CARLYON F&M CLASSIC"},{"$f":"IF(RaceCard!BC43=\"\",\"\",RaceCard!BC43)","v":"UNKNOWN"},{"$f":"IF(AI42=\"\",\"\",IF(ISERROR(VLOOKUP(AI42,RaceCard!$AD$2:$AF$48,2,FALSE)),\"X\",VLOOKUP(AI42,RaceCard!$AD$2:$AF$48,3,FALSE)))","v":"MR"},"MR-06"]
[{"$nulls":31},43,"09:30 PM-SUNSHINE COAST-06",{"$f":"IF(RaceCard!AY44=\"\",\"\",RaceCard!AY44)","v":"21:30:00"},{"$f":"IF(RaceCard!AZ44=\"\",\"\",RaceCard!AZ44)","v":"SUNSHINE COAST"},{"$f":"IF(RaceCard!BA44=\"\",\"\",RaceCard!BA44)","v":"06"},{"$f":"IF(RaceCard!BB44=\"\",\"\",RaceCard!BB44)","v":"SUNCOAST FITNESS C,G&E MDN PLT"},{"$f":"IF(RaceCard!BC44=\"\",\"\",RaceCard!BC44)","v":"UNKNOWN"},{"$f":"IF(AI43=\"\",\"\",IF(ISERROR(VLOOKUP(AI43,RaceCard!$AD$2:$AF$48,2,FALSE)),\"X\",VLOOKUP(AI43,RaceCard!$AD$2:$AF$48,3,FALSE)))","v":"QR"},"QR-06"]
[{"$nulls":31},44,"09:45 PM-MOONEE VALLEY-07",{"$f":"IF(RaceCard!AY45=\"\",\"\",RaceCard!AY45)","v":"21:45:00"},{"$f":"IF(RaceCard!AZ45=\"\",\"\",RaceCard!AZ45)","v":"MOONEE VALLEY"},{"$f":"IF(RaceCard!BA45=\"\",\"\",RaceCard!BA45)","v":"07"},{"$f":"IF(RaceCard!BB45=\"\",\"\",RaceCard!BB45)","v":"PRINTHOUSE GROUP 0-78 HCP"},{"$f":"IF(RaceCard!BC45=\"\",\"\",RaceCard!BC45)","v":"RB78"},{"$f":"IF(AI44=\"\",\"\",IF(ISERROR(VLOOKUP(AI44,RaceCard!$AD$2:$AF$48,2,FALSE)),\"X\",VLOOKUP(AI44,RaceCard!$AD$2:$AF$48,3,FALSE)))","v":"MR"},"MR-07"]
[{"$nulls":31},45,"10:00 PM-SUNSHINE COAST-07",{"$f":"IF(RaceCard!AY46=\"\",\"\",RaceCard!AY46)","v":"22:00:00"},{"$f":"IF(RaceCard!AZ46=\"\",\"\",RaceCard!AZ46)","v":"SUNSHINE COAST"},{"$f":"IF(RaceCard!BA46=\"\",\"\",RaceCard!BA46)","v":"07"},{"$f":"IF(RaceCard!BB46=\"\",\"\",RaceCard!BB46)","v":"STAR SHOTS F&M MDN PLT"},{"$f":"IF(RaceCard!BC46=\"\",\"\",RaceCard!BC46)","v":"UNKNOWN"},{"$f":"IF(AI45=\"\",\"\",IF(ISERROR(VLOOKUP(AI45,RaceCard!$AD$2:$AF$48,2,FALSE)),\"X\",VLOOKUP(AI45,RaceCard!$AD$2:$AF$48,3,FALSE)))","v":"QR"},"QR-07"]
[{"$nulls":31},46,"10:15 PM-MOONEE VALLEY-08",{"$f":"IF(RaceCard!AY47=\"\",\"\",RaceCard!AY47)","v":"22:15:00"},{"$f":"IF(RaceCard!AZ47=\"\",\"\",RaceCard!AZ47)","v":"MOONEE VALLEY"},{"$f":"IF(RaceCard!BA47=\"\",\"\",RaceCard!BA47)","v":"08"},{"$f":"IF(RaceCard!BB47=\"\",\"\",RaceCard!BB47)","v":"ANDREWS & PARKER FURNITURE 0-72"},{"$f":"IF(RaceCard!BC47=\"\",\"\",RaceCard!BC47)","v":"RB72"},{"$f":"IF(AI46=\"\",\"\",IF(ISERROR(VLOOKUP(AI46,RaceCard!$AD$2:$AF$48,2,FALSE)),\"X\",VLOOKUP(AI46,RaceCard!$AD$2:$AF$48,3,FALSE)))","v":"MR"},"MR-08"]
[{"$nulls":31},47,"10:30 PM-SUNSHINE COAST-08",{"$f":"IF(RaceCard!AY48=\"\",\"\",RaceCard!AY48)","v":"22:30:00"},{"$f":"IF(RaceCard!AZ48=\"\",\"\",RaceCard!AZ48)","v":"SUNSHINE COAST"},{"$f":"IF(RaceCard!BA48=\"\",\"\",RaceCard!BA48)","v":"08"},{"$f":"IF(RaceCard!BB48=\"\",\"\",RaceCard!BB48)","v":"THE JOURNAL WEEKENDER CL2 HCP"},{"$f":"IF(RaceCard!BC48=\"\",\"\",RaceCard!BC48)","v":"UNKNOWN"},{"$f":"IF(AI47=\"\",\"\",IF(ISERROR(VLOOKUP(AI47,RaceCard!$AD$2:$AF$48,2,FALSE)),\"X\",VLOOKUP(AI47,RaceCard!$AD$2:$AF$48,3,FALSE)))","v":"QR"},"QR-08"]
[{"$nulls":31},48,"",{"$f":"IF(RaceCard!AY49=\"\",\"\",RaceCard!AY49)","v":""},{"$f":"IF(RaceCard!AZ49=\"\",\"\",RaceCard!AZ49)","v":""},{"$f":"IF(RaceCard!BA49=\"\",\"\",RaceCard!BA49)","v":""},{"$f":"IF(RaceCard!BB49=\"\",\"\",RaceCard!BB49)","v":""},{"$f":"IF(RaceCard!BC49=\"\",\"\",RaceCard!BC49)","v":""},{"$f":"IF(AI48=\"\",\"\",IF(ISERROR(VLOOKUP(AI48,RaceCard!$AD$2:$AF$48,2,FALSE)),\"X\",VLOOKUP(AI48,RaceCard!$AD$2:$AF$48,3,FALSE)))","v":""},""]
[{"$nulls":31},49,"",{"$f":"IF(RaceCard!AY50=\"\",\"\",RaceCard!AY50)","v":""},{"$f":"IF(RaceCard!AZ50=\"\",\"\",RaceCard!AZ50)","v":""},{"$f":"IF(RaceCard!BA50=\"\",\"\",RaceCard!BA50)","v":""},{"$f":"IF(RaceCard!BB50=\"\",\"\",RaceCard!BB50)","v":""},{"$f":"IF(RaceCard!BC50=\"\",\"\",RaceCard!BC50)","v":""},{"$f":"IF(AI49=\"\",\"\",IF(ISERROR(VLOOKUP(AI49,RaceCard!$AD$2:$AF$48,2,FALSE)),\"X\",VLOOKUP(AI49,RaceCard!$AD$2:$AF$48,3,FALSE)))","v":""},""]
[1,{"$nulls":30},50,"",{"$f":"IF(RaceCard!AY51=\"\",\"\",RaceCard!AY51)","v":""},{"$f":"IF(RaceCard!AZ51=\"\",\"\",RaceCard!AZ51)","v":""},{"$f":"IF(RaceCard!BA51=\"\",\"\",RaceCard!BA51)","v":""},{"$f":"IF(RaceCard!BB51=\"\",\"\",RaceCard!BB51)","v":""},{"$f":"IF(RaceCard!BC51=\"\",\"\",RaceCard!BC51)","v":""},{"$f":"IF(AI50=\"\",\"\",IF(ISERROR(VLOOKUP(AI50,RaceCard!$AD$2:$AF$48,2,FALSE)),\"X\",VLOOKUP(AI50,RaceCard!$AD$2:$AF$48,3,FALSE)))","v":""},""]
[2,{"$nulls":30},51,"",{"$f":"IF(RaceCard!AY52=\"\",\"\",RaceCard!AY52)","v":""},{"$f":"IF(RaceCard!AZ52=\"\",\"\",RaceCard!AZ52)","v":""},{"$f":"IF(RaceCard!BA52=\"\",\"\",RaceCard!BA52)","v":""},{"$f":"IF(RaceCard!BB52=\"\",\"\",RaceCard!BB52)","v":""},{"$f":"IF(RaceCard!BC52=\"\",\"\",RaceCard!BC52)","v":""},{"$f":"IF(AI51=\"\",\"\",IF(ISERROR(VLOOKUP(AI51,RaceCard!$AD$2:$AF$48,2,FALSE)),\"X\",VLOOKUP(AI51,RaceCard!$AD$2:$AF$48,3,FALSE)))","v":""},""]
[3,{"$nulls":30},52,"",{"$f":"IF(RaceCard!AY53=\"\",\"\",RaceCard!AY53)","v":""},{"$f":"IF(RaceCard!AZ53=\"\",\"\",RaceCard!AZ53)","v":""},{"$f":"IF(RaceCard!BA53=\"\",\"\",RaceCard!BA53)","v":""},{"$f":"IF(RaceCard!BB53=\"\",\"\",RaceCard!BB53)","v":""},{"$f":"IF(RaceCard!BC53=\"\",\"\",RaceCard!BC53)","v":""},{"$f":"IF(AI52=\"\",\"\",IF(ISERROR(VLOOKUP(AI52,RaceCard!$AD$2:$AF$48,2,FALSE)),\"X\",VLOOKUP(AI52,RaceCard!$AD$2:$AF$48,3,FALSE)))","v":""},""]
[4,{"$nulls":30},53,"",{"$f":"IF(RaceCard!AY54=\"\",\"\",RaceCard!AY54)","v":""},{"$f":"IF(RaceCard!AZ54=\"\",\"\",RaceCard!AZ54)","v":""},{"$f":"IF(RaceCard!BA54=\"\",\"\",RaceCard!BA54)","v":""},{"$f":"IF(RaceCard!BB54=\"\",\"\",RaceCard!BB54)","v":""},{"$f":"IF(RaceCard!BC54=\"\",\"\",RaceCard!BC54)","v":""},{"$f":"IF(AI53=\"\",\"\",IF(ISERROR(VLOOKUP(AI53,RaceCard!$AD$2:$AF$48,2,FALSE)),\"X\",VLOOKUP(AI53,RaceCard!$AD$2:$AF$48,3,FALSE)))","v":""},""]
[5,{"$nulls":30},54,"",{"$f":"IF(RaceCard!AY55=\"\",\"\",RaceCard!AY55)","v":""},{"$f":"IF(RaceCard!AZ55=\"\",\"\",RaceCard!AZ55)","v":""},{"$f":"IF(RaceCard!BA55=\"\",\"\",RaceCard!BA55)","v":""},{"$f":"IF(RaceCard!BB55=\"\",\"\",RaceCard!BB55)","v":""},{"$f":"IF(RaceCard!BC55=\"\",\"\",RaceCard!BC55)","v":""},{"$f":"IF(AI54=\"\",\"\",IF(ISERROR(VLOOKUP(AI54,RaceCard!$AD$2:$AF$48,2,FALSE)),\"X\",VLOOKUP(AI54,RaceCard!$AD$2:$AF$48,3,FALSE)))","v":""},""]
[6,{"$nulls":30},55,"",{"$f":"IF(RaceCard!AY56=\"\",\"\",RaceCard!AY56)","v":""},{"$f":"IF(RaceCard!AZ56=\"\",\"\",RaceCard!AZ56)","v":""},{"$f":"IF(RaceCard!BA56=\"\",\"\",RaceCard!BA56)","v":""},{"$f":"IF(RaceCard!BB56=\"\",\"\",RaceCard!BB56)","v":""},{"$f":"IF(RaceCard!BC56=\"\",\"\",RaceCard!BC56)","v":""},{"$f":"IF(AI55=\"\",\"\",IF(ISERROR(VLOOKUP(AI55,RaceCard!$AD$2:$AF$48,2,FALSE)),\"X\",VLOOKUP(AI55,RaceCard!$AD$2:$AF$48,3,FALSE)))","v":""},""]
[{"$nulls":31},56,"",{"$f":"IF(RaceCard!AY57=\"\",\"\",RaceCard!AY57)","v":""},{"$f":"IF(RaceCard!AZ57=\"\",\"\",RaceCard!AZ57)","v":""},{"$f":"IF(RaceCard!BA57=\"\",\"\",RaceCard!BA57)","v":""},{"$f":"IF(RaceCard!BB57=\"\",\"\",RaceCard!BB57)","v":""},{"$f":"IF(RaceCard!BC57=\"\",\"\",RaceCard!BC57)","v":""},{"$f":"IF(AI56=\"\",\"\",IF(ISERROR(VLOOKUP(AI56,RaceCard!$AD$2:$AF$48,2,FALSE)),\"X\",VLOOKUP(AI56,RaceCard!$AD$2:$AF$48,3,FALSE)))","v":""},""]
[{"$nulls":31},57,"",{"$f":"IF(RaceCard!AY58=\"\",\"\",RaceCard!AY58)","v":""},{"$f":"IF(RaceCard!AZ58=\"\",\"\",RaceCard!AZ58)","v":""},{"$f":"IF(RaceCard!BA58=\"\",\"\",RaceCard!BA58)","v":""},{"$f":"IF(RaceCard!BB58=\"\",\"\",RaceCard!BB58)","v":""},{"$f":"IF(RaceCard!BC58=\"\",\"\",RaceCard!BC58)","v":""},{"$f":"IF(AI57=\"\",\"\",IF(ISERROR(VLOOKUP(AI57,RaceCard!$AD$2:$AF$48,2,FALSE)),\"X\",VLOOKUP(AI57,RaceCard!$AD$2:$AF$48,3,FALSE)))","v":""},""]
[{"$nulls":31},58,"",{"$f":"IF(RaceCard!AY59=\"\",\"\",RaceCard!AY59)","v":""},{"$f":"IF(RaceCard!AZ59=\"\",\"\",RaceCard!AZ59)","v":""},{"$f":"IF(RaceCard!BA59=\"\",\"\",RaceCard!BA59)","v":""},{"$f":"IF(RaceCard!BB59=\"\",\"\",RaceCard!BB59)","v":""},{"$f":"IF(RaceCard!BC59=\"\",\"\",RaceCard!BC59)","v":""},{"$f":"IF(AI58=\"\",\"\",IF(ISERROR(VLOOKUP(AI58,RaceCard!$AD$2:$AF$48,2,FALSE)),\"X\",VLOOKUP(AI58,RaceCard!$AD$2:$AF$48,3,FALSE)))","v":""},""]
[{"$nulls":31},59,"",{"$f":"IF(RaceCard!AY60=\"\",\"\",RaceCard!AY60)","v":""},{"$f":"IF(RaceCard!AZ60=\"\",\"\",RaceCard!AZ60)","v":""},{"$f":"IF(RaceCard!BA60=\"\",\"\",RaceCard!BA60)","v":""},{"$f":"IF(RaceCard!BB60=\"\",\"\",RaceCard!BB60)","v":""},{"$f":"IF(RaceCard!BC60=\"\",\"\",RaceCard!BC60)","v":""},{"$f":"IF(AI59=\"\",\"\",IF(ISERROR(VLOOKUP(AI59,RaceCard!$AD$2:$AF$48,2,FALSE)),\"X\",VLOOKUP(AI59,RaceCard!$AD$2:$AF$48,3,FALSE)))","v":""},""]
[{"$nulls":31},60,"",{"$f":"IF(RaceCard!AY61=\"\",\"\",RaceCard!AY61)","v":""},{"$f":"IF(RaceCard!AZ61=\"\",\"\",RaceCard!AZ61)","v":""},{"$f":"IF(RaceCard!BA61=\"\",\"\",RaceCard!BA61)","v":""},{"$f":"IF(RaceCard!BB61=\"\",\"\",RaceCard!BB61)","v":""},{"$f":"IF(RaceCard!BC61=\"\",\"\",RaceCard!BC61)","v":""},{"$f":"IF(AI60=\"\",\"\",IF(ISERROR(VLOOKUP(AI60,RaceCard!$AD$2:$AF$48,2,FALSE)),\"X\",VLOOKUP(AI60,RaceCard!$AD$2:$AF$48,3,FALSE)))","v":""},""]
[{"$nulls":31},61,"",{"$f":"IF(RaceCard!AY62=\"\",\"\",RaceCard!AY62)","v":""},{"$f":"IF(RaceCard!AZ62=\"\",\"\",RaceCard!AZ62)","v":""},{"$f":"IF(RaceCard!BA62=\"\",\"\",RaceCard!BA62)","v":""},{"$f":"IF(RaceCard!BB62=\"\",\"\",RaceCard!BB62)","v":""},{"$f":"IF(RaceCard!BC62=\"\",\"\",RaceCard!BC62)","v":""},{"$f":"IF(AI61=\"\",\"\",IF(ISERROR(VLOOKUP(AI61,RaceCard!$AD$2:$AF$48,2,FALSE)),\"X\",VLOOKUP(AI61,RaceCard!$AD$2:$AF$48,3,FALSE)))","v":""},""]
[{"$nulls":31},62,"",{"$f":"IF(RaceCard!AY63=\"\",\"\",RaceCard!AY63)","v":""},{"$f":"IF(RaceCard!AZ63=\"\",\"\",RaceCard!AZ63)","v":""},{"$f":"IF(RaceCard!BA63=\"\",\"\",RaceCard!BA63)","v":""},{"$f":"IF(RaceCard!BB63=\"\",\"\",RaceCard!BB63)","v":""},{"$f":"IF(RaceCard!BC63=\"\",\"\",RaceCard!BC63)","v":""},{"$f":"IF(AI62=\"\",\"\",IF(ISERROR(VLOOKUP(AI62,RaceCard!$AD$2:$AF$48,2,FALSE)),\"X\",VLOOKUP(AI62,RaceCard!$AD$2:$AF$48,3,FALSE)))","v":""},""]
[{"$nulls":31},63,"",{"$f":"IF(RaceCard!AY64=\"\",\"\",RaceCard!AY64)","v":""},{"$f":"IF(RaceCard!AZ64=\"\",\"\",RaceCard!AZ64)","v":""},{"$f":"IF(RaceCard!BA64=\"\",\"\",RaceCard!BA64)","v":""},{"$f":"IF(RaceCard!BB64=\"\",\"\",RaceCard!BB64)","v":""},{"$f":"IF(RaceCard!BC64=\"\",\"\",RaceCard!BC64)","v":""},{"$f":"IF(AI63=\"\",\"\",IF(ISERROR(VLOOKUP(AI63,RaceCard!$AD$2:$AF$48,2,FALSE)),\"X\",VLOOKUP(AI63,RaceCard!$AD$2:$AF$48,3,FALSE)))","v":""},""]
[{"$nulls":31},64,"",{"$f":"IF(RaceCard!AY65=\"\",\"\",RaceCard!AY65)","v":""},{"$f":"IF(RaceCard!AZ65=\"\",\"\",RaceCard!AZ65)","v":""},{"$f":"IF(RaceCard!BA65=\"\",\"\",RaceCard!BA65)","v":""},{"$f":"IF(RaceCard!BB65=\"\",\"\",RaceCard!BB65)","v":""},{"$f":"IF(RaceCard!BC65=\"\",\"\",RaceCard!BC65)","v":""},{"$f":"IF(AI64=\"\",\"\",IF(ISERROR(VLOOKUP(AI64,RaceCard!$AD$2:$AF$48,2,FALSE)),\"X\",VLOOKUP(AI64,RaceCard!$AD$2:$AF$48,3,FALSE)))","v":""},""]
[{"$nulls":31},65,"",{"$f":"IF(RaceCard!AY66=\"\",\"\",RaceCard!AY66)","v":""},{"$f":"IF(RaceCard!AZ66=\"\",\"\",RaceCard!AZ66)","v":""},{"$f":"IF(RaceCard!BA66=\"\",\"\",RaceCard!BA66)","v":""},{"$f":"IF(RaceCard!BB66=\"\",\"\",RaceCard!BB66)","v":""},{"$f":"IF(RaceCard!BC66=\"\",\"\",RaceCard!BC66)","v":""},{"$f":"IF(AI65=\"\",\"\",IF(ISERROR(VLOOKUP(AI65,RaceCard!$AD$2:$AF$48,2,FALSE)),\"X\",VLOOKUP(AI65,RaceCard!$AD$2:$AF$48,3,FALSE)))","v":""},""]
[{"$nulls":31},66,{"$f":"IF(AI66=\"\",\"\",CONCATENATE(TEXT(AH66,\"HH:MM AM/PM\"),\"-\",AI66,\"-\",AJ66))","v":""},{"$f":"IF(RaceCard!AY67=\"\",\"\",RaceCard!AY67)","v":""},{"$f":"IF(RaceCard!AZ67=\"\",\"\",RaceCard!AZ67)","v":""},{"$f":"IF(RaceCard!BA67=\"\",\"\",RaceCard!BA67)","v":""},{"$f":"IF(RaceCard!BB67=\"\",\"\",RaceCard!BB67)","v":""},{"$f":"IF(RaceCard!BC67=\"\",\"\",RaceCard!BC67)","v":""},{"$f":"IF(AI66=\"\",\"\",IF(ISERROR(VLOOKUP(AI66,RaceCard!$AD$2:$AF$48,2,FALSE)),\"X\",VLOOKUP(AI66,RaceCard!$AD$2:$AF$48,3,FALSE)))","v":""},""]
[{"$nulls":31},67,"",{"$f":"IF(RaceCard!AY68=\"\",\"\",RaceCard!AY68)","v":""},{"$f":"IF(RaceCard!AZ68=\"\",\"\",RaceCard!AZ68)","v":""},{"$f":"IF(RaceCard!BA68=\"\",\"\",RaceCard!BA68)","v":""},{"$f":"IF(RaceCard!BB68=\"\",\"\",RaceCard!BB68)","v":""},{"$f":"IF(RaceCard!BC68=\"\",\"\",RaceCard!BC68)","v":""},{"$f":"IF(AI67=\"\",\"\",IF(ISERROR(VLOOKUP(AI67,RaceCard!$AD$2:$AF$48,2,FALSE)),\"X\",VLOOKUP(AI67,RaceCard!$AD$2:$AF$48,3,FALSE)))","v":""},""]
[{"$nulls":31},68,"",{"$f":"IF(RaceCard!AY69=\"\",\"\",RaceCard!AY69)","v":""},{"$f":"IF(RaceCard!AZ69=\"\",\"\",RaceCard!AZ69)","v":""},{"$f":"IF(RaceCard!BA69=\"\",\"\",RaceCard!BA69)","v":""},{"$f":"IF(RaceCard!BB69=\"\",\"\",RaceCard!BB69)","v":""},{"$f":"IF(RaceCard!BC69=\"\",\"\",RaceCard!BC69)","v":""},{"$f":"IF(AI68=\"\",\"\",IF(ISERROR(VLOOKUP(AI68,RaceCard!$AD$2:$AF$48,2,FALSE)),\"X\",VLOOKUP(AI68,RaceCard!$AD$2:$AF$48,3,FALSE)))","v":""},""]
[{"$nulls":31},69,"",{"$f":"IF(RaceCard!AY70=\"\",\"\",RaceCard!AY70)","v":""},{"$f":"IF(RaceCard!AZ70=\"\",\"\",RaceCard!AZ70)","v":""},{"$f":"IF(RaceCard!BA70=\"\",\"\",RaceCard!BA70)","v":""},{"$f":"IF(RaceCard!BB70=\"\",\"\",RaceCard!BB70)","v":""},{"$f":"IF(RaceCard!BC70=\"\",\"\",RaceCard!BC70)","v":""},{"$f":"IF(AI69=\"\",\"\",IF(ISERROR(VLOOKUP(AI69,RaceCard!$AD$2:$AF$48,2,FALSE)),\"X\",VLOOKUP(AI69,RaceCard!$AD$2:$AF$48,3,FALSE)))","v":""},""]
[{"$nulls":31},70,"",{"$f":"IF(RaceCard!AY71=\"\",\"\",RaceCard!AY71)","v":""},{"$f":"IF(RaceCard!AZ71=\"\",\"\",RaceCard!AZ71)","v":""},{"$f":"IF(RaceCard!BA71=\"\",\"\",RaceCard!BA71)","v":""},{"$f":"IF(RaceCard!BB71=\"\",\"\",RaceCard!BB71)","v":""},{"$f":"IF(RaceCard!BC71=\"\",\"\",RaceCard!BC71)","v":""},{"$f":"IF(AI70=\"\",\"\",IF(ISERROR(VLOOKUP(AI70,RaceCard!$AD$2:$AF$48,2,FALSE)),\"X\",VLOOKUP(AI70,RaceCard!$AD$2:$AF$48,3,FALSE)))","v":""},""]
[{"$nulls":31},71,"",{"$f":"IF(RaceCard!AY72=\"\",\"\",RaceCard!AY72)","v":""},{"$f":"IF(RaceCard!AZ72=\"\",\"\",RaceCard!AZ72)","v":""},{"$f":"IF(RaceCard!BA72=\"\",\"\",RaceCard!BA72)","v":""},{"$f":"IF(RaceCard!BB72=\"\",\"\",RaceCard!BB72)","v":""},{"$f":"IF(RaceCard!BC72=\"\",\"\",RaceCard!BC72)","v":""},{"$f":"IF(AI71=\"\",\"\",IF(ISERROR(VLOOKUP(AI71,RaceCard!$AD$2:$AF$48,2,FALSE)),\"X\",VLOOKUP(AI71,RaceCard!$AD$2:$AF$48,3,FALSE)))","v":""},""]
[{"$nulls":31},72,"",{"$f":"IF(RaceCard!AY73=\"\",\"\",RaceCard!AY73)","v":""},{"$f":"IF(RaceCard!AZ73=\"\",\"\",RaceCard!AZ73)","v":""},{"$f":"IF(RaceCard!BA73=\"\",\"\",RaceCard!BA73)","v":""},{"$f":"IF(RaceCard!BB73=\"\",\"\",RaceCard!BB73)","v":""},{"$f":"IF(RaceCard!BC73=\"\",\"\",RaceCard!BC73)","v":""},{"$f":"IF(AI72=\"\",\"\",IF(ISERROR(VLOOKUP(AI72,RaceCard!$AD$2:$AF$48,2,FALSE)),\"X\",VLOOKUP(AI72,RaceCard!$AD$2:$AF$48,3,FALSE)))","v":""},""]
[{"$nulls":31},73,"",{"$f":"IF(RaceCard!AY74=\"\",\"\",RaceCard!AY74)","v":""},{"$f":"IF(RaceCard!AZ74=\"\",\"\",RaceCard!AZ74)","v":""},{"$f":"IF(RaceCard!BA74=\"\",\"\",RaceCard!BA74)","v":""},{"$f":"IF(RaceCard!BB74=\"\",\"\",RaceCard!BB74)","v":""},{"$f":"IF(RaceCard!BC74=\"\",\"\",RaceCard!BC74)","v":""},{"$f":"IF(AI73=\"\",\"\",IF(ISERROR(VLOOKUP(AI73,RaceCard!$AD$2:$AF$48,2,FALSE)),\"X\",VLOOKUP(AI73,RaceCard!$AD$2:$AF$48,3,FALSE)))","v":""},""]
[{"$nulls":31},74,"",{"$f":"IF(RaceCard!AY75=\"\",\"\",RaceCard!AY75)","v":""},{"$f":"IF(RaceCard!AZ75=\"\",\"\",RaceCard!AZ75)","v":""},{"$f":"IF(RaceCard!BA75=\"\",\"\",RaceCard!BA75)","v":""},{"$f":"IF(RaceCard!BB75=\"\",\"\",RaceCard!BB75)","v":""},{"$f":"IF(RaceCard!BC75=\"\",\"\",RaceCard!BC75)","v":""},{"$f":"IF(AI74=\"\",\"\",IF(ISERROR(VLOOKUP(AI74,RaceCard!$AD$2:$AF$48,2,FALSE)),\"X\",VLOOKUP(AI74,RaceCard!$AD$2:$AF$48,3,FALSE)))","v":""},""]
[{"$nulls":31},75,"",{"$f":"IF(RaceCard!AY76=\"\",\"\",RaceCard!AY76)","v":""},{"$f":"IF(RaceCard!AZ76=\"\",\"\",RaceCard!AZ76)","v":""},{"$f":"IF(RaceCard!BA76=\"\",\"\",RaceCard!BA76)","v":""},{"$f":"IF(RaceCard!BB76=\"\",\"\",RaceCard!BB76)","v":""},{"$f":"IF(RaceCard!BC76=\"\",\"\",RaceCard!BC76)","v":""},{"$f":"IF(AI75=\"\",\"\",IF(ISERROR(VLOOKUP(AI75,RaceCard!$AD$2:$AF$48,2,FALSE)),\"X\",VLOOKUP(AI75,RaceCard!$AD$2:$AF$48,3,FALSE)))","v":""},""]
[{"$nulls":31},76,"",{"$f":"IF(RaceCard!AY77=\"\",\"\",RaceCard!AY77)","v":""},{"$f":"IF(RaceCard!AZ77=\"\",\"\",RaceCard!AZ77)","v":""},{"$f":"IF(RaceCard!BA77=\"\",\"\",RaceCard!BA77)","v":""},{"$f":"IF(RaceCard!BB77=\"\",\"\",RaceCard!BB77)","v":""},{"$f":"IF(RaceCard!BC77=\"\",\"\",RaceCard!BC77)","v":""},{"$f":"IF(AI76=\"\",\"\",IF(ISERROR(VLOOKUP(AI76,RaceCard!$AD$2:$AF$48,2,FALSE)),\"X\",VLOOKUP(AI76,RaceCard!$AD$2:$AF$48,3,FALSE)))","v":""},""]
[{"$nulls":31},77,"",{"$f":"IF(RaceCard!AY78=\"\",\"\",RaceCard!AY78)","v":""},{"$f":"IF(RaceCard!AZ78=\"\",\"\",RaceCard!AZ78)","v":""},{"$f":"IF(RaceCard!BA78=\"\",\"\",RaceCard!BA78)","v":""},{"$f":"IF(RaceCard!BB78=\"\",\"\",RaceCard!BB78)","v":""},{"$f":"IF(RaceCard!BC78=\"\",\"\",RaceCard!BC78)","v":""},{"$f":"IF(AI77=\"\",\"\",IF(ISERROR(VLOOKUP(AI77,RaceCard!$AD$2:$AF$48,2,FALSE)),\"X\",VLOOKUP(AI77,RaceCard!$AD$2:$AF$48,3,FALSE)))","v":""},""]
[{"$nulls":31},78,"",{"$f":"IF(RaceCard!AY79=\"\",\"\",RaceCard!AY79)","v":""},{"$f":"IF(RaceCard!AZ79=\"\",\"\",RaceCard!AZ79)","v":""},{"$f":"IF(RaceCard!BA79=\"\",\"\",RaceCard!BA79)","v":""},{"$f":"IF(RaceCard!BB79=\"\",\"\",RaceCard!BB79)","v":""},{"$f":"IF(RaceCard!BC79=\"\",\"\",RaceCard!BC79)","v":""},{"$f":"IF(AI78=\"\",\"\",IF(ISERROR(VLOOKUP(AI78,RaceCard!$AD$2:$AF$48,2,FALSE)),\"X\",VLOOKUP(AI78,RaceCard!$AD$2:$AF$48,3,FALSE)))","v":""},""]
[{"$nulls":31},79,"",{"$f":"IF(RaceCard!AY80=\"\",\"\",RaceCard!AY80)","v":""},{"$f":"IF(RaceCard!AZ80=\"\",\"\",RaceCard!AZ80)","v":""},{"$f":"IF(RaceCard!BA80=\"\",\"\",RaceCard!BA80)","v":""},{"$f":"IF(RaceCard!BB80=\"\",\"\",RaceCard!BB80)","v":""},{"$f":"IF(RaceCard!BC80=\"\",\"\",RaceCard!BC80)","v":""},{"$f":"IF(AI79=\"\",\"\",IF(ISERROR(VLOOKUP(AI79,RaceCard!$AD$2:$AF$48,2,FALSE)),\"X\",VLOOKUP(AI79,RaceCard!$AD$2:$AF$48,3,FALSE)))","v":""},""]
[{"$nulls":31},80,"",{"$f":"IF(RaceCard!AY81=\"\",\"\",RaceCard!AY81)","v":""},{"$f":"IF(RaceCard!AZ81=\"\",\"\",RaceCard!AZ81)","v":""},{"$f":"IF(RaceCard!BA81=\"\",\"\",RaceCard!BA81)","v":""},{"$f":"IF(RaceCard!BB81=\"\",\"\",RaceCard!BB81)","v":""},{"$f":"IF(RaceCard!BC81=\"\",\"\",RaceCard!BC81)","v":""},{"$f":"IF(AI80=\"\",\"\",IF(ISERROR(VLOOKUP(AI80,RaceCard!$AD$2:$AF$48,2,FALSE)),\"X\",VLOOKUP(AI80,RaceCard!$AD$2:$AF$48,3,FALSE)))","v":""},""]
[{"$nulls":31},81,"",{"$f":"IF(RaceCard!AY82=\"\",\"\",RaceCard!AY82)","v":""},{"$f":"IF(RaceCard!AZ82=\"\",\"\",RaceCard!AZ82)","v":""},{"$f":"IF(RaceCard!BA82=\"\",\"\",RaceCard!BA82)","v":""},{"$f":"IF(RaceCard!BB82=\"\",\"\",RaceCard!BB82)","v":""},{"$f":"IF(RaceCard!BC82=\"\",\"\",RaceCard!BC82)","v":""},{"$f":"IF(AI81=\"\",\"\",IF(ISERROR(VLOOKUP(AI81,RaceCard!$AD$2:$AF$48,2,FALSE)),\"X\",VLOOKUP(AI81,RaceCard!$AD$2:$AF$48,3,FALSE)))","v":""},""]
[{"$nulls":31},82,"",{"$f":"IF(RaceCard!AY83=\"\",\"\",RaceCard!AY83)","v":""},{"$f":"IF(RaceCard!AZ83=\"\",\"\",RaceCard!AZ83)","v":""},{"$f":"IF(RaceCard!BA83=\"\",\"\",RaceCard!BA83)","v":""},{"$f":"IF(RaceCard!BB83=\"\",\"\",RaceCard!BB83)","v":""},{"$f":"IF(RaceCard!BC83=\"\",\"\",RaceCard!BC83)","v":""},{"$f":"IF(AI82=\"\",\"\",IF(ISERROR(VLOOKUP(AI82,RaceCard!$AD$2:$AF$48,2,FALSE)),\"X\",VLOOKUP(AI82,RaceCard!$AD$2:$AF$48,3,FALSE)))","v":""},""]
[{"$nulls":31},83,"",{"$f":"IF(RaceCard!AY84=\"\",\"\",RaceCard!AY84)","v":""},{"$f":"IF(RaceCard!AZ84=\"\",\"\",RaceCard!AZ84)","v":""},{"$f":"IF(RaceCard!BA84=\"\",\"\",RaceCard!BA84)","v":""},{"$f":"IF(RaceCard!BB84=\"\",\"\",RaceCard!BB84)","v":""},{"$f":"IF(RaceCard!BC84=\"\",\"\",RaceCard!BC84)","v":""},{"$f":"IF(AI83=\"\",\"\",IF(ISERROR(VLOOKUP(AI83,RaceCard!$AD$2:$AF$48,2,FALSE)),\"X\",VLOOKUP(AI83,RaceCard!$AD$2:$AF$48,3,FALSE)))","v":""},""]
[{"$nulls":31},84,"",{"$f":"IF(RaceCard!AY85=\"\",\"\",RaceCard!AY85)","v":""},{"$f":"IF(RaceCard!AZ85=\"\",\"\",RaceCard!AZ85)","v":""},{"$f":"IF(RaceCard!BA85=\"\",\"\",RaceCard!BA85)","v":""},{"$f":"IF(RaceCard!BB85=\"\",\"\",RaceCard!BB85)","v":""},{"$f":"IF(RaceCard!BC85=\"\",\"\",RaceCard!BC85)","v":""},{"$f":"IF(AI84=\"\",\"\",IF(ISERROR(VLOOKUP(AI84,RaceCard!$AD$2:$AF$48,2,FALSE)),\"X\",VLOOKUP(AI84,RaceCard!$AD$2:$AF$48,3,FALSE)))","v":""},""]
[{"$nulls":31},85,"",{"$f":"IF(RaceCard!AY86=\"\",\"\",RaceCard!AY86)","v":""},{"$f":"IF(RaceCard!AZ86=\"\",\"\",RaceCard!AZ86)","v":""},{"$f":"IF(RaceCard!BA86=\"\",\"\",RaceCard!BA86)","v":""},{"$f":"IF(RaceCard!BB86=\"\",\"\",RaceCard!BB86)","v":""},{"$f":"IF(RaceCard!BC86=\"\",\"\",RaceCard!BC86)","v":""},{"$f":"IF(AI85=\"\",\"\",IF(ISERROR(VLOOKUP(AI85,RaceCard!$AD$2:$AF$48,2,FALSE)),\"X\",VLOOKUP(AI85,RaceCard!$AD$2:$AF$48,3,FALSE)))","v":""},""]
[{"$nulls":31},86,"",{"$f":"IF(RaceCard!AY87=\"\",\"\",RaceCard!AY87)","v":""},{"$f":"IF(RaceCard!AZ87=\"\",\"\",RaceCard!AZ87)","v":""},{"$f":"IF(RaceCard!BA87=\"\",\"\",RaceCard!BA87)","v":""},{"$f":"IF(RaceCard!BB87=\"\",\"\",RaceCard!BB87)","v":""},{"$f":"IF(RaceCard!BC87=\"\",\"\",RaceCard!BC87)","v":""},{"$f":"IF(AI86=\"\",\"\",IF(ISERROR(VLOOKUP(AI86,RaceCard!$AD$2:$AF$48,2,FALSE)),\"X\",VLOOKUP(AI86,RaceCard!$AD$2:$AF$48,3,FALSE)))","v":""},""]
[{"$nulls":31},87,"",{"$f":"IF(RaceCard!AY88=\"\",\"\",RaceCard!AY88)","v":""},{"$f":"IF(RaceCard!AZ88=\"\",\"\",RaceCard!AZ88)","v":""},{"$f":"IF(RaceCard!BA88=\"\",\"\",RaceCard!BA88)","v":""},{"$f":"IF(RaceCard!BB88=\"\",\"\",RaceCard!BB88)","v":""},{"$f":"IF(RaceCard!BC88=\"\",\"\",RaceCard!BC88)","v":""},{"$f":"IF(AI87=\"\",\"\",IF(ISERROR(VLOOKUP(AI87,RaceCard!$AD$2:$AF$48,2,FALSE)),\"X\",VLOOKUP(AI87,RaceCard!$AD$2:$AF$48,3,FALSE)))","v":""},""]
[{"$nulls":31},88,"",{"$f":"IF(RaceCard!AY89=\"\",\"\",RaceCard!AY89)","v":""},{"$f":"IF(RaceCard!AZ89=\"\",\"\",RaceCard!AZ89)","v":""},{"$f":"IF(RaceCard!BA89=\"\",\"\",RaceCard!BA89)","v":""},{"$f":"IF(RaceCard!BB89=\"\",\"\",RaceCard!BB89)","v":""},{"$f":"IF(RaceCard!BC89=\"\",\"\",RaceCard!BC89)","v":""},{"$f":"IF(AI88=\"\",\"\",IF(ISERROR(VLOOKUP(AI88,RaceCard!$AD$2:$AF$48,2,FALSE)),\"X\",VLOOKUP(AI88,RaceCard!$AD$2:$AF$48,3,FALSE)))","v":""},{"$f":"IF(AG88=\"\",\"\",CONCATENATE(AM88,\"-\",TEXT(AJ88,\"00\")))","v":""}]
[{"$nulls":31},89,"",{"$f":"IF(RaceCard!AY90=\"\",\"\",RaceCard!AY90)","v":""},{"$f":"IF(RaceCard!AZ90=\"\",\"\",RaceCard!AZ90)","v":""},{"$f":"IF(RaceCard!BA90=\"\",\"\",RaceCard!BA90)","v":""},{"$f":"IF(RaceCard!BB90=\"\",\"\",RaceCard!BB90)","v":""},{"$f":"IF(RaceCard!BC90=\"\",\"\",RaceCard!BC90)","v":""},{"$f":"IF(AI89=\"\",\"\",IF(ISERROR(VLOOKUP(AI89,RaceCard!$AD$2:$AF$48,2,FALSE)),\"X\",VLOOKUP(AI89,RaceCard!$AD$2:$AF$48,3,FALSE)))","v":""},""]
[{"$nulls":31},90,"",{"$f":"IF(RaceCard!AY91=\"\",\"\",RaceCard!AY91)","v":""},{"$f":"IF(RaceCard!AZ91=\"\",\"\",RaceCard!AZ91)","v":""},{"$f":"IF(RaceCard!BA91=\"\",\"\",RaceCard!BA91)","v":""},{"$f":"IF(RaceCard!BB91=\"\",\"\",RaceCard!BB91)","v":""},{"$f":"IF(RaceCard!BC91=\"\",\"\",RaceCard!BC91)","v":""},{"$f":"IF(AI90=\"\",\"\",IF(ISERROR(VLOOKUP(AI90,RaceCard!$AD$2:$AF$48,2,FALSE)),\"X\",VLOOKUP(AI90,RaceCard!$AD$2:$AF$48,3,FALSE)))","v":""},""]
[{"$nulls":31},91,"",{"$f":"IF(RaceCard!AY92=\"\",\"\",RaceCard!AY92)","v":""},{"$f":"IF(RaceCard!AZ92=\"\",\"\",RaceCard!AZ92)","v":""},{"$f":"IF(RaceCard!BA92=\"\",\"\",RaceCard!BA92)","v":""},{"$f":"IF(RaceCard!BB92=\"\",\"\",RaceCard!BB92)","v":""},{"$f":"IF(RaceCard!BC92=\"\",\"\",RaceCard!BC92)","v":""},{"$f":"IF(AI91=\"\",\"\",IF(ISERROR(VLOOKUP(AI91,RaceCard!$AD$2:$AF$48,2,FALSE)),\"X\",VLOOKUP(AI91,RaceCard!$AD$2:$AF$48,3,FALSE)))","v":""},""]
[{"$nulls":31},92,"",{"$f":"IF(RaceCard!AY93=\"\",\"\",RaceCard!AY93)","v":""},{"$f":"IF(RaceCard!AZ93=\"\",\"\",RaceCard!AZ93)","v":""},{"$f":"IF(RaceCard!BA93=\"\",\"\",RaceCard!BA93)","v":""},{"$f":"IF(RaceCard!BB93=\"\",\"\",RaceCard!BB93)","v":""},{"$f":"IF(RaceCard!BC93=\"\",\"\",RaceCard!BC93)","v":""},{"$f":"IF(AI92=\"\",\"\",IF(ISERROR(VLOOKUP(AI92,RaceCard!$AD$2:$AF$48,2,FALSE)),\"X\",VLOOKUP(AI92,RaceCard!$AD$2:$AF$48,3,FALSE)))","v":""},""]
[{"$nulls":31},93,"",{"$f":"IF(RaceCard!AY94=\"\",\"\",RaceCard!AY94)","v":""},{"$f":"IF(RaceCard!AZ94=\"\",\"\",RaceCard!AZ94)","v":""},{"$f":"IF(RaceCard!BA94=\"\",\"\",RaceCard!BA94)","v":""},{"$f":"IF(RaceCard!BB94=\"\",\"\",RaceCard!BB94)","v":""},{"$f":"IF(RaceCard!BC94=\"\",\"\",RaceCard!BC94)","v":""},{"$f":"IF(AI93=\"\",\"\",IF(ISERROR(VLOOKUP(AI93,RaceCard!$AD$2:$AF$48,2,FALSE)),\"X\",VLOOKUP(AI93,RaceCard!$AD$2:$AF$48,3,FALSE)))","v":""},""]
[{"$nulls":31},94,"",{"$f":"IF(RaceCard!AY95=\"\",\"\",RaceCard!AY95)","v":""},{"$f":"IF(RaceCard!AZ95=\"\",\"\",RaceCard!AZ95)","v":""},{"$f":"IF(RaceCard!BA95=\"\",\"\",RaceCard!BA95)","v":""},{"$f":"IF(RaceCard!BB95=\"\",\"\",RaceCard!BB95)","v":""},{"$f":"IF(RaceCard!BC95=\"\",\"\",RaceCard!BC95)","v":""},{"$f":"IF(AI94=\"\",\"\",IF(ISERROR(VLOOKUP(AI94,RaceCard!$AD$2:$AF$48,2,FALSE)),\"X\",VLOOKUP(AI94,RaceCard!$AD$2:$AF$48,3,FALSE)))","v":""},""]
[{"$nulls":31},95,"",{"$f":"IF(RaceCard!AY96=\"\",\"\",RaceCard!AY96)","v":""},{"$f":"IF(RaceCard!AZ96=\"\",\"\",RaceCard!AZ96)","v":""},{"$f":"IF(RaceCard!BA96=\"\",\"\",RaceCard!BA96)","v":""},{"$f":"IF(RaceCard!BB96=\"\",\"\",RaceCard!BB96)","v":""},{"$f":"IF(RaceCard!BC96=\"\",\"\",RaceCard!BC96)","v":""},{"$f":"IF(AI95=\"\",\"\",IF(ISERROR(VLOOKUP(AI95,RaceCard!$AD$2:$AF$48,2,FALSE)),\"X\",VLOOKUP(AI95,RaceCard!$AD$2:$AF$48,3,FALSE)))","v":""},""]
[{"$nulls":31},96,"",{"$f":"IF(RaceCard!AY97=\"\",\"\",RaceCard!AY97)","v":""},{"$f":"IF(RaceCard!AZ97=\"\",\"\",RaceCard!AZ97)","v":""},{"$f":"IF(RaceCard!BA97=\"\",\"\",RaceCard!BA97)","v":""},{"$f":"IF(RaceCard!BB97=\"\",\"\",RaceCard!BB97)","v":""},{"$f":"IF(RaceCard!BC97=\"\",\"\",RaceCard!BC97)","v":""},{"$f":"IF(AI96=\"\",\"\",IF(ISERROR(VLOOKUP(AI96,RaceCard!$AD$2:$AF$48,2,FALSE)),\"X\",VLOOKUP(AI96,RaceCard!$AD$2:$AF$48,3,FALSE)))","v":""},""]
[{"$nulls":31},97,"",{"$f":"IF(RaceCard!AY98=\"\",\"\",RaceCard!AY98)","v":""},{"$f":"IF(RaceCard!AZ98=\"\",\"\",RaceCard!AZ98)","v":""},{"$f":"IF(RaceCard!BA98=\"\",\"\",RaceCard!BA98)","v":""},{"$f":"IF(RaceCard!BB98=\"\",\"\",RaceCard!BB98)","v":""},{"$f":"IF(RaceCard!BC98=\"\",\"\",RaceCard!BC98)","v":""},{"$f":"IF(AI97=\"\",\"\",IF(ISERROR(VLOOKUP(AI97,RaceCard!$AD$2:$AF$48,2,FALSE)),\"X\",VLOOKUP(AI97,RaceCard!$AD$2:$AF$48,3,FALSE)))","v":""},""]
[{"$nulls":31},98,"",{"$f":"IF(RaceCard!AY99=\"\",\"\",RaceCard!AY99)","v":""},{"$f":"IF(RaceCard!AZ99=\"\",\"\",RaceCard!AZ99)","v":""},{"$f":"IF(RaceCard!BA99=\"\",\"\",RaceCard!BA99)","v":""},{"$f":"IF(RaceCard!BB99=\"\",\"\",RaceCard!BB99)","v":""},{"$f":"IF(RaceCard!BC99=\"\",\"\",RaceCard!BC99)","v":""},{"$f":"IF(AI98=\"\",\"\",IF(ISERROR(VLOOKUP(AI98,RaceCard!$AD$2:$AF$48,2,FALSE)),\"X\",VLOOKUP(AI98,RaceCard!$AD$2:$AF$48,3,FALSE)))","v":""},""]
[{"$nulls":31},99,"",{"$f":"IF(RaceCard!AY100=\"\",\"\",RaceCard!AY100)","v":""},{"$f":"IF(RaceCard!AZ100=\"\",\"\",RaceCard!AZ100)","v":""},{"$f":"IF(RaceCard!BA100=\"\",\"\",RaceCard!BA100)","v":""},{"$f":"IF(RaceCard!BB100=\"\",\"\",RaceCard!BB100)","v":""},{"$f":"IF(RaceCard!BC100=\"\",\"\",RaceCard!BC100)","v":""},{"$f":"IF(AI99=\"\",\"\",IF(ISERROR(VLOOKUP(AI99,RaceCard!$AD$2:$AF$48,2,FALSE)),\"X\",VLOOKUP(AI99,RaceCard!$AD$2:$AF$48,3,FALSE)))","v":""},""]
[{"$nulls":31},100,"",{"$f":"IF(RaceCard!AY101=\"\",\"\",RaceCard!AY101)","v":""},{"$f":"IF(RaceCard!AZ101=\"\",\"\",RaceCard!AZ101)","v":""},{"$f":"IF(RaceCard!BA101=\"\",\"\",RaceCard!BA101)","v":""},{"$f":"IF(RaceCard!BB101=\"\",\"\",RaceCard!BB101)","v":""},{"$f":"IF(RaceCard!BC101=\"\",\"\",RaceCard!BC101)","v":""},{"$f":"IF(AI100=\"\",\"\",IF(ISERROR(VLOOKUP(AI100,RaceCard!$AD$2:$AF$48,2,FALSE)),\"X\",VLOOKUP(AI100,RaceCard!$AD$2:$AF$48,3,FALSE)))","v":""},""]
[{"$nulls":31},101,"",{"$f":"IF(RaceCard!AY102=\"\",\"\",RaceCard!AY102)","v":""},{"$f":"IF(RaceCard!AZ102=\"\",\"\",RaceCard!AZ102)","v":""},{"$f":"IF(RaceCard!BA102=\"\",\"\",RaceCard!BA102)","v":""},{"$f":"IF(RaceCard!BB102=\"\",\"\",RaceCard!BB102)","v":""},{"$f":"IF(RaceCard!BC102=\"\",\"\",RaceCard!BC102)","v":""},{"$f":"IF(AI101=\"\",\"\",IF(ISERROR(VLOOKUP(AI101,RaceCard!$AD$2:$AF$48,2,FALSE)),\"X\",VLOOKUP(AI101,RaceCard!$AD$2:$AF$48,3,FALSE)))","v":""},""]
[{"$nulls":31},102,"",{"$f":"IF(RaceCard!AY103=\"\",\"\",RaceCard!AY103)","v":""},{"$f":"IF(RaceCard!AZ103=\"\",\"\",RaceCard!AZ103)","v":""},{"$f":"IF(RaceCard!BA103=\"\",\"\",RaceCard!BA103)","v":""},{"$f":"IF(RaceCard!BB103=\"\",\"\",RaceCard!BB103)","v":""},{"$f":"IF(RaceCard!BC103=\"\",\"\",RaceCard!BC103)","v":""},{"$f":"IF(AI102=\"\",\"\",IF(ISERROR(VLOOKUP(AI102,RaceCard!$AD$2:$AF$48,2,FALSE)),\"X\",VLOOKUP(AI102,RaceCard!$AD$2:$AF$48,3,FALSE)))","v":""},""]
[{"$nulls":31},103,"",{"$f":"IF(RaceCard!AY104=\"\",\"\",RaceCard!AY104)","v":""},{"$f":"IF(RaceCard!AZ104=\"\",\"\",RaceCard!AZ104)","v":""},{"$f":"IF(RaceCard!BA104=\"\",\"\",RaceCard!BA104)","v":""},{"$f":"IF(RaceCard!BB104=\"\",\"\",RaceCard!BB104)","v":""},{"$f":"IF(RaceCard!BC104=\"\",\"\",RaceCard!BC104)","v":""},{"$f":"IF(AI103=\"\",\"\",IF(ISERROR(VLOOKUP(AI103,RaceCard!$AD$2:$AF$48,2,FALSE)),\"X\",VLOOKUP(AI103,RaceCard!$AD$2:$AF$48,3,FALSE)))","v":""},""]
[{"$nulls":31},104,"",{"$f":"IF(RaceCard!AY105=\"\",\"\",RaceCard!AY105)","v":""},{"$f":"IF(RaceCard!AZ105=\"\",\"\",RaceCard!AZ105)","v":""},{"$f":"IF(RaceCard!BA105=\"\",\"\",RaceCard!BA105)","v":""},{"$f":"IF(RaceCard!BB105=\"\",\"\",RaceCard!BB105)","v":""},{"$f":"IF(RaceCard!BC105=\"\",\"\",RaceCard!BC105)","v":""},{"$f":"IF(AI104=\"\",\"\",IF(ISERROR(VLOOKUP(AI104,RaceCard!$AD$2:$AF$48,2,FALSE)),\"X\",VLOOKUP(AI104,RaceCard!$AD$2:$AF$48,3,FALSE)))","v":""},""]
[{"$nulls":31},105,"",{"$f":"IF(RaceCard!AY106=\"\",\"\",RaceCard!AY106)","v":""},{"$f":"IF(RaceCard!AZ106=\"\",\"\",RaceCard!AZ106)","v":""},{"$f":"IF(RaceCard!BA106=\"\",\"\",RaceCard!BA106)","v":""},{"$f":"IF(RaceCard!BB106=\"\",\"\",RaceCard!BB106)","v":""},{"$f":"IF(RaceCard!BC106=\"\",\"\",RaceCard!BC106)","v":""},{"$f":"IF(AI105=\"\",\"\",IF(ISERROR(VLOOKUP(AI105,RaceCard!$AD$2:$AF$48,2,FALSE)),\"X\",VLOOKUP(AI105,RaceCard!$AD$2:$AF$48,3,FALSE)))","v":""},""]
[{"$nulls":31},106,"",{"$f":"IF(RaceCard!AY107=\"\",\"\",RaceCard!AY107)","v":""},{"$f":"IF(RaceCard!AZ107=\"\",\"\",RaceCard!AZ107)","v":""},{"$f":"IF(RaceCard!BA107=\"\",\"\",RaceCard!BA107)","v":""},{"$f":"IF(RaceCard!BB107=\"\",\"\",RaceCard!BB107)","v":""},{"$f":"IF(RaceCard!BC107=\"\",\"\",RaceCard!BC107)","v":""},{"$f":"IF(AI106=\"\",\"\",IF(ISERROR(VLOOKUP(AI106,RaceCard!$AD$2:$AF$48,2,FALSE)),\"X\",VLOOKUP(AI106,RaceCard!$AD$2:$AF$48,3,FALSE)))","v":""},""]
[{"$nulls":31},107,"",{"$f":"IF(RaceCard!AY108=\"\",\"\",RaceCard!AY108)","v":""},{"$f":"IF(RaceCard!AZ108=\"\",\"\",RaceCard!AZ108)","v":""},{"$f":"IF(RaceCard!BA108=\"\",\"\",RaceCard!BA108)","v":""},{"$f":"IF(RaceCard!BB108=\"\",\"\",RaceCard!BB108)","v":""},{"$f":"IF(RaceCard!BC108=\"\",\"\",RaceCard!BC108)","v":""},{"$f":"IF(AI107=\"\",\"\",IF(ISERROR(VLOOKUP(AI107,RaceCard!$AD$2:$AF$48,2,FALSE)),\"X\",VLOOKUP(AI107,RaceCard!$AD$2:$AF$48,3,FALSE)))","v":""},""]
[{"$nulls":31},108,"",{"$f":"IF(RaceCard!AY109=\"\",\"\",RaceCard!AY109)","v":""},{"$f":"IF(RaceCard!AZ109=\"\",\"\",RaceCard!AZ109)","v":""},{"$f":"IF(RaceCard!BA109=\"\",\"\",RaceCard!BA109)","v":""},{"$f":"IF(RaceCard!BB109=\"\",\"\",RaceCard!BB109)","v":""},{"$f":"IF(RaceCard!BC109=\"\",\"\",RaceCard!BC109)","v":""},{"$f":"IF(AI108=\"\",\"\",IF(ISERROR(VLOOKUP(AI108,RaceCard!$AD$2:$AF$48,2,FALSE)),\"X\",VLOOKUP(AI108,RaceCard!$AD$2:$AF$48,3,FALSE)))","v":""},""]
[{"$nulls":31},109,"",{"$f":"IF(RaceCard!AY110=\"\",\"\",RaceCard!AY110)","v":""},{"$f":"IF(RaceCard!AZ110=\"\",\"\",RaceCard!AZ110)","v":""},{"$f":"IF(RaceCard!BA110=\"\",\"\",RaceCard!BA110)","v":""},{"$f":"IF(RaceCard!BB110=\"\",\"\",RaceCard!BB110)","v":""},{"$f":"IF(RaceCard!BC110=\"\",\"\",RaceCard!BC110)","v":""},{"$f":"IF(AI109=\"\",\"\",IF(ISERROR(VLOOKUP(AI109,RaceCard!$AD$2:$AF$48,2,FALSE)),\"X\",VLOOKUP(AI109,RaceCard!$AD$2:$AF$48,3,FALSE)))","v":""},""]
[{"$nulls":31},110,"",{"$f":"IF(RaceCard!AY111=\"\",\"\",RaceCard!AY111)","v":""},{"$f":"IF(RaceCard!AZ111=\"\",\"\",RaceCard!AZ111)","v":""},{"$f":"IF(RaceCard!BA111=\"\",\"\",RaceCard!BA111)","v":""},{"$f":"IF(RaceCard!BB111=\"\",\"\",RaceCard!BB111)","v":""},{"$f":"IF(RaceCard!BC111=\"\",\"\",RaceCard!BC111)","v":""},{"$f":"IF(AI110=\"\",\"\",IF(ISERROR(VLOOKUP(AI110,RaceCard!$AD$2:$AF$48,2,FALSE)),\"X\",VLOOKUP(AI110,RaceCard!$AD$2:$AF$48,3,FALSE)))","v":""},""]
[{"$nulls":31},111,"",{"$f":"IF(RaceCard!AY112=\"\",\"\",RaceCard!AY112)","v":""},{"$f":"IF(RaceCard!AZ112=\"\",\"\",RaceCard!AZ112)","v":""},{"$f":"IF(RaceCard!BA112=\"\",\"\",RaceCard!BA112)","v":""},{"$f":"IF(RaceCard!BB112=\"\",\"\",RaceCard!BB112)","v":""},{"$f":"IF(RaceCard!BC112=\"\",\"\",RaceCard!BC112)","v":""},{"$f":"IF(AI111=\"\",\"\",IF(ISERROR(VLOOKUP(AI111,RaceCard!$AD$2:$AF$48,2,FALSE)),\"X\",VLOOKUP(AI111,RaceCard!$AD$2:$AF$48,3,FALSE)))","v":""},""]
[{"$nulls":31},112,"",{"$f":"IF(RaceCard!AY113=\"\",\"\",RaceCard!AY113)","v":""},{"$f":"IF(RaceCard!AZ113=\"\",\"\",RaceCard!AZ113)","v":""},{"$f":"IF(RaceCard!BA113=\"\",\"\",RaceCard!BA113)","v":""},{"$f":"IF(RaceCard!BB113=\"\",\"\",RaceCard!BB113)","v":""},{"$f":"IF(RaceCard!BC113=\"\",\"\",RaceCard!BC113)","v":""},{"$f":"IF(AI112=\"\",\"\",IF(ISERROR(VLOOKUP(AI112,RaceCard!$AD$2:$AF$48,2,FALSE)),\"X\",VLOOKUP(AI112,RaceCard!$AD$2:$AF$48,3,FALSE)))","v":""},""]
[{"$nulls":31},113,"",{"$f":"IF(RaceCard!AY114=\"\",\"\",RaceCard!AY114)","v":""},{"$f":"IF(RaceCard!AZ114=\"\",\"\",RaceCard!AZ114)","v":""},{"$f":"IF(RaceCard!BA114=\"\",\"\",RaceCard!BA114)","v":""},{"$f":"IF(RaceCard!BB114=\"\",\"\",RaceCard!BB114)","v":""},{"$f":"IF(RaceCard!BC114=\"\",\"\",RaceCard!BC114)","v":""},{"$f":"IF(AI113=\"\",\"\",IF(ISERROR(VLOOKUP(AI113,RaceCard!$AD$2:$AF$48,2,FALSE)),\"X\",VLOOKUP(AI113,RaceCard!$AD$2:$AF$48,3,FALSE)))","v":""},""]
[{"$nulls":31},114,"",{"$f":"IF(RaceCard!AY115=\"\",\"\",RaceCard!AY115)","v":""},{"$f":"IF(RaceCard!AZ115=\"\",\"\",RaceCard!AZ115)","v":""},{"$f":"IF(RaceCard!BA115=\"\",\"\",RaceCard!BA115)","v":""},{"$f":"IF(RaceCard!BB115=\"\",\"\",RaceCard!BB115)","v":""},{"$f":"IF(RaceCard!BC115=\"\",\"\",RaceCard!BC115)","v":""},{"$f":"IF(AI114=\"\",\"\",IF(ISERROR(VLOOKUP(AI114,RaceCard!$AD$2:$AF$48,2,FALSE)),\"X\",VLOOKUP(AI114,RaceCard!$AD$2:$AF$48,3,FALSE)))","v":""},""]
[{"$nulls":31},115,"",{"$f":"IF(RaceCard!AY116=\"\",\"\",RaceCard!AY116)","v":""},{"$f":"IF(RaceCard!AZ116=\"\",\"\",RaceCard!AZ116)","v":""},{"$f":"IF(RaceCard!BA116=\"\",\"\",RaceCard!BA116)","v":""},{"$f":"IF(RaceCard!BB116=\"\",\"\",RaceCard!BB116)","v":""},{"$f":"IF(RaceCard!BC116=\"\",\"\",RaceCard!BC116)","v":""},{"$f":"IF(AI115=\"\",\"\",IF(ISERROR(VLOOKUP(AI115,RaceCard!$AD$2:$AF$48,2,FALSE)),\"X\",VLOOKUP(AI115,RaceCard!$AD$2:$AF$48,3,FALSE)))","v":""},""]
[{"$nulls":31},116,"",{"$f":"IF(RaceCard!AY117=\"\",\"\",RaceCard!AY117)","v":""},{"$f":"IF(RaceCard!AZ117=\"\",\"\",RaceCard!AZ117)","v":""},{"$f":"IF(RaceCard!BA117=\"\",\"\",RaceCard!BA117)","v":""},{"$f":"IF(RaceCard!BB117=\"\",\"\",RaceCard!BB117)","v":""},{"$f":"IF(RaceCard!BC117=\"\",\"\",RaceCard!BC117)","v":""},{"$f":"IF(AI116=\"\",\"\",IF(ISERROR(VLOOKUP(AI116,RaceCard!$AD$2:$AF$48,2,FALSE)),\"X\",VLOOKUP(AI116,RaceCard!$AD$2:$AF$48,3,FALSE)))","v":""},""]
[{"$nulls":31},117,"",{"$f":"IF(RaceCard!AY118=\"\",\"\",RaceCard!AY118)","v":""},{"$f":"IF(RaceCard!AZ118=\"\",\"\",RaceCard!AZ118)","v":""},{"$f":"IF(RaceCard!BA118=\"\",\"\",RaceCard!BA118)","v":""},{"$f":"IF(RaceCard!BB118=\"\",\"\",RaceCard!BB118)","v":""},{"$f":"IF(RaceCard!BC118=\"\",\"\",RaceCard!BC118)","v":""},{"$f":"IF(AI117=\"\",\"\",IF(ISERROR(VLOOKUP(AI117,RaceCard!$AD$2:$AF$48,2,FALSE)),\"X\",VLOOKUP(AI117,RaceCard!$AD$2:$AF$48,3,FALSE)))","v":""},""]
[{"$nulls":31},118,"",{"$f":"IF(RaceCard!AY119=\"\",\"\",RaceCard!AY119)","v":""},{"$f":"IF(RaceCard!AZ119=\"\",\"\",RaceCard!AZ119)","v":""},{"$f":"IF(RaceCard!BA119=\"\",\"\",RaceCard!BA119)","v":""},{"$f":"IF(RaceCard!BB119=\"\",\"\",RaceCard!BB119)","v":""},{"$f":"IF(RaceCard!BC119=\"\",\"\",RaceCard!BC119)","v":""},{"$f":"IF(AI118=\"\",\"\",IF(ISERROR(VLOOKUP(AI118,RaceCard!$AD$2:$AF$48,2,FALSE)),\"X\",VLOOKUP(AI118,RaceCard!$AD$2:$AF$48,3,FALSE)))","v":""},""]
[{"$nulls":31},119,"",{"$f":"IF(RaceCard!AY120=\"\",\"\",RaceCard!AY120)","v":""},{"$f":"IF(RaceCard!AZ120=\"\",\"\",RaceCard!AZ120)","v":""},{"$f":"IF(RaceCard!BA120=\"\",\"\",RaceCard!BA120)","v":""},{"$f":"IF(RaceCard!BB120=\"\",\"\",RaceCard!BB120)","v":""},{"$f":"IF(RaceCard!BC120=\"\",\"\",RaceCard!BC120)","v":""},{"$f":"IF(AI119=\"\",\"\",IF(ISERROR(VLOOKUP(AI119,RaceCard!$AD$2:$AF$48,2,FALSE)),\"X\",VLOOKUP(AI119,RaceCard!$AD$2:$AF$48,3,FALSE)))","v":""},""]
[{"$nulls":31},120,"",{"$f":"IF(RaceCard!AY121=\"\",\"\",RaceCard!AY121)","v":""},{"$f":"IF(RaceCard!AZ121=\"\",\"\",RaceCard!AZ121)","v":""},{"$f":"IF(RaceCard!BA121=\"\",\"\",RaceCard!BA121)","v":""},{"$f":"IF(RaceCard!BB121=\"\",\"\",RaceCard!BB121)","v":""},{"$f":"IF(RaceCard!BC121=\"\",\"\",RaceCard!BC121)","v":""},{"$f":"IF(AI120=\"\",\"\",IF(ISERROR(VLOOKUP(AI120,RaceCard!$AD$2:$AF$48,2,FALSE)),\"X\",VLOOKUP(AI120,RaceCard!$AD$2:$AF$48,3,FALSE)))","v":""},""]
[{"$nulls":31},121,"",{"$f":"IF(RaceCard!AY122=\"\",\"\",RaceCard!AY122)","v":""},{"$f":"IF(RaceCard!AZ122=\"\",\"\",RaceCard!AZ122)","v":""},{"$f":"IF(RaceCard!BA122=\"\",\"\",RaceCard!BA122)","v":""},{"$f":"IF(RaceCard!BB122=\"\",\"\",RaceCard!BB122)","v":""},{"$f":"IF(RaceCard!BC122=\"\",\"\",RaceCard!BC122)","v":""},{"$f":"IF(AI121=\"\",\"\",IF(ISERROR(VLOOKUP(AI121,RaceCard!$AD$2:$AF$48,2,FALSE)),\"X\",VLOOKUP(AI121,RaceCard!$AD$2:$AF$48,3,FALSE)))","v":""},""]
[{"$nulls":31},122,"",{"$f":"IF(RaceCard!AY123=\"\",\"\",RaceCard!AY123)","v":""},{"$f":"IF(RaceCard!AZ123=\"\",\"\",RaceCard!AZ123)","v":""},{"$f":"IF(RaceCard!BA123=\"\",\"\",RaceCard!BA123)","v":""},{"$f":"IF(RaceCard!BB123=\"\",\"\",RaceCard!BB123)","v":""},{"$f":"IF(RaceCard!BC123=\"\",\"\",RaceCard!BC123)","v":""},{"$f":"IF(AI122=\"\",\"\",IF(ISERROR(VLOOKUP(AI122,RaceCard!$AD$2:$AF$48,2,FALSE)),\"X\",VLOOKUP(AI122,RaceCard!$AD$2:$AF$48,3,FALSE)))","v":""},""]
[{"$nulls":31},123,"",{"$f":"IF(RaceCard!AY124=\"\",\"\",RaceCard!AY124)","v":""},{"$f":"IF(RaceCard!AZ124=\"\",\"\",RaceCard!AZ124)","v":""},{"$f":"IF(RaceCard!BA124=\"\",\"\",RaceCard!BA124)","v":""},{"$f":"IF(RaceCard!BB124=\"\",\"\",RaceCard!BB124)","v":""},{"$f":"IF(RaceCard!BC124=\"\",\"\",RaceCard!BC124)","v":""},{"$f":"IF(AI123=\"\",\"\",IF(ISERROR(VLOOKUP(AI123,RaceCard!$AD$2:$AF$48,2,FALSE)),\"X\",VLOOKUP(AI123,RaceCard!$AD$2:$AF$48,3,FALSE)))","v":""},""]
[{"$nulls":31},124,"",{"$f":"IF(RaceCard!AY125=\"\",\"\",RaceCard!AY125)","v":""},{"$f":"IF(RaceCard!AZ125=\"\",\"\",RaceCard!AZ125)","v":""},{"$f":"IF(RaceCard!BA125=\"\",\"\",RaceCard!BA125)","v":""},{"$f":"IF(RaceCard!BB125=\"\",\"\",RaceCard!BB125)","v":""},{"$f":"IF(RaceCard!BC125=\"\",\"\",RaceCard!BC125)","v":""},{"$f":"IF(AI124=\"\",\"\",IF(ISERROR(VLOOKUP(AI124,RaceCard!$AD$2:$AF$48,2,FALSE)),\"X\",VLOOKUP(AI124,RaceCard!$AD$2:$AF$48,3,FALSE)))","v":""},""]
[{"$nulls":31},125,"",{"$f":"IF(RaceCard!AY126=\"\",\"\",RaceCard!AY126)","v":""},{"$f":"IF(RaceCard!AZ126=\"\",\"\",RaceCard!AZ126)","v":""},{"$f":"IF(RaceCard!BA126=\"\",\"\",RaceCard!BA126)","v":""},{"$f":"IF(RaceCard!BB126=\"\",\"\",RaceCard!BB126)","v":""},{"$f":"IF(RaceCard!BC126=\"\",\"\",RaceCard!BC126)","v":""},{"$f":"IF(AI125=\"\",\"\",IF(ISERROR(VLOOKUP(AI125,RaceCard!$AD$2:$AF$48,2,FALSE)),\"X\",VLOOKUP(AI125,RaceCard!$AD$2:$AF$48,3,FALSE)))","v":""},""]
[{"$nulls":31},126,"",{"$f":"IF(RaceCard!AY127=\"\",\"\",RaceCard!AY127)","v":""},{"$f":"IF(RaceCard!AZ127=\"\",\"\",RaceCard!AZ127)","v":""},{"$f":"IF(RaceCard!BA127=\"\",\"\",RaceCard!BA127)","v":""},{"$f":"IF(RaceCard!BB127=\"\",\"\",RaceCard!BB127)","v":""},{"$f":"IF(RaceCard!BC127=\"\",\"\",RaceCard!BC127)","v":""},{"$f":"IF(AI126=\"\",\"\",IF(ISERROR(VLOOKUP(AI126,RaceCard!$AD$2:$AF$48,2,FALSE)),\"X\",VLOOKUP(AI126,RaceCard!$AD$2:$AF$48,3,FALSE)))","v":""},""]
[{"$nulls":31},127,"",{"$f":"IF(RaceCard!AY128=\"\",\"\",RaceCard!AY128)","v":""},{"$f":"IF(RaceCard!AZ128=\"\",\"\",RaceCard!AZ128)","v":""},{"$f":"IF(RaceCard!BA128=\"\",\"\",RaceCard!BA128)","v":""},{"$f":"IF(RaceCard!BB128=\"\",\"\",RaceCard!BB128)","v":""},{"$f":"IF(RaceCard!BC128=\"\",\"\",RaceCard!BC128)","v":""},{"$f":"IF(AI127=\"\",\"\",IF(ISERROR(VLOOKUP(AI127,RaceCard!$AD$2:$AF$48,2,FALSE)),\"X\",VLOOKUP(AI127,RaceCard!$AD$2:$AF$48,3,FALSE)))","v":""},""]
[{"$nulls":31},128,"",{"$f":"IF(RaceCard!AY129=\"\",\"\",RaceCard!AY129)","v":""},{"$f":"IF(RaceCard!AZ129=\"\",\"\",RaceCard!AZ129)","v":""},{"$f":"IF(RaceCard!BA129=\"\",\"\",RaceCard!BA129)","v":""},{"$f":"IF(RaceCard!BB129=\"\",\"\",RaceCard!BB129)","v":""},{"$f":"IF(RaceCard!BC129=\"\",\"\",RaceCard!BC129)","v":""},{"$f":"IF(AI128=\"\",\"\",IF(ISERROR(VLOOKUP(AI128,RaceCard!$AD$2:$AF$48,2,FALSE)),\"X\",VLOOKUP(AI128,RaceCard!$AD$2:$AF$48,3,FALSE)))","v":""},""]
[{"$nulls":31},129,"",{"$f":"IF(RaceCard!AY130=\"\",\"\",RaceCard!AY130)","v":""},{"$f":"IF(RaceCard!AZ130=\"\",\"\",RaceCard!AZ130)","v":""},{"$f":"IF(RaceCard!BA130=\"\",\"\",RaceCard!BA130)","v":""},{"$f":"IF(RaceCard!BB130=\"\",\"\",RaceCard!BB130)","v":""},{"$f":"IF(RaceCard!BC130=\"\",\"\",RaceCard!BC130)","v":""},{"$f":"IF(AI129=\"\",\"\",IF(ISERROR(VLOOKUP(AI129,RaceCard!$AD$2:$AF$48,2,FALSE)),\"X\",VLOOKUP(AI129,RaceCard!$AD$2:$AF$48,3,FALSE)))","v":""},""]
[{"$nulls":31},130,{"$f":"IF(AI130=\"\",\"\",CONCATENATE(TEXT(AH130,\"HH:MM AM/PM\"),\"-\",AI130,\"-\",AJ130))","v":""},{"$f":"IF(RaceCard!AY131=\"\",\"\",RaceCard!AY131)","v":""},{"$f":"IF(RaceCard!AZ131=\"\",\"\",RaceCard!AZ131)","v":""},{"$f":"IF(RaceCard!BA131=\"\",\"\",RaceCard!BA131)","v":""},{"$f":"IF(RaceCard!BB131=\"\",\"\",RaceCard!BB131)","v":""},{"$f":"IF(RaceCard!BC131=\"\",\"\",RaceCard!BC131)","v":""},{"$f":"IF(AI130=\"\",\"\",IF(ISERROR(VLOOKUP(AI130,RaceCard!$AD$2:$AF$48,2,FALSE)),\"X\",VLOOKUP(AI130,RaceCard!$AD$2:$AF$48,3,FALSE)))","v":""},""]
[{"$nulls":31},131,"",{"$f":"IF(RaceCard!AY132=\"\",\"\",RaceCard!AY132)","v":""},{"$f":"IF(RaceCard!AZ132=\"\",\"\",RaceCard!AZ132)","v":""},{"$f":"IF(RaceCard!BA132=\"\",\"\",RaceCard!BA132)","v":""},{"$f":"IF(RaceCard!BB132=\"\",\"\",RaceCard!BB132)","v":""},{"$f":"IF(RaceCard!BC132=\"\",\"\",RaceCard!BC132)","v":""},{"$f":"IF(AI131=\"\",\"\",IF(ISERROR(VLOOKUP(AI131,RaceCard!$AD$2:$AF$48,2,FALSE)),\"X\",VLOOKUP(AI131,RaceCard!$AD$2:$AF$48,3,FALSE)))","v":""},""]
[{"$nulls":31},132,"",{"$f":"IF(RaceCard!AY133=\"\",\"\",RaceCard!AY133)","v":""},{"$f":"IF(RaceCard!AZ133=\"\",\"\",RaceCard!AZ133)","v":""},{"$f":"IF(RaceCard!BA133=\"\",\"\",RaceCard!BA133)","v":""},{"$f":"IF(RaceCard!BB133=\"\",\"\",RaceCard!BB133)","v":""},{"$f":"IF(RaceCard!BC133=\"\",\"\",RaceCard!BC133)","v":""},{"$f":"IF(AI132=\"\",\"\",IF(ISERROR(VLOOKUP(AI132,RaceCard!$AD$2:$AF$48,2,FALSE)),\"X\",VLOOKUP(AI132,RaceCard!$AD$2:$AF$48,3,FALSE)))","v":""},""]
[{"$nulls":31},133,"",{"$f":"IF(RaceCard!AY134=\"\",\"\",RaceCard!AY134)","v":""},{"$f":"IF(RaceCard!AZ134=\"\",\"\",RaceCard!AZ134)","v":""},{"$f":"IF(RaceCard!BA134=\"\",\"\",RaceCard!BA134)","v":""},{"$f":"IF(RaceCard!BB134=\"\",\"\",RaceCard!BB134)","v":""},{"$f":"IF(RaceCard!BC134=\"\",\"\",RaceCard!BC134)","v":""},{"$f":"IF(AI133=\"\",\"\",IF(ISERROR(VLOOKUP(AI133,RaceCard!$AD$2:$AF$48,2,FALSE)),\"X\",VLOOKUP(AI133,RaceCard!$AD$2:$AF$48,3,FALSE)))","v":""},""]
[{"$nulls":31},134,"",{"$f":"IF(RaceCard!AY135=\"\",\"\",RaceCard!AY135)","v":""},{"$f":"IF(RaceCard!AZ135=\"\",\"\",RaceCard!AZ135)","v":""},{"$f":"IF(RaceCard!BA135=\"\",\"\",RaceCard!BA135)","v":""},{"$f":"IF(RaceCard!BB135=\"\",\"\",RaceCard!BB135)","v":""},{"$f":"IF(RaceCard!BC135=\"\",\"\",RaceCard!BC135)","v":""},{"$f":"IF(AI134=\"\",\"\",IF(ISERROR(VLOOKUP(AI134,RaceCard!$AD$2:$AF$48,2,FALSE)),\"X\",VLOOKUP(AI134,RaceCard!$AD$2:$AF$48,3,FALSE)))","v":""},""]
[{"$nulls":31},135,"",{"$f":"IF(RaceCard!AY136=\"\",\"\",RaceCard!AY136)","v":""},{"$f":"IF(RaceCard!AZ136=\"\",\"\",RaceCard!AZ136)","v":""},{"$f":"IF(RaceCard!BA136=\"\",\"\",RaceCard!BA136)","v":""},{"$f":"IF(RaceCard!BB136=\"\",\"\",RaceCard!BB136)","v":""},{"$f":"IF(RaceCard!BC136=\"\",\"\",RaceCard!BC136)","v":""},{"$f":"IF(AI135=\"\",\"\",IF(ISERROR(VLOOKUP(AI135,RaceCard!$AD$2:$AF$48,2,FALSE)),\"X\",VLOOKUP(AI135,RaceCard!$AD$2:$AF$48,3,FALSE)))","v":""},""]
[{"$nulls":31},136,"",{"$f":"IF(RaceCard!AY137=\"\",\"\",RaceCard!AY137)","v":""},{"$f":"IF(RaceCard!AZ137=\"\",\"\",RaceCard!AZ137)","v":""},{"$f":"IF(RaceCard!BA137=\"\",\"\",RaceCard!BA137)","v":""},{"$f":"IF(RaceCard!BB137=\"\",\"\",RaceCard!BB137)","v":""},{"$f":"IF(RaceCard!BC137=\"\",\"\",RaceCard!BC137)","v":""},{"$f":"IF(AI136=\"\",\"\",IF(ISERROR(VLOOKUP(AI136,RaceCard!$AD$2:$AF$48,2,FALSE)),\"X\",VLOOKUP(AI136,RaceCard!$AD$2:$AF$48,3,FALSE)))","v":""},""]
[{"$nulls":31},137,"",{"$f":"IF(RaceCard!AY138=\"\",\"\",RaceCard!AY138)","v":""},{"$f":"IF(RaceCard!AZ138=\"\",\"\",RaceCard!AZ138)","v":""},{"$f":"IF(RaceCard!BA138=\"\",\"\",RaceCard!BA138)","v":""},{"$f":"IF(RaceCard!BB138=\"\",\"\",RaceCard!BB138)","v":""},{"$f":"IF(RaceCard!BC138=\"\",\"\",RaceCard!BC138)","v":""},{"$f":"IF(AI137=\"\",\"\",IF(ISERROR(VLOOKUP(AI137,RaceCard!$AD$2:$AF$48,2,FALSE)),\"X\",VLOOKUP(AI137,RaceCard!$AD$2:$AF$48,3,FALSE)))","v":""},""]
[{"$nulls":31},138,"",{"$f":"IF(RaceCard!AY139=\"\",\"\",RaceCard!AY139)","v":""},{"$f":"IF(RaceCard!AZ139=\"\",\"\",RaceCard!AZ139)","v":""},{"$f":"IF(RaceCard!BA139=\"\",\"\",RaceCard!BA139)","v":""},{"$f":"IF(RaceCard!BB139=\"\",\"\",RaceCard!BB139)","v":""},{"$f":"IF(RaceCard!BC139=\"\",\"\",RaceCard!BC139)","v":""},{"$f":"IF(AI138=\"\",\"\",IF(ISERROR(VLOOKUP(AI138,RaceCard!$AD$2:$AF$48,2,FALSE)),\"X\",VLOOKUP(AI138,RaceCard!$AD$2:$AF$48,3,FALSE)))","v":""},""]
[{"$nulls":31},139,"",{"$f":"IF(RaceCard!AY140=\"\",\"\",RaceCard!AY140)","v":""},{"$f":"IF(RaceCard!AZ140=\"\",\"\",RaceCard!AZ140)","v":""},{"$f":"IF(RaceCard!BA140=\"\",\"\",RaceCard!BA140)","v":""},{"$f":"IF(RaceCard!BB140=\"\",\"\",RaceCard!BB140)","v":""},{"$f":"IF(RaceCard!BC140=\"\",\"\",RaceCard!BC140)","v":""},{"$f":"IF(AI139=\"\",\"\",IF(ISERROR(VLOOKUP(AI139,RaceCard!$AD$2:$AF$48,2,FALSE)),\"X\",VLOOKUP(AI139,RaceCard!$AD$2:$AF$48,3,FALSE)))","v":""},""]
[{"$nulls":31},140,"",{"$f":"IF(RaceCard!AY141=\"\",\"\",RaceCard!AY141)","v":""},{"$f":"IF(RaceCard!AZ141=\"\",\"\",RaceCard!AZ141)","v":""},{"$f":"IF(RaceCard!BA141=\"\",\"\",RaceCard!BA141)","v":""},{"$f":"IF(RaceCard!BB141=\"\",\"\",RaceCard!BB141)","v":""},{"$f":"IF(RaceCard!BC141=\"\",\"\",RaceCard!BC141)","v":""},{"$f":"IF(AI140=\"\",\"\",IF(ISERROR(VLOOKUP(AI140,RaceCard!$AD$2:$AF$48,2,FALSE)),\"X\",VLOOKUP(AI140,RaceCard!$AD$2:$AF$48,3,FALSE)))","v":""},""]
[{"$nulls":31},141,"",{"$f":"IF(RaceCard!AY142=\"\",\"\",RaceCard!AY142)","v":""},{"$f":"IF(RaceCard!AZ142=\"\",\"\",RaceCard!AZ142)","v":""},{"$f":"IF(RaceCard!BA142=\"\",\"\",RaceCard!BA142)","v":""},{"$f":"IF(RaceCard!BB142=\"\",\"\",RaceCard!BB142)","v":""},{"$f":"IF(RaceCard!BC142=\"\",\"\",RaceCard!BC142)","v":""},{"$f":"IF(AI141=\"\",\"\",IF(ISERROR(VLOOKUP(AI141,RaceCard!$AD$2:$AF$48,2,FALSE)),\"X\",VLOOKUP(AI141,RaceCard!$AD$2:$AF$48,3,FALSE)))","v":""},""]
[{"$nulls":31},142,"",{"$f":"IF(RaceCard!AY143=\"\",\"\",RaceCard!AY143)","v":""},{"$f":"IF(RaceCard!AZ143=\"\",\"\",RaceCard!AZ143)","v":""},{"$f":"IF(RaceCard!BA143=\"\",\"\",RaceCard!BA143)","v":""},{"$f":"IF(RaceCard!BB143=\"\",\"\",RaceCard!BB143)","v":""},{"$f":"IF(RaceCard!BC143=\"\",\"\",RaceCard!BC143)","v":""},{"$f":"IF(AI142=\"\",\"\",IF(ISERROR(VLOOKUP(AI142,RaceCard!$AD$2:$AF$48,2,FALSE)),\"X\",VLOOKUP(AI142,RaceCard!$AD$2:$AF$48,3,FALSE)))","v":""},""]
[{"$nulls":31},143,"",{"$f":"IF(RaceCard!AY144=\"\",\"\",RaceCard!AY144)","v":""},{"$f":"IF(RaceCard!AZ144=\"\",\"\",RaceCard!AZ144)","v":""},{"$f":"IF(RaceCard!BA144=\"\",\"\",RaceCard!BA144)","v":""},{"$f":"IF(RaceCard!BB144=\"\",\"\",RaceCard!BB144)","v":""},{"$f":"IF(RaceCard!BC144=\"\",\"\",RaceCard!BC144)","v":""},{"$f":"IF(AI143=\"\",\"\",IF(ISERROR(VLOOKUP(AI143,RaceCard!$AD$2:$AF$48,2,FALSE)),\"X\",VLOOKUP(AI143,RaceCard!$AD$2:$AF$48,3,FALSE)))","v":""},""]
[{"$nulls":31},144,"",{"$f":"IF(RaceCard!AY145=\"\",\"\",RaceCard!AY145)","v":""},{"$f":"IF(RaceCard!AZ145=\"\",\"\",RaceCard!AZ145)","v":""},{"$f":"IF(RaceCard!BA145=\"\",\"\",RaceCard!BA145)","v":""},{"$f":"IF(RaceCard!BB145=\"\",\"\",RaceCard!BB145)","v":""},{"$f":"IF(RaceCard!BC145=\"\",\"\",RaceCard!BC145)","v":""},{"$f":"IF(AI144=\"\",\"\",IF(ISERROR(VLOOKUP(AI144,RaceCard!$AD$2:$AF$48,2,FALSE)),\"X\",VLOOKUP(AI144,RaceCard!$AD$2:$AF$48,3,FALSE)))","v":""},""]
[{"$nulls":31},145,"",{"$f":"IF(RaceCard!AY146=\"\",\"\",RaceCard!AY146)","v":""},{"$f":"IF(RaceCard!AZ146=\"\",\"\",RaceCard!AZ146)","v":""},{"$f":"IF(RaceCard!BA146=\"\",\"\",RaceCard!BA146)","v":""},{"$f":"IF(RaceCard!BB146=\"\",\"\",RaceCard!BB146)","v":""},{"$f":"IF(RaceCard!BC146=\"\",\"\",RaceCard!BC146)","v":""},{"$f":"IF(AI145=\"\",\"\",IF(ISERROR(VLOOKUP(AI145,RaceCard!$AD$2:$AF$48,2,FALSE)),\"X\",VLOOKUP(AI145,RaceCard!$AD$2:$AF$48,3,FALSE)))","v":""},""]
[{"$nulls":31},146,"",{"$f":"IF(RaceCard!AY147=\"\",\"\",RaceCard!AY147)","v":""},{"$f":"IF(RaceCard!AZ147=\"\",\"\",RaceCard!AZ147)","v":""},{"$f":"IF(RaceCard!BA147=\"\",\"\",RaceCard!BA147)","v":""},{"$f":"IF(RaceCard!BB147=\"\",\"\",RaceCard!BB147)","v":""},{"$f":"IF(RaceCard!BC147=\"\",\"\",RaceCard!BC147)","v":""},{"$f":"IF(AI146=\"\",\"\",IF(ISERROR(VLOOKUP(AI146,RaceCard!$AD$2:$AF$48,2,FALSE)),\"X\",VLOOKUP(AI146,RaceCard!$AD$2:$AF$48,3,FALSE)))","v":""},""]
[{"$nulls":31},147,"",{"$f":"IF(RaceCard!AY148=\"\",\"\",RaceCard!AY148)","v":""},{"$f":"IF(RaceCard!AZ148=\"\",\"\",RaceCard!AZ148)","v":""},{"$f":"IF(RaceCard!BA148=\"\",\"\",RaceCard!BA148)","v":""},{"$f":"IF(RaceCard!BB148=\"\",\"\",RaceCard!BB148)","v":""},{"$f":"IF(RaceCard!BC148=\"\",\"\",RaceCard!BC148)","v":""},{"$f":"IF(AI147=\"\",\"\",IF(ISERROR(VLOOKUP(AI147,RaceCard!$AD$2:$AF$48,2,FALSE)),\"X\",VLOOKUP(AI147,RaceCard!$AD$2:$AF$48,3,FALSE)))","v":""},""]
[{"$nulls":31},148,"",{"$f":"IF(RaceCard!AY149=\"\",\"\",RaceCard!AY149)","v":""},{"$f":"IF(RaceCard!AZ149=\"\",\"\",RaceCard!AZ149)","v":""},{"$f":"IF(RaceCard!BA149=\"\",\"\",RaceCard!BA149)","v":""},{"$f":"IF(RaceCard!BB149=\"\",\"\",RaceCard!BB149)","v":""},{"$f":"IF(RaceCard!BC149=\"\",\"\",RaceCard!BC149)","v":""},{"$f":"IF(AI148=\"\",\"\",IF(ISERROR(VLOOKUP(AI148,RaceCard!$AD$2:$AF$48,2,FALSE)),\"X\",VLOOKUP(AI148,RaceCard!$AD$2:$AF$48,3,FALSE)))","v":""},""]
[{"$nulls":31},149,"",{"$f":"IF(RaceCard!AY150=\"\",\"\",RaceCard!AY150)","v":""},{"$f":"IF(RaceCard!AZ150=\"\",\"\",RaceCard!AZ150)","v":""},{"$f":"IF(RaceCard!BA150=\"\",\"\",RaceCard!BA150)","v":""},{"$f":"IF(RaceCard!BB150=\"\",\"\",RaceCard!BB150)","v":""},{"$f":"IF(RaceCard!BC150=\"\",\"\",RaceCard!BC150)","v":""},{"$f":"IF(AI149=\"\",\"\",IF(ISERROR(VLOOKUP(AI149,RaceCard!$AD$2:$AF$48,2,FALSE)),\"X\",VLOOKUP(AI149,RaceCard!$AD$2:$AF$48,3,FALSE)))","v":""},""]
[{"$nulls":31},150,"",{"$f":"IF(RaceCard!AY151=\"\",\"\",RaceCard!AY151)","v":""},{"$f":"IF(RaceCard!AZ151=\"\",\"\",RaceCard!AZ151)","v":""},{"$f":"IF(RaceCard!BA151=\"\",\"\",RaceCard!BA151)","v":""},{"$f":"IF(RaceCard!BB151=\"\",\"\",RaceCard!BB151)","v":""},{"$f":"IF(RaceCard!BC151=\"\",\"\",RaceCard!BC151)","v":""},{"$f":"IF(AI150=\"\",\"\",IF(ISERROR(VLOOKUP(AI150,RaceCard!$AD$2:$AF$48,2,FALSE)),\"X\",VLOOKUP(AI150,RaceCard!$AD$2:$AF$48,3,FALSE)))","v":""},""]
[{"$nulls":31},151,"",{"$f":"IF(RaceCard!AY152=\"\",\"\",RaceCard!AY152)","v":""},{"$f":"IF(RaceCard!AZ152=\"\",\"\",RaceCard!AZ152)","v":""},{"$f":"IF(RaceCard!BA152=\"\",\"\",RaceCard!BA152)","v":""},{"$f":"IF(RaceCard!BB152=\"\",\"\",RaceCard!BB152)","v":""},{"$f":"IF(RaceCard!BC152=\"\",\"\",RaceCard!BC152)","v":""},{"$f":"IF(AI151=\"\",\"\",IF(ISERROR(VLOOKUP(AI151,RaceCard!$AD$2:$AF$48,2,FALSE)),\"X\",VLOOKUP(AI151,RaceCard!$AD$2:$AF$48,3,FALSE)))","v":""},""]
[{"$nulls":31},152,"",{"$f":"IF(RaceCard!AY153=\"\",\"\",RaceCard!AY153)","v":""},{"$f":"IF(RaceCard!AZ153=\"\",\"\",RaceCard!AZ153)","v":""},{"$f":"IF(RaceCard!BA153=\"\",\"\",RaceCard!BA153)","v":""},{"$f":"IF(RaceCard!BB153=\"\",\"\",RaceCard!BB153)","v":""},{"$f":"IF(RaceCard!BC153=\"\",\"\",RaceCard!BC153)","v":""},{"$f":"IF(AI152=\"\",\"\",IF(ISERROR(VLOOKUP(AI152,RaceCard!$AD$2:$AF$48,2,FALSE)),\"X\",VLOOKUP(AI152,RaceCard!$AD$2:$AF$48,3,FALSE)))","v":""},{"$f":"IF(AG152=\"\",\"\",CONCATENATE(AM152,\"-\",TEXT(AJ152,\"00\")))","v":""}]
[{"$nulls":31},153,"",{"$f":"IF(RaceCard!AY154=\"\",\"\",RaceCard!AY154)","v":""},{"$f":"IF(RaceCard!AZ154=\"\",\"\",RaceCard!AZ154)","v":""},{"$f":"IF(RaceCard!BA154=\"\",\"\",RaceCard!BA154)","v":""},{"$f":"IF(RaceCard!BB154=\"\",\"\",RaceCard!BB154)","v":""},{"$f":"IF(RaceCard!BC154=\"\",\"\",RaceCard!BC154)","v":""},{"$f":"IF(AI153=\"\",\"\",IF(ISERROR(VLOOKUP(AI153,RaceCard!$AD$2:$AF$48,2,FALSE)),\"X\",VLOOKUP(AI153,RaceCard!$AD$2:$AF$48,3,FALSE)))","v":""},""]
[{"$nulls":31},154,"",{"$f":"IF(RaceCard!AY155=\"\",\"\",RaceCard!AY155)","v":""},{"$f":"IF(RaceCard!AZ155=\"\",\"\",RaceCard!AZ155)","v":""},{"$f":"IF(RaceCard!BA155=\"\",\"\",RaceCard!BA155)","v":""},{"$f":"IF(RaceCard!BB155=\"\",\"\",RaceCard!BB155)","v":""},{"$f":"IF(RaceCard!BC155=\"\",\"\",RaceCard!BC155)","v":""},{"$f":"IF(AI154=\"\",\"\",IF(ISERROR(VLOOKUP(AI154,RaceCard!$AD$2:$AF$48,2,FALSE)),\"X\",VLOOKUP(AI154,RaceCard!$AD$2:$AF$48,3,FALSE)))","v":""},""]
[{"$nulls":31},155,"",{"$f":"IF(RaceCard!AY156=\"\",\"\",RaceCard!AY156)","v":""},{"$f":"IF(RaceCard!AZ156=\"\",\"\",RaceCard!AZ156)","v":""},{"$f":"IF(RaceCard!BA156=\"\",\"\",RaceCard!BA156)","v":""},{"$f":"IF(RaceCard!BB156=\"\",\"\",RaceCard!BB156)","v":""},{"$f":"IF(RaceCard!BC156=\"\",\"\",RaceCard!BC156)","v":""},{"$f":"IF(AI155=\"\",\"\",IF(ISERROR(VLOOKUP(AI155,RaceCard!$AD$2:$AF$48,2,FALSE)),\"X\",VLOOKUP(AI155,RaceCard!$AD$2:$AF$48,3,FALSE)))","v":""},""]
[{"$nulls":31},156,"",{"$f":"IF(RaceCard!AY157=\"\",\"\",RaceCard!AY157)","v":""},{"$f":"IF(RaceCard!AZ157=\"\",\"\",RaceCard!AZ157)","v":""},{"$f":"IF(RaceCard!BA157=\"\",\"\",RaceCard!BA157)","v":""},{"$f":"IF(RaceCard!BB157=\"\",\"\",RaceCard!BB157)","v":""},{"$f":"IF(RaceCard!BC157=\"\",\"\",RaceCard!BC157)","v":""},{"$f":"IF(AI156=\"\",\"\",IF(ISERROR(VLOOKUP(AI156,RaceCard!$AD$2:$AF$48,2,FALSE)),\"X\",VLOOKUP(AI156,RaceCard!$AD$2:$AF$48,3,FALSE)))","v":""},""]
[{"$nulls":31},157,"",{"$f":"IF(RaceCard!AY158=\"\",\"\",RaceCard!AY158)","v":""},{"$f":"IF(RaceCard!AZ158=\"\",\"\",RaceCard!AZ158)","v":""},{"$f":"IF(RaceCard!BA158=\"\",\"\",RaceCard!BA158)","v":""},{"$f":"IF(RaceCard!BB158=\"\",\"\",RaceCard!BB158)","v":""},{"$f":"IF(RaceCard!BC158=\"\",\"\",RaceCard!BC158)","v":""},{"$f":"IF(AI157=\"\",\"\",IF(ISERROR(VLOOKUP(AI157,RaceCard!$AD$2:$AF$48,2,FALSE)),\"X\",VLOOKUP(AI157,RaceCard!$AD$2:$AF$48,3,FALSE)))","v":""},""]
[{"$nulls":31},158,"",{"$f":"IF(RaceCard!AY159=\"\",\"\",RaceCard!AY159)","v":""},{"$f":"IF(RaceCard!AZ159=\"\",\"\",RaceCard!AZ159)","v":""},{"$f":"IF(RaceCard!BA159=\"\",\"\",RaceCard!BA159)","v":""},{"$f":"IF(RaceCard!BB159=\"\",\"\",RaceCard!BB159)","v":""},{"$f":"IF(RaceCard!BC159=\"\",\"\",RaceCard!BC159)","v":""},{"$f":"IF(AI158=\"\",\"\",IF(ISERROR(VLOOKUP(AI158,RaceCard!$AD$2:$AF$48,2,FALSE)),\"X\",VLOOKUP(AI158,RaceCard!$AD$2:$AF$48,3,FALSE)))","v":""},""]
[{"$nulls":31},159,"",{"$f":"IF(RaceCard!AY160=\"\",\"\",RaceCard!AY160)","v":""},{"$f":"IF(RaceCard!AZ160=\"\",\"\",RaceCard!AZ160)","v":""},{"$f":"IF(RaceCard!BA160=\"\",\"\",RaceCard!BA160)","v":""},{"$f":"IF(RaceCard!BB160=\"\",\"\",RaceCard!BB160)","v":""},{"$f":"IF(RaceCard!BC160=\"\",\"\",RaceCard!BC160)","v":""},{"$f":"IF(AI159=\"\",\"\",IF(ISERROR(VLOOKUP(AI159,RaceCard!$AD$2:$AF$48,2,FALSE)),\"X\",VLOOKUP(AI159,RaceCard!$AD$2:$AF$48,3,FALSE)))","v":""},""]
[{"$nulls":31},160,"",{"$f":"IF(RaceCard!AY161=\"\",\"\",RaceCard!AY161)","v":""},{"$f":"IF(RaceCard!AZ161=\"\",\"\",RaceCard!AZ161)","v":""},{"$f":"IF(RaceCard!BA161=\"\",\"\",RaceCard!BA161)","v":""},{"$f":"IF(RaceCard!BB161=\"\",\"\",RaceCard!BB161)","v":""},{"$f":"IF(RaceCard!BC161=\"\",\"\",RaceCard!BC161)","v":""},{"$f":"IF(AI160=\"\",\"\",IF(ISERROR(VLOOKUP(AI160,RaceCard!$AD$2:$AF$48,2,FALSE)),\"X\",VLOOKUP(AI160,RaceCard!$AD$2:$AF$48,3,FALSE)))","v":""},""]
[{"$nulls":31},161,"",{"$f":"IF(RaceCard!AY162=\"\",\"\",RaceCard!AY162)","v":""},{"$f":"IF(RaceCard!AZ162=\"\",\"\",RaceCard!AZ162)","v":""},{"$f":"IF(RaceCard!BA162=\"\",\"\",RaceCard!BA162)","v":""},{"$f":"IF(RaceCard!BB162=\"\",\"\",RaceCard!BB162)","v":""},{"$f":"IF(RaceCard!BC162=\"\",\"\",RaceCard!BC162)","v":""},{"$f":"IF(AI161=\"\",\"\",IF(ISERROR(VLOOKUP(AI161,RaceCard!$AD$2:$AF$48,2,FALSE)),\"X\",VLOOKUP(AI161,RaceCard!$AD$2:$AF$48,3,FALSE)))","v":""},""]
[{"$nulls":31},162,"",{"$f":"IF(RaceCard!AY163=\"\",\"\",RaceCard!AY163)","v":""},{"$f":"IF(RaceCard!AZ163=\"\",\"\",RaceCard!AZ163)","v":""},{"$f":"IF(RaceCard!BA163=\"\",\"\",RaceCard!BA163)","v":""},{"$f":"IF(RaceCard!BB163=\"\",\"\",RaceCard!BB163)","v":""},{"$f":"IF(RaceCard!BC163=\"\",\"\",RaceCard!BC163)","v":""},{"$f":"IF(AI162=\"\",\"\",IF(ISERROR(VLOOKUP(AI162,RaceCard!$AD$2:$AF$48,2,FALSE)),\"X\",VLOOKUP(AI162,RaceCard!$AD$2:$AF$48,3,FALSE)))","v":""},""]
[{"$nulls":31},163,"",{"$f":"IF(RaceCard!AY164=\"\",\"\",RaceCard!AY164)","v":""},{"$f":"IF(RaceCard!AZ164=\"\",\"\",RaceCard!AZ164)","v":""},{"$f":"IF(RaceCard!BA164=\"\",\"\",RaceCard!BA164)","v":""},{"$f":"IF(RaceCard!BB164=\"\",\"\",RaceCard!BB164)","v":""},{"$f":"IF(RaceCard!BC164=\"\",\"\",RaceCard!BC164)","v":""},{"$f":"IF(AI163=\"\",\"\",IF(ISERROR(VLOOKUP(AI163,RaceCard!$AD$2:$AF$48,2,FALSE)),\"X\",VLOOKUP(AI163,RaceCard!$AD$2:$AF$48,3,FALSE)))","v":""},""]
[{"$nulls":31},164,"",{"$f":"IF(RaceCard!AY165=\"\",\"\",RaceCard!AY165)","v":""},{"$f":"IF(RaceCard!AZ165=\"\",\"\",RaceCard!AZ165)","v":""},{"$f":"IF(RaceCard!BA165=\"\",\"\",RaceCard!BA165)","v":""},{"$f":"IF(RaceCard!BB165=\"\",\"\",RaceCard!BB165)","v":""},{"$f":"IF(RaceCard!BC165=\"\",\"\",RaceCard!BC165)","v":""},{"$f":"IF(AI164=\"\",\"\",IF(ISERROR(VLOOKUP(AI164,RaceCard!$AD$2:$AF$48,2,FALSE)),\"X\",VLOOKUP(AI164,RaceCard!$AD$2:$AF$48,3,FALSE)))","v":""},""]
[{"$nulls":31},165,"",{"$f":"IF(RaceCard!AY166=\"\",\"\",RaceCard!AY166)","v":""},{"$f":"IF(RaceCard!AZ166=\"\",\"\",RaceCard!AZ166)","v":""},{"$f":"IF(RaceCard!BA166=\"\",\"\",RaceCard!BA166)","v":""},{"$f":"IF(RaceCard!BB166=\"\",\"\",RaceCard!BB166)","v":""},{"$f":"IF(RaceCard!BC166=\"\",\"\",RaceCard!BC166)","v":""},{"$f":"IF(AI165=\"\",\"\",IF(ISERROR(VLOOKUP(AI165,RaceCard!$AD$2:$AF$48,2,FALSE)),\"X\",VLOOKUP(AI165,RaceCard!$AD$2:$AF$48,3,FALSE)))","v":""},""]
[{"$nulls":31},166,"",{"$f":"IF(RaceCard!AY167=\"\",\"\",RaceCard!AY167)","v":""},{"$f":"IF(RaceCard!AZ167=\"\",\"\",RaceCard!AZ167)","v":""},{"$f":"IF(RaceCard!BA167=\"\",\"\",RaceCard!BA167)","v":""},{"$f":"IF(RaceCard!BB167=\"\",\"\",RaceCard!BB167)","v":""},{"$f":"IF(RaceCard!BC167=\"\",\"\",RaceCard!BC167)","v":""},{"$f":"IF(AI166=\"\",\"\",IF(ISERROR(VLOOKUP(AI166,RaceCard!$AD$2:$AF$48,2,FALSE)),\"X\",VLOOKUP(AI166,RaceCard!$AD$2:$AF$48,3,FALSE)))","v":""},""]
[{"$nulls":31},167,"",{"$f":"IF(RaceCard!AY168=\"\",\"\",RaceCard!AY168)","v":""},{"$f":"IF(RaceCard!AZ168=\"\",\"\",RaceCard!AZ168)","v":""},{"$f":"IF(RaceCard!BA168=\"\",\"\",RaceCard!BA168)","v":""},{"$f":"IF(RaceCard!BB168=\"\",\"\",RaceCard!BB168)","v":""},{"$f":"IF(RaceCard!BC168=\"\",\"\",RaceCard!BC168)","v":""},{"$f":"IF(AI167=\"\",\"\",IF(ISERROR(VLOOKUP(AI167,RaceCard!$AD$2:$AF$48,2,FALSE)),\"X\",VLOOKUP(AI167,RaceCard!$AD$2:$AF$48,3,FALSE)))","v":""},""]
[{"$nulls":31},168,"",{"$f":"IF(RaceCard!AY169=\"\",\"\",RaceCard!AY169)","v":""},{"$f":"IF(RaceCard!AZ169=\"\",\"\",RaceCard!AZ169)","v":""},{"$f":"IF(RaceCard!BA169=\"\",\"\",RaceCard!BA169)","v":""},{"$f":"IF(RaceCard!BB169=\"\",\"\",RaceCard!BB169)","v":""},{"$f":"IF(RaceCard!BC169=\"\",\"\",RaceCard!BC169)","v":""},{"$f":"IF(AI168=\"\",\"\",IF(ISERROR(VLOOKUP(AI168,RaceCard!$AD$2:$AF$48,2,FALSE)),\"X\",VLOOKUP(AI168,RaceCard!$AD$2:$AF$48,3,FALSE)))","v":""},""]
[{"$nulls":31},169,"",{"$f":"IF(RaceCard!AY170=\"\",\"\",RaceCard!AY170)","v":""},{"$f":"IF(RaceCard!AZ170=\"\",\"\",RaceCard!AZ170)","v":""},{"$f":"IF(RaceCard!BA170=\"\",\"\",RaceCard!BA170)","v":""},{"$f":"IF(RaceCard!BB170=\"\",\"\",RaceCard!BB170)","v":""},{"$f":"IF(RaceCard!BC170=\"\",\"\",RaceCard!BC170)","v":""},{"$f":"IF(AI169=\"\",\"\",IF(ISERROR(VLOOKUP(AI169,RaceCard!$AD$2:$AF$48,2,FALSE)),\"X\",VLOOKUP(AI169,RaceCard!$AD$2:$AF$48,3,FALSE)))","v":""},""]
[{"$nulls":31},170,"",{"$f":"IF(RaceCard!AY171=\"\",\"\",RaceCard!AY171)","v":""},{"$f":"IF(RaceCard!AZ171=\"\",\"\",RaceCard!AZ171)","v":""},{"$f":"IF(RaceCard!BA171=\"\",\"\",RaceCard!BA171)","v":""},{"$f":"IF(RaceCard!BB171=\"\",\"\",RaceCard!BB171)","v":""},{"$f":"IF(RaceCard!BC171=\"\",\"\",RaceCard!BC171)","v":""},{"$f":"IF(AI170=\"\",\"\",IF(ISERROR(VLOOKUP(AI170,RaceCard!$AD$2:$AF$48,2,FALSE)),\"X\",VLOOKUP(AI170,RaceCard!$AD$2:$AF$48,3,FALSE)))","v":""},""]
[{"$nulls":31},171,"",{"$f":"IF(RaceCard!AY172=\"\",\"\",RaceCard!AY172)","v":""},{"$f":"IF(RaceCard!AZ172=\"\",\"\",RaceCard!AZ172)","v":""},{"$f":"IF(RaceCard!BA172=\"\",\"\",RaceCard!BA172)","v":""},{"$f":"IF(RaceCard!BB172=\"\",\"\",RaceCard!BB172)","v":""},{"$f":"IF(RaceCard!BC172=\"\",\"\",RaceCard!BC172)","v":""},{"$f":"IF(AI171=\"\",\"\",IF(ISERROR(VLOOKUP(AI171,RaceCard!$AD$2:$AF$48,2,FALSE)),\"X\",VLOOKUP(AI171,RaceCard!$AD$2:$AF$48,3,FALSE)))","v":""},""]
[{"$nulls":31},172,"",{"$f":"IF(RaceCard!AY173=\"\",\"\",RaceCard!AY173)","v":""},{"$f":"IF(RaceCard!AZ173=\"\",\"\",RaceCard!AZ173)","v":""},{"$f":"IF(RaceCard!BA173=\"\",\"\",RaceCard!BA173)","v":""},{"$f":"IF(RaceCard!BB173=\"\",\"\",RaceCard!BB173)","v":""},{"$f":"IF(RaceCard!BC173=\"\",\"\",RaceCard!BC173)","v":""},{"$f":"IF(AI172=\"\",\"\",IF(ISERROR(VLOOKUP(AI172,RaceCard!$AD$2:$AF$48,2,FALSE)),\"X\",VLOOKUP(AI172,RaceCard!$AD$2:$AF$48,3,FALSE)))","v":""},""]
[{"$nulls":31},173,"",{"$f":"IF(RaceCard!AY174=\"\",\"\",RaceCard!AY174)","v":""},{"$f":"IF(RaceCard!AZ174=\"\",\"\",RaceCard!AZ174)","v":""},{"$f":"IF(RaceCard!BA174=\"\",\"\",RaceCard!BA174)","v":""},{"$f":"IF(RaceCard!BB174=\"\",\"\",RaceCard!BB174)","v":""},{"$f":"IF(RaceCard!BC174=\"\",\"\",RaceCard!BC174)","v":""},{"$f":"IF(AI173=\"\",\"\",IF(ISERROR(VLOOKUP(AI173,RaceCard!$AD$2:$AF$48,2,FALSE)),\"X\",VLOOKUP(AI173,RaceCard!$AD$2:$AF$48,3,FALSE)))","v":""},""]
[{"$nulls":31},174,"",{"$f":"IF(RaceCard!AY175=\"\",\"\",RaceCard!AY175)","v":""},{"$f":"IF(RaceCard!AZ175=\"\",\"\",RaceCard!AZ175)","v":""},{"$f":"IF(RaceCard!BA175=\"\",\"\",RaceCard!BA175)","v":""},{"$f":"IF(RaceCard!BB175=\"\",\"\",RaceCard!BB175)","v":""},{"$f":"IF(RaceCard!BC175=\"\",\"\",RaceCard!BC175)","v":""},{"$f":"IF(AI174=\"\",\"\",IF(ISERROR(VLOOKUP(AI174,RaceCard!$AD$2:$AF$48,2,FALSE)),\"X\",VLOOKUP(AI174,RaceCard!$AD$2:$AF$48,3,FALSE)))","v":""},""]
[{"$nulls":31},175,"",{"$f":"IF(RaceCard!AY176=\"\",\"\",RaceCard!AY176)","v":""},{"$f":"IF(RaceCard!AZ176=\"\",\"\",RaceCard!AZ176)","v":""},{"$f":"IF(RaceCard!BA176=\"\",\"\",RaceCard!BA176)","v":""},{"$f":"IF(RaceCard!BB176=\"\",\"\",RaceCard!BB176)","v":""},{"$f":"IF(RaceCard!BC176=\"\",\"\",RaceCard!BC176)","v":""},{"$f":"IF(AI175=\"\",\"\",IF(ISERROR(VLOOKUP(AI175,RaceCard!$AD$2:$AF$48,2,FALSE)),\"X\",VLOOKUP(AI175,RaceCard!$AD$2:$AF$48,3,FALSE)))","v":""},""]
[{"$nulls":31},176,"",{"$f":"IF(RaceCard!AY177=\"\",\"\",RaceCard!AY177)","v":""},{"$f":"IF(RaceCard!AZ177=\"\",\"\",RaceCard!AZ177)","v":""},{"$f":"IF(RaceCard!BA177=\"\",\"\",RaceCard!BA177)","v":""},{"$f":"IF(RaceCard!BB177=\"\",\"\",RaceCard!BB177)","v":""},{"$f":"IF(RaceCard!BC177=\"\",\"\",RaceCard!BC177)","v":""},{"$f":"IF(AI176=\"\",\"\",IF(ISERROR(VLOOKUP(AI176,RaceCard!$AD$2:$AF$48,2,FALSE)),\"X\",VLOOKUP(AI176,RaceCard!$AD$2:$AF$48,3,FALSE)))","v":""},""]
[{"$nulls":31},177,"",{"$f":"IF(RaceCard!AY178=\"\",\"\",RaceCard!AY178)","v":""},{"$f":"IF(RaceCard!AZ178=\"\",\"\",RaceCard!AZ178)","v":""},{"$f":"IF(RaceCard!BA178=\"\",\"\",RaceCard!BA178)","v":""},{"$f":"IF(RaceCard!BB178=\"\",\"\",RaceCard!BB178)","v":""},{"$f":"IF(RaceCard!BC178=\"\",\"\",RaceCard!BC178)","v":""},{"$f":"IF(AI177=\"\",\"\",IF(ISERROR(VLOOKUP(AI177,RaceCard!$AD$2:$AF$48,2,FALSE)),\"X\",VLOOKUP(AI177,RaceCard!$AD$2:$AF$48,3,FALSE)))","v":""},""]
[{"$nulls":31},178,"",{"$f":"IF(RaceCard!AY179=\"\",\"\",RaceCard!AY179)","v":""},{"$f":"IF(RaceCard!AZ179=\"\",\"\",RaceCard!AZ179)","v":""},{"$f":"IF(RaceCard!BA179=\"\",\"\",RaceCard!BA179)","v":""},{"$f":"IF(RaceCard!BB179=\"\",\"\",RaceCard!BB179)","v":""},{"$f":"IF(RaceCard!BC179=\"\",\"\",RaceCard!BC179)","v":""},{"$f":"IF(AI178=\"\",\"\",IF(ISERROR(VLOOKUP(AI178,RaceCard!$AD$2:$AF$48,2,FALSE)),\"X\",VLOOKUP(AI178,RaceCard!$AD$2:$AF$48,3,FALSE)))","v":""},""]
[{"$nulls":31},179,"",{"$f":"IF(RaceCard!AY180=\"\",\"\",RaceCard!AY180)","v":""},{"$f":"IF(RaceCard!AZ180=\"\",\"\",RaceCard!AZ180)","v":""},{"$f":"IF(RaceCard!BA180=\"\",\"\",RaceCard!BA180)","v":""},{"$f":"IF(RaceCard!BB180=\"\",\"\",RaceCard!BB180)","v":""},{"$f":"IF(RaceCard!BC180=\"\",\"\",RaceCard!BC180)","v":""},{"$f":"IF(AI179=\"\",\"\",IF(ISERROR(VLOOKUP(AI179,RaceCard!$AD$2:$AF$48,2,FALSE)),\"X\",VLOOKUP(AI179,RaceCard!$AD$2:$AF$48,3,FALSE)))","v":""},""]
[{"$nulls":31},180,"",{"$f":"IF(RaceCard!AY181=\"\",\"\",RaceCard!AY181)","v":""},{"$f":"IF(RaceCard!AZ181=\"\",\"\",RaceCard!AZ181)","v":""},{"$f":"IF(RaceCard!BA181=\"\",\"\",RaceCard!BA181)","v":""},{"$f":"IF(RaceCard!BB181=\"\",\"\",RaceCard!BB181)","v":""},{"$f":"IF(RaceCard!BC181=\"\",\"\",RaceCard!BC181)","v":""},{"$f":"IF(AI180=\"\",\"\",IF(ISERROR(VLOOKUP(AI180,RaceCard!$AD$2:$AF$48,2,FALSE)),\"X\",VLOOKUP(AI180,RaceCard!$AD$2:$AF$48,3,FALSE)))","v":""},""]
[{"$nulls":31},181,"",{"$f":"IF(RaceCard!AY182=\"\",\"\",RaceCard!AY182)","v":""},{"$f":"IF(RaceCard!AZ182=\"\",\"\",RaceCard!AZ182)","v":""},{"$f":"IF(RaceCard!BA182=\"\",\"\",RaceCard!BA182)","v":""},{"$f":"IF(RaceCard!BB182=\"\",\"\",RaceCard!BB182)","v":""},{"$f":"IF(RaceCard!BC182=\"\",\"\",RaceCard!BC182)","v":""},{"$f":"IF(AI181=\"\",\"\",IF(ISERROR(VLOOKUP(AI181,RaceCard!$AD$2:$AF$48,2,FALSE)),\"X\",VLOOKUP(AI181,RaceCard!$AD$2:$AF$48,3,FALSE)))","v":""},""]
[{"$nulls":31},182,"",{"$f":"IF(RaceCard!AY183=\"\",\"\",RaceCard!AY183)","v":""},{"$f":"IF(RaceCard!AZ183=\"\",\"\",RaceCard!AZ183)","v":""},{"$f":"IF(RaceCard!BA183=\"\",\"\",RaceCard!BA183)","v":""},{"$f":"IF(RaceCard!BB183=\"\",\"\",RaceCard!BB183)","v":""},{"$f":"IF(RaceCard!BC183=\"\",\"\",RaceCard!BC183)","v":""},{"$f":"IF(AI182=\"\",\"\",IF(ISERROR(VLOOKUP(AI182,RaceCard!$AD$2:$AF$48,2,FALSE)),\"X\",VLOOKUP(AI182,RaceCard!$AD$2:$AF$48,3,FALSE)))","v":""},""]
[{"$nulls":31},183,"",{"$f":"IF(RaceCard!AY184=\"\",\"\",RaceCard!AY184)","v":""},{"$f":"IF(RaceCard!AZ184=\"\",\"\",RaceCard!AZ184)","v":""},{"$f":"IF(RaceCard!BA184=\"\",\"\",RaceCard!BA184)","v":""},{"$f":"IF(RaceCard!BB184=\"\",\"\",RaceCard!BB184)","v":""},{"$f":"IF(RaceCard!BC184=\"\",\"\",RaceCard!BC184)","v":""},{"$f":"IF(AI183=\"\",\"\",IF(ISERROR(VLOOKUP(AI183,RaceCard!$AD$2:$AF$48,2,FALSE)),\"X\",VLOOKUP(AI183,RaceCard!$AD$2:$AF$48,3,FALSE)))","v":""},""]
[{"$nulls":31},184,"",{"$f":"IF(RaceCard!AY185=\"\",\"\",RaceCard!AY185)","v":""},{"$f":"IF(RaceCard!AZ185=\"\",\"\",RaceCard!AZ185)","v":""},{"$f":"IF(RaceCard!BA185=\"\",\"\",RaceCard!BA185)","v":""},{"$f":"IF(RaceCard!BB185=\"\",\"\",RaceCard!BB185)","v":""},{"$f":"IF(RaceCard!BC185=\"\",\"\",RaceCard!BC185)","v":""},{"$f":"IF(AI184=\"\",\"\",IF(ISERROR(VLOOKUP(AI184,RaceCard!$AD$2:$AF$48,2,FALSE)),\"X\",VLOOKUP(AI184,RaceCard!$AD$2:$AF$48,3,FALSE)))","v":""},""]
[{"$nulls":31},185,"",{"$f":"IF(RaceCard!AY186=\"\",\"\",RaceCard!AY186)","v":""},{"$f":"IF(RaceCard!AZ186=\"\",\"\",RaceCard!AZ186)","v":""},{"$f":"IF(RaceCard!BA186=\"\",\"\",RaceCard!BA186)","v":""},{"$f":"IF(RaceCard!BB186=\"\",\"\",RaceCard!BB186)","v":""},{"$f":"IF(RaceCard!BC186=\"\",\"\",RaceCard!BC186)","v":""},{"$f":"IF(AI185=\"\",\"\",IF(ISERROR(VLOOKUP(AI185,RaceCard!$AD$2:$AF$48,2,FALSE)),\"X\",VLOOKUP(AI185,RaceCard!$AD$2:$AF$48,3,FALSE)))","v":""},""]
[{"$nulls":31},186,"",{"$f":"IF(RaceCard!AY187=\"\",\"\",RaceCard!AY187)","v":""},{"$f":"IF(RaceCard!AZ187=\"\",\"\",RaceCard!AZ187)","v":""},{"$f":"IF(RaceCard!BA187=\"\",\"\",RaceCard!BA187)","v":""},{"$f":"IF(RaceCard!BB187=\"\",\"\",RaceCard!BB187)","v":""},{"$f":"IF(RaceCard!BC187=\"\",\"\",RaceCard!BC187)","v":""},{"$f":"IF(AI186=\"\",\"\",IF(ISERROR(VLOOKUP(AI186,RaceCard!$AD$2:$AF$48,2,FALSE)),\"X\",VLOOKUP(AI186,RaceCard!$AD$2:$AF$48,3,FALSE)))","v":""},""]
[{"$nulls":31},187,"",{"$f":"IF(RaceCard!AY188=\"\",\"\",RaceCard!AY188)","v":""},{"$f":"IF(RaceCard!AZ188=\"\",\"\",RaceCard!AZ188)","v":""},{"$f":"IF(RaceCard!BA188=\"\",\"\",RaceCard!BA188)","v":""},{"$f":"IF(RaceCard!BB188=\"\",\"\",RaceCard!BB188)","v":""},{"$f":"IF(RaceCard!BC188=\"\",\"\",RaceCard!BC188)","v":""},{"$f":"IF(AI187=\"\",\"\",IF(ISERROR(VLOOKUP(AI187,RaceCard!$AD$2:$AF$48,2,FALSE)),\"X\",VLOOKUP(AI187,RaceCard!$AD$2:$AF$48,3,FALSE)))","v":""},""]
[{"$nulls":31},188,"",{"$f":"IF(RaceCard!AY189=\"\",\"\",RaceCard!AY189)","v":""},{"$f":"IF(RaceCard!AZ189=\"\",\"\",RaceCard!AZ189)","v":""},{"$f":"IF(RaceCard!BA189=\"\",\"\",RaceCard!BA189)","v":""},{"$f":"IF(RaceCard!BB189=\"\",\"\",RaceCard!BB189)","v":""},{"$f":"IF(RaceCard!BC189=\"\",\"\",RaceCard!BC189)","v":""},{"$f":"IF(AI188=\"\",\"\",IF(ISERROR(VLOOKUP(AI188,RaceCard!$AD$2:$AF$48,2,FALSE)),\"X\",VLOOKUP(AI188,RaceCard!$AD$2:$AF$48,3,FALSE)))","v":""},""]
[{"$nulls":31},189,"",{"$f":"IF(RaceCard!AY190=\"\",\"\",RaceCard!AY190)","v":""},{"$f":"IF(RaceCard!AZ190=\"\",\"\",RaceCard!AZ190)","v":""},{"$f":"IF(RaceCard!BA190=\"\",\"\",RaceCard!BA190)","v":""},{"$f":"IF(RaceCard!BB190=\"\",\"\",RaceCard!BB190)","v":""},{"$f":"IF(RaceCard!BC190=\"\",\"\",RaceCard!BC190)","v":""},{"$f":"IF(AI189=\"\",\"\",IF(ISERROR(VLOOKUP(AI189,RaceCard!$AD$2:$AF$48,2,FALSE)),\"X\",VLOOKUP(AI189,RaceCard!$AD$2:$AF$48,3,FALSE)))","v":""},""]
[{"$nulls":31},190,"",{"$f":"IF(RaceCard!AY191=\"\",\"\",RaceCard!AY191)","v":""},{"$f":"IF(RaceCard!AZ191=\"\",\"\",RaceCard!AZ191)","v":""},{"$f":"IF(RaceCard!BA191=\"\",\"\",RaceCard!BA191)","v":""},{"$f":"IF(RaceCard!BB191=\"\",\"\",RaceCard!BB191)","v":""},{"$f":"IF(RaceCard!BC191=\"\",\"\",RaceCard!BC191)","v":""},{"$f":"IF(AI190=\"\",\"\",IF(ISERROR(VLOOKUP(AI190,RaceCard!$AD$2:$AF$48,2,FALSE)),\"X\",VLOOKUP(AI190,RaceCard!$AD$2:$AF$48,3,FALSE)))","v":""},""]
[{"$nulls":31},191,"",{"$f":"IF(RaceCard!AY192=\"\",\"\",RaceCard!AY192)","v":""},{"$f":"IF(RaceCard!AZ192=\"\",\"\",RaceCard!AZ192)","v":""},{"$f":"IF(RaceCard!BA192=\"\",\"\",RaceCard!BA192)","v":""},{"$f":"IF(RaceCard!BB192=\"\",\"\",RaceCard!BB192)","v":""},{"$f":"IF(RaceCard!BC192=\"\",\"\",RaceCard!BC192)","v":""},{"$f":"IF(AI191=\"\",\"\",IF(ISERROR(VLOOKUP(AI191,RaceCard!$AD$2:$AF$48,2,FALSE)),\"X\",VLOOKUP(AI191,RaceCard!$AD$2:$AF$48,3,FALSE)))","v":""},""]
[{"$nulls":31},192,"",{"$f":"IF(RaceCard!AY193=\"\",\"\",RaceCard!AY193)","v":""},{"$f":"IF(RaceCard!AZ193=\"\",\"\",RaceCard!AZ193)","v":""},{"$f":"IF(RaceCard!BA193=\"\",\"\",RaceCard!BA193)","v":""},{"$f":"IF(RaceCard!BB193=\"\",\"\",RaceCard!BB193)","v":""},{"$f":"IF(RaceCard!BC193=\"\",\"\",RaceCard!BC193)","v":""},{"$f":"IF(AI192=\"\",\"\",IF(ISERROR(VLOOKUP(AI192,RaceCard!$AD$2:$AF$48,2,FALSE)),\"X\",VLOOKUP(AI192,RaceCard!$AD$2:$AF$48,3,FALSE)))","v":""},""]
[{"$nulls":31},193,"",{"$f":"IF(RaceCard!AY194=\"\",\"\",RaceCard!AY194)","v":""},{"$f":"IF(RaceCard!AZ194=\"\",\"\",RaceCard!AZ194)","v":""},{"$f":"IF(RaceCard!BA194=\"\",\"\",RaceCard!BA194)","v":""},{"$f":"IF(RaceCard!BB194=\"\",\"\",RaceCard!BB194)","v":""},{"$f":"IF(RaceCard!BC194=\"\",\"\",RaceCard!BC194)","v":""},{"$f":"IF(AI193=\"\",\"\",IF(ISERROR(VLOOKUP(AI193,RaceCard!$AD$2:$AF$48,2,FALSE)),\"X\",VLOOKUP(AI193,RaceCard!$AD$2:$AF$48,3,FALSE)))","v":""},""]
[{"$nulls":31},194,{"$f":"IF(AI194=\"\",\"\",CONCATENATE(TEXT(AH194,\"HH:MM AM/PM\"),\"-\",AI194,\"-\",AJ194))","v":""},{"$f":"IF(RaceCard!AY195=\"\",\"\",RaceCard!AY195)","v":""},{"$f":"IF(RaceCard!AZ195=\"\",\"\",RaceCard!AZ195)","v":""},{"$f":"IF(RaceCard!BA195=\"\",\"\",RaceCard!BA195)","v":""},{"$f":"IF(RaceCard!BB195=\"\",\"\",RaceCard!BB195)","v":""},{"$f":"IF(RaceCard!BC195=\"\",\"\",RaceCard!BC195)","v":""},{"$f":"IF(AI194=\"\",\"\",IF(ISERROR(VLOOKUP(AI194,RaceCard!$AD$2:$AF$48,2,FALSE)),\"X\",VLOOKUP(AI194,RaceCard!$AD$2:$AF$48,3,FALSE)))","v":""},""]
[{"$nulls":31},195,"",{"$f":"IF(RaceCard!AY196=\"\",\"\",RaceCard!AY196)","v":""},{"$f":"IF(RaceCard!AZ196=\"\",\"\",RaceCard!AZ196)","v":""},{"$f":"IF(RaceCard!BA196=\"\",\"\",RaceCard!BA196)","v":""},{"$f":"IF(RaceCard!BB196=\"\",\"\",RaceCard!BB196)","v":""},{"$f":"IF(RaceCard!BC196=\"\",\"\",RaceCard!BC196)","v":""},{"$f":"IF(AI195=\"\",\"\",IF(ISERROR(VLOOKUP(AI195,RaceCard!$AD$2:$AF$48,2,FALSE)),\"X\",VLOOKUP(AI195,RaceCard!$AD$2:$AF$48,3,FALSE)))","v":""},""]
[{"$nulls":31},196,"",{"$f":"IF(RaceCard!AY197=\"\",\"\",RaceCard!AY197)","v":""},{"$f":"IF(RaceCard!AZ197=\"\",\"\",RaceCard!AZ197)","v":""},{"$f":"IF(RaceCard!BA197=\"\",\"\",RaceCard!BA197)","v":""},{"$f":"IF(RaceCard!BB197=\"\",\"\",RaceCard!BB197)","v":""},{"$f":"IF(RaceCard!BC197=\"\",\"\",RaceCard!BC197)","v":""},{"$f":"IF(AI196=\"\",\"\",IF(ISERROR(VLOOKUP(AI196,RaceCard!$AD$2:$AF$48,2,FALSE)),\"X\",VLOOKUP(AI196,RaceCard!$AD$2:$AF$48,3,FALSE)))","v":""},""]
[{"$nulls":31},197,"",{"$f":"IF(RaceCard!AY198=\"\",\"\",RaceCard!AY198)","v":""},{"$f":"IF(RaceCard!AZ198=\"\",\"\",RaceCard!AZ198)","v":""},{"$f":"IF(RaceCard!BA198=\"\",\"\",RaceCard!BA198)","v":""},{"$f":"IF(RaceCard!BB198=\"\",\"\",RaceCard!BB198)","v":""},{"$f":"IF(RaceCard!BC198=\"\",\"\",RaceCard!BC198)","v":""},{"$f":"IF(AI197=\"\",\"\",IF(ISERROR(VLOOKUP(AI197,RaceCard!$AD$2:$AF$48,2,FALSE)),\"X\",VLOOKUP(AI197,RaceCard!$AD$2:$AF$48,3,FALSE)))","v":""},""]
[{"$nulls":31},198,"",{"$f":"IF(RaceCard!AY199=\"\",\"\",RaceCard!AY199)","v":""},{"$f":"IF(RaceCard!AZ199=\"\",\"\",RaceCard!AZ199)","v":""},{"$f":"IF(RaceCard!BA199=\"\",\"\",RaceCard!BA199)","v":""},{"$f":"IF(RaceCard!BB199=\"\",\"\",RaceCard!BB199)","v":""},{"$f":"IF(RaceCard!BC199=\"\",\"\",RaceCard!BC199)","v":""},{"$f":"IF(AI198=\"\",\"\",IF(ISERROR(VLOOKUP(AI198,RaceCard!$AD$2:$AF$48,2,FALSE)),\"X\",VLOOKUP(AI198,RaceCard!$AD$2:$AF$48,3,FALSE)))","v":""},""]
[{"$nulls":31},199,"",{"$f":"IF(RaceCard!AY200=\"\",\"\",RaceCard!AY200)","v":""},{"$f":"IF(RaceCard!AZ200=\"\",\"\",RaceCard!AZ200)","v":""},{"$f":"IF(RaceCard!BA200=\"\",\"\",RaceCard!BA200)","v":""},{"$f":"IF(RaceCard!BB200=\"\",\"\",RaceCard!BB200)","v":""},{"$f":"IF(RaceCard!BC200=\"\",\"\",RaceCard!BC200)","v":""},{"$f":"IF(AI199=\"\",\"\",IF(ISERROR(VLOOKUP(AI199,RaceCard!$AD$2:$AF$48,2,FALSE)),\"X\",VLOOKUP(AI199,RaceCard!$AD$2:$AF$48,3,FALSE)))","v":""},""]
[{"$nulls":31},200,"",{"$f":"IF(RaceCard!AY201=\"\",\"\",RaceCard!AY201)","v":""},{"$f":"IF(RaceCard!AZ201=\"\",\"\",RaceCard!AZ201)","v":""},{"$f":"IF(RaceCard!BA201=\"\",\"\",RaceCard!BA201)","v":""},{"$f":"IF(RaceCard!BB201=\"\",\"\",RaceCard!BB201)","v":""},{"$f":"IF(RaceCard!BC201=\"\",\"\",RaceCard!BC201)","v":""},{"$f":"IF(AI200=\"\",\"\",IF(ISERROR(VLOOKUP(AI200,RaceCard!$AD$2:$AF$48,2,FALSE)),\"X\",VLOOKUP(AI200,RaceCard!$AD$2:$AF$48,3,FALSE)))","v":""},""]
[{"$nulls":31},201,"",{"$f":"IF(RaceCard!AY202=\"\",\"\",RaceCard!AY202)","v":""},{"$f":"IF(RaceCard!AZ202=\"\",\"\",RaceCard!AZ202)","v":""},{"$f":"IF(RaceCard!BA202=\"\",\"\",RaceCard!BA202)","v":""},{"$f":"IF(RaceCard!BB202=\"\",\"\",RaceCard!BB202)","v":""},{"$f":"IF(RaceCard!BC202=\"\",\"\",RaceCard!BC202)","v":""},{"$f":"IF(AI201=\"\",\"\",IF(ISERROR(VLOOKUP(AI201,RaceCard!$AD$2:$AF$48,2,FALSE)),\"X\",VLOOKUP(AI201,RaceCard!$AD$2:$AF$48,3,FALSE)))","v":""},""]
[{"$nulls":31},202,"",{"$f":"IF(RaceCard!AY203=\"\",\"\",RaceCard!AY203)","v":""},{"$f":"IF(RaceCard!AZ203=\"\",\"\",RaceCard!AZ203)","v":""},{"$f":"IF(RaceCard!BA203=\"\",\"\",RaceCard!BA203)","v":""},{"$f":"IF(RaceCard!BB203=\"\",\"\",RaceCard!BB203)","v":""},{"$f":"IF(RaceCard!BC203=\"\",\"\",RaceCard!BC203)","v":""},{"$f":"IF(AI202=\"\",\"\",IF(ISERROR(VLOOKUP(AI202,RaceCard!$AD$2:$AF$48,2,FALSE)),\"X\",VLOOKUP(AI202,RaceCard!$AD$2:$AF$48,3,FALSE)))","v":""},""]
[{"$nulls":31},203,"",{"$f":"IF(RaceCard!AY204=\"\",\"\",RaceCard!AY204)","v":""},{"$f":"IF(RaceCard!AZ204=\"\",\"\",RaceCard!AZ204)","v":""},{"$f":"IF(RaceCard!BA204=\"\",\"\",RaceCard!BA204)","v":""},{"$f":"IF(RaceCard!BB204=\"\",\"\",RaceCard!BB204)","v":""},{"$f":"IF(RaceCard!BC204=\"\",\"\",RaceCard!BC204)","v":""},{"$f":"IF(AI203=\"\",\"\",IF(ISERROR(VLOOKUP(AI203,RaceCard!$AD$2:$AF$48,2,FALSE)),\"X\",VLOOKUP(AI203,RaceCard!$AD$2:$AF$48,3,FALSE)))","v":""},""]
[{"$nulls":31},204,"",{"$f":"IF(RaceCard!AY205=\"\",\"\",RaceCard!AY205)","v":""},{"$f":"IF(RaceCard!AZ205=\"\",\"\",RaceCard!AZ205)","v":""},{"$f":"IF(RaceCard!BA205=\"\",\"\",RaceCard!BA205)","v":""},{"$f":"IF(RaceCard!BB205=\"\",\"\",RaceCard!BB205)","v":""},{"$f":"IF(RaceCard!BC205=\"\",\"\",RaceCard!BC205)","v":""},{"$f":"IF(AI204=\"\",\"\",IF(ISERROR(VLOOKUP(AI204,RaceCard!$AD$2:$AF$48,2,FALSE)),\"X\",VLOOKUP(AI204,RaceCard!$AD$2:$AF$48,3,FALSE)))","v":""},""]
[{"$nulls":31},205,"",{"$f":"IF(RaceCard!AY206=\"\",\"\",RaceCard!AY206)","v":""},{"$f":"IF(RaceCard!AZ206=\"\",\"\",RaceCard!AZ206)","v":""},{"$f":"IF(RaceCard!BA206=\"\",\"\",RaceCard!BA206)","v":""},{"$f":"IF(RaceCard!BB206=\"\",\"\",RaceCard!BB206)","v":""},{"$f":"IF(RaceCard!BC206=\"\",\"\",RaceCard!BC206)","v":""},{"$f":"IF(AI205=\"\",\"\",IF(ISERROR(VLOOKUP(AI205,RaceCard!$AD$2:$AF$48,2,FALSE)),\"X\",VLOOKUP(AI205,RaceCard!$AD$2:$AF$48,3,FALSE)))","v":""},""]
[{"$nulls":31},206,"",{"$f":"IF(RaceCard!AY207=\"\",\"\",RaceCard!AY207)","v":""},{"$f":"IF(RaceCard!AZ207=\"\",\"\",RaceCard!AZ207)","v":""},{"$f":"IF(RaceCard!BA207=\"\",\"\",RaceCard!BA207)","v":""},{"$f":"IF(RaceCard!BB207=\"\",\"\",RaceCard!BB207)","v":""},{"$f":"IF(RaceCard!BC207=\"\",\"\",RaceCard!BC207)","v":""},{"$f":"IF(AI206=\"\",\"\",IF(ISERROR(VLOOKUP(AI206,RaceCard!$AD$2:$AF$48,2,FALSE)),\"X\",VLOOKUP(AI206,RaceCard!$AD$2:$AF$48,3,FALSE)))","v":""},""]
[{"$nulls":31},207,"",{"$f":"IF(RaceCard!AY208=\"\",\"\",RaceCard!AY208)","v":""},{"$f":"IF(RaceCard!AZ208=\"\",\"\",RaceCard!AZ208)","v":""},{"$f":"IF(RaceCard!BA208=\"\",\"\",RaceCard!BA208)","v":""},{"$f":"IF(RaceCard!BB208=\"\",\"\",RaceCard!BB208)","v":""},{"$f":"IF(RaceCard!BC208=\"\",\"\",RaceCard!BC208)","v":""},{"$f":"IF(AI207=\"\",\"\",IF(ISERROR(VLOOKUP(AI207,RaceCard!$AD$2:$AF$48,2,FALSE)),\"X\",VLOOKUP(AI207,RaceCard!$AD$2:$AF$48,3,FALSE)))","v":""},""]
[{"$nulls":31},208,"",{"$f":"IF(RaceCard!AY209=\"\",\"\",RaceCard!AY209)","v":""},{"$f":"IF(RaceCard!AZ209=\"\",\"\",RaceCard!AZ209)","v":""},{"$f":"IF(RaceCard!BA209=\"\",\"\",RaceCard!BA209)","v":""},{"$f":"IF(RaceCard!BB209=\"\",\"\",RaceCard!BB209)","v":""},{"$f":"IF(RaceCard!BC209=\"\",\"\",RaceCard!BC209)","v":""},{"$f":"IF(AI208=\"\",\"\",IF(ISERROR(VLOOKUP(AI208,RaceCard!$AD$2:$AF$48,2,FALSE)),\"X\",VLOOKUP(AI208,RaceCard!$AD$2:$AF$48,3,FALSE)))","v":""},""]
[{"$nulls":31},209,"",{"$f":"IF(RaceCard!AY210=\"\",\"\",RaceCard!AY210)","v":""},{"$f":"IF(RaceCard!AZ210=\"\",\"\",RaceCard!AZ210)","v":""},{"$f":"IF(RaceCard!BA210=\"\",\"\",RaceCard!BA210)","v":""},{"$f":"IF(RaceCard!BB210=\"\",\"\",RaceCard!BB210)","v":""},{"$f":"IF(RaceCard!BC210=\"\",\"\",RaceCard!BC210)","v":""},{"$f":"IF(AI209=\"\",\"\",IF(ISERROR(VLOOKUP(AI209,RaceCard!$AD$2:$AF$48,2,FALSE)),\"X\",VLOOKUP(AI209,RaceCard!$AD$2:$AF$48,3,FALSE)))","v":""},""]
[{"$nulls":31},210,"",{"$f":"IF(RaceCard!AY211=\"\",\"\",RaceCard!AY211)","v":""},{"$f":"IF(RaceCard!AZ211=\"\",\"\",RaceCard!AZ211)","v":""},{"$f":"IF(RaceCard!BA211=\"\",\"\",RaceCard!BA211)","v":""},{"$f":"IF(RaceCard!BB211=\"\",\"\",RaceCard!BB211)","v":""},{"$f":"IF(RaceCard!BC211=\"\",\"\",RaceCard!BC211)","v":""},{"$f":"IF(AI210=\"\",\"\",IF(ISERROR(VLOOKUP(AI210,RaceCard!$AD$2:$AF$48,2,FALSE)),\"X\",VLOOKUP(AI210,RaceCard!$AD$2:$AF$48,3,FALSE)))","v":""},""]
[{"$nulls":31},211,"",{"$f":"IF(RaceCard!AY212=\"\",\"\",RaceCard!AY212)","v":""},{"$f":"IF(RaceCard!AZ212=\"\",\"\",RaceCard!AZ212)","v":""},{"$f":"IF(RaceCard!BA212=\"\",\"\",RaceCard!BA212)","v":""},{"$f":"IF(RaceCard!BB212=\"\",\"\",RaceCard!BB212)","v":""},{"$f":"IF(RaceCard!BC212=\"\",\"\",RaceCard!BC212)","v":""},{"$f":"IF(AI211=\"\",\"\",IF(ISERROR(VLOOKUP(AI211,RaceCard!$AD$2:$AF$48,2,FALSE)),\"X\",VLOOKUP(AI211,RaceCard!$AD$2:$AF$48,3,FALSE)))","v":""},""]
[{"$nulls":31},212,"",{"$f":"IF(RaceCard!AY213=\"\",\"\",RaceCard!AY213)","v":""},{"$f":"IF(RaceCard!AZ213=\"\",\"\",RaceCard!AZ213)","v":""},{"$f":"IF(RaceCard!BA213=\"\",\"\",RaceCard!BA213)","v":""},{"$f":"IF(RaceCard!BB213=\"\",\"\",RaceCard!BB213)","v":""},{"$f":"IF(RaceCard!BC213=\"\",\"\",RaceCard!BC213)","v":""},{"$f":"IF(AI212=\"\",\"\",IF(ISERROR(VLOOKUP(AI212,RaceCard!$AD$2:$AF$48,2,FALSE)),\"X\",VLOOKUP(AI212,RaceCard!$AD$2:$AF$48,3,FALSE)))","v":""},""]
[{"$nulls":31},213,"",{"$f":"IF(RaceCard!AY214=\"\",\"\",RaceCard!AY214)","v":""},{"$f":"IF(RaceCard!AZ214=\"\",\"\",RaceCard!AZ214)","v":""},{"$f":"IF(RaceCard!BA214=\"\",\"\",RaceCard!BA214)","v":""},{"$f":"IF(RaceCard!BB214=\"\",\"\",RaceCard!BB214)","v":""},{"$f":"IF(RaceCard!BC214=\"\",\"\",RaceCard!BC214)","v":""},{"$f":"IF(AI213=\"\",\"\",IF(ISERROR(VLOOKUP(AI213,RaceCard!$AD$2:$AF$48,2,FALSE)),\"X\",VLOOKUP(AI213,RaceCard!$AD$2:$AF$48,3,FALSE)))","v":""},""]
[{"$nulls":31},214,"",{"$f":"IF(RaceCard!AY215=\"\",\"\",RaceCard!AY215)","v":""},{"$f":"IF(RaceCard!AZ215=\"\",\"\",RaceCard!AZ215)","v":""},{"$f":"IF(RaceCard!BA215=\"\",\"\",RaceCard!BA215)","v":""},{"$f":"IF(RaceCard!BB215=\"\",\"\",RaceCard!BB215)","v":""},{"$f":"IF(RaceCard!BC215=\"\",\"\",RaceCard!BC215)","v":""},{"$f":"IF(AI214=\"\",\"\",IF(ISERROR(VLOOKUP(AI214,RaceCard!$AD$2:$AF$48,2,FALSE)),\"X\",VLOOKUP(AI214,RaceCard!$AD$2:$AF$48,3,FALSE)))","v":""},""]
[{"$nulls":31},215,"",{"$f":"IF(RaceCard!AY216=\"\",\"\",RaceCard!AY216)","v":""},{"$f":"IF(RaceCard!AZ216=\"\",\"\",RaceCard!AZ216)","v":""},{"$f":"IF(RaceCard!BA216=\"\",\"\",RaceCard!BA216)","v":""},{"$f":"IF(RaceCard!BB216=\"\",\"\",RaceCard!BB216)","v":""},{"$f":"IF(RaceCard!BC216=\"\",\"\",RaceCard!BC216)","v":""},{"$f":"IF(AI215=\"\",\"\",IF(ISERROR(VLOOKUP(AI215,RaceCard!$AD$2:$AF$48,2,FALSE)),\"X\",VLOOKUP(AI215,RaceCard!$AD$2:$AF$48,3,FALSE)))","v":""},""]
[{"$nulls":31},216,"",{"$f":"IF(RaceCard!AY217=\"\",\"\",RaceCard!AY217)","v":""},{"$f":"IF(RaceCard!AZ217=\"\",\"\",RaceCard!AZ217)","v":""},{"$f":"IF(RaceCard!BA217=\"\",\"\",RaceCard!BA217)","v":""},{"$f":"IF(RaceCard!BB217=\"\",\"\",RaceCard!BB217)","v":""},{"$f":"IF(RaceCard!BC217=\"\",\"\",RaceCard!BC217)","v":""},{"$f":"IF(AI216=\"\",\"\",IF(ISERROR(VLOOKUP(AI216,RaceCard!$AD$2:$AF$48,2,FALSE)),\"X\",VLOOKUP(AI216,RaceCard!$AD$2:$AF$48,3,FALSE)))","v":""},{"$f":"IF(AG216=\"\",\"\",CONCATENATE(AM216,\"-\",TEXT(AJ216,\"00\")))","v":""}]
[{"$nulls":31},217,"",{"$f":"IF(RaceCard!AY218=\"\",\"\",RaceCard!AY218)","v":""},{"$f":"IF(RaceCard!AZ218=\"\",\"\",RaceCard!AZ218)","v":""},{"$f":"IF(RaceCard!BA218=\"\",\"\",RaceCard!BA218)","v":""},{"$f":"IF(RaceCard!BB218=\"\",\"\",RaceCard!BB218)","v":""},{"$f":"IF(RaceCard!BC218=\"\",\"\",RaceCard!BC218)","v":""},{"$f":"IF(AI217=\"\",\"\",IF(ISERROR(VLOOKUP(AI217,RaceCard!$AD$2:$AF$48,2,FALSE)),\"X\",VLOOKUP(AI217,RaceCard!$AD$2:$AF$48,3,FALSE)))","v":""},""]
[{"$nulls":31},218,"",{"$f":"IF(RaceCard!AY219=\"\",\"\",RaceCard!AY219)","v":""},{"$f":"IF(RaceCard!AZ219=\"\",\"\",RaceCard!AZ219)","v":""},{"$f":"IF(RaceCard!BA219=\"\",\"\",RaceCard!BA219)","v":""},{"$f":"IF(RaceCard!BB219=\"\",\"\",RaceCard!BB219)","v":""},{"$f":"IF(RaceCard!BC219=\"\",\"\",RaceCard!BC219)","v":""},{"$f":"IF(AI218=\"\",\"\",IF(ISERROR(VLOOKUP(AI218,RaceCard!$AD$2:$AF$48,2,FALSE)),\"X\",VLOOKUP(AI218,RaceCard!$AD$2:$AF$48,3,FALSE)))","v":""},""]
[{"$nulls":31},219,"",{"$f":"IF(RaceCard!AY220=\"\",\"\",RaceCard!AY220)","v":""},{"$f":"IF(RaceCard!AZ220=\"\",\"\",RaceCard!AZ220)","v":""},{"$f":"IF(RaceCard!BA220=\"\",\"\",RaceCard!BA220)","v":""},{"$f":"IF(RaceCard!BB220=\"\",\"\",RaceCard!BB220)","v":""},{"$f":"IF(RaceCard!BC220=\"\",\"\",RaceCard!BC220)","v":""},{"$f":"IF(AI219=\"\",\"\",IF(ISERROR(VLOOKUP(AI219,RaceCard!$AD$2:$AF$48,2,FALSE)),\"X\",VLOOKUP(AI219,RaceCard!$AD$2:$AF$48,3,FALSE)))","v":""},""]
[{"$nulls":31},220,"",{"$f":"IF(RaceCard!AY221=\"\",\"\",RaceCard!AY221)","v":""},{"$f":"IF(RaceCard!AZ221=\"\",\"\",RaceCard!AZ221)","v":""},{"$f":"IF(RaceCard!BA221=\"\",\"\",RaceCard!BA221)","v":""},{"$f":"IF(RaceCard!BB221=\"\",\"\",RaceCard!BB221)","v":""},{"$f":"IF(RaceCard!BC221=\"\",\"\",RaceCard!BC221)","v":""},{"$f":"IF(AI220=\"\",\"\",IF(ISERROR(VLOOKUP(AI220,RaceCard!$AD$2:$AF$48,2,FALSE)),\"X\",VLOOKUP(AI220,RaceCard!$AD$2:$AF$48,3,FALSE)))","v":""},""]
[{"$nulls":31},221,"",{"$f":"IF(RaceCard!AY222=\"\",\"\",RaceCard!AY222)","v":""},{"$f":"IF(RaceCard!AZ222=\"\",\"\",RaceCard!AZ222)","v":""},{"$f":"IF(RaceCard!BA222=\"\",\"\",RaceCard!BA222)","v":""},{"$f":"IF(RaceCard!BB222=\"\",\"\",RaceCard!BB222)","v":""},{"$f":"IF(RaceCard!BC222=\"\",\"\",RaceCard!BC222)","v":""},{"$f":"IF(AI221=\"\",\"\",IF(ISERROR(VLOOKUP(AI221,RaceCard!$AD$2:$AF$48,2,FALSE)),\"X\",VLOOKUP(AI221,RaceCard!$AD$2:$AF$48,3,FALSE)))","v":""},""]
[{"$nulls":31},222,"",{"$f":"IF(RaceCard!AY223=\"\",\"\",RaceCard!AY223)","v":""},{"$f":"IF(RaceCard!AZ223=\"\",\"\",RaceCard!AZ223)","v":""},{"$f":"IF(RaceCard!BA223=\"\",\"\",RaceCard!BA223)","v":""},{"$f":"IF(RaceCard!BB223=\"\",\"\",RaceCard!BB223)","v":""},{"$f":"IF(RaceCard!BC223=\"\",\"\",RaceCard!BC223)","v":""},{"$f":"IF(AI222=\"\",\"\",IF(ISERROR(VLOOKUP(AI222,RaceCard!$AD$2:$AF$48,2,FALSE)),\"X\",VLOOKUP(AI222,RaceCard!$AD$2:$AF$48,3,FALSE)))","v":""},""]
[{"$nulls":31},223,"",{"$f":"IF(RaceCard!AY224=\"\",\"\",RaceCard!AY224)","v":""},{"$f":"IF(RaceCard!AZ224=\"\",\"\",RaceCard!AZ224)","v":""},{"$f":"IF(RaceCard!BA224=\"\",\"\",RaceCard!BA224)","v":""},{"$f":"IF(RaceCard!BB224=\"\",\"\",RaceCard!BB224)","v":""},{"$f":"IF(RaceCard!BC224=\"\",\"\",RaceCard!BC224)","v":""},{"$f":"IF(AI223=\"\",\"\",IF(ISERROR(VLOOKUP(AI223,RaceCard!$AD$2:$AF$48,2,FALSE)),\"X\",VLOOKUP(AI223,RaceCard!$AD$2:$AF$48,3,FALSE)))","v":""},""]
[{"$nulls":31},224,"",{"$f":"IF(RaceCard!AY225=\"\",\"\",RaceCard!AY225)","v":""},{"$f":"IF(RaceCard!AZ225=\"\",\"\",RaceCard!AZ225)","v":""},{"$f":"IF(RaceCard!BA225=\"\",\"\",RaceCard!BA225)","v":""},{"$f":"IF(RaceCard!BB225=\"\",\"\",RaceCard!BB225)","v":""},{"$f":"IF(RaceCard!BC225=\"\",\"\",RaceCard!BC225)","v":""},{"$f":"IF(AI224=\"\",\"\",IF(ISERROR(VLOOKUP(AI224,RaceCard!$AD$2:$AF$48,2,FALSE)),\"X\",VLOOKUP(AI224,RaceCard!$AD$2:$AF$48,3,FALSE)))","v":""},""]
[{"$nulls":31},225,"",{"$f":"IF(RaceCard!AY226=\"\",\"\",RaceCard!AY226)","v":""},{"$f":"IF(RaceCard!AZ226=\"\",\"\",RaceCard!AZ226)","v":""},{"$f":"IF(RaceCard!BA226=\"\",\"\",RaceCard!BA226)","v":""},{"$f":"IF(RaceCard!BB226=\"\",\"\",RaceCard!BB226)","v":""},{"$f":"IF(RaceCard!BC226=\"\",\"\",RaceCard!BC226)","v":""},{"$f":"IF(AI225=\"\",\"\",IF(ISERROR(VLOOKUP(AI225,RaceCard!$AD$2:$AF$48,2,FALSE)),\"X\",VLOOKUP(AI225,RaceCard!$AD$2:$AF$48,3,FALSE)))","v":""},""]
[{"$nulls":31},226,"",{"$f":"IF(RaceCard!AY227=\"\",\"\",RaceCard!AY227)","v":""},{"$f":"IF(RaceCard!AZ227=\"\",\"\",RaceCard!AZ227)","v":""},{"$f":"IF(RaceCard!BA227=\"\",\"\",RaceCard!BA227)","v":""},{"$f":"IF(RaceCard!BB227=\"\",\"\",RaceCard!BB227)","v":""},{"$f":"IF(RaceCard!BC227=\"\",\"\",RaceCard!BC227)","v":""},{"$f":"IF(AI226=\"\",\"\",IF(ISERROR(VLOOKUP(AI226,RaceCard!$AD$2:$AF$48,2,FALSE)),\"X\",VLOOKUP(AI226,RaceCard!$AD$2:$AF$48,3,FALSE)))","v":""},""]
[{"$nulls":31},227,"",{"$f":"IF(RaceCard!AY228=\"\",\"\",RaceCard!AY228)","v":""},{"$f":"IF(RaceCard!AZ228=\"\",\"\",RaceCard!AZ228)","v":""},{"$f":"IF(RaceCard!BA228=\"\",\"\",RaceCard!BA228)","v":""},{"$f":"IF(RaceCard!BB228=\"\",\"\",RaceCard!BB228)","v":""},{"$f":"IF(RaceCard!BC228=\"\",\"\",RaceCard!BC228)","v":""},{"$f":"IF(AI227=\"\",\"\",IF(ISERROR(VLOOKUP(AI227,RaceCard!$AD$2:$AF$48,2,FALSE)),\"X\",VLOOKUP(AI227,RaceCard!$AD$2:$AF$48,3,FALSE)))","v":""},""]
[{"$nulls":31},228,"",{"$f":"IF(RaceCard!AY229=\"\",\"\",RaceCard!AY229)","v":""},{"$f":"IF(RaceCard!AZ229=\"\",\"\",RaceCard!AZ229)","v":""},{"$f":"IF(RaceCard!BA229=\"\",\"\",RaceCard!BA229)","v":""},{"$f":"IF(RaceCard!BB229=\"\",\"\",RaceCard!BB229)","v":""},{"$f":"IF(RaceCard!BC229=\"\",\"\",RaceCard!BC229)","v":""},{"$f":"IF(AI228=\"\",\"\",IF(ISERROR(VLOOKUP(AI228,RaceCard!$AD$2:$AF$48,2,FALSE)),\"X\",VLOOKUP(AI228,RaceCard!$AD$2:$AF$48,3,FALSE)))","v":""},""]
[{"$nulls":31},229,"",{"$f":"IF(RaceCard!AY230=\"\",\"\",RaceCard!AY230)","v":""},{"$f":"IF(RaceCard!AZ230=\"\",\"\",RaceCard!AZ230)","v":""},{"$f":"IF(RaceCard!BA230=\"\",\"\",RaceCard!BA230)","v":""},{"$f":"IF(RaceCard!BB230=\"\",\"\",RaceCard!BB230)","v":""},{"$f":"IF(RaceCard!BC230=\"\",\"\",RaceCard!BC230)","v":""},{"$f":"IF(AI229=\"\",\"\",IF(ISERROR(VLOOKUP(AI229,RaceCard!$AD$2:$AF$48,2,FALSE)),\"X\",VLOOKUP(AI229,RaceCard!$AD$2:$AF$48,3,FALSE)))","v":""},""]
[{"$nulls":31},230,"",{"$f":"IF(RaceCard!AY231=\"\",\"\",RaceCard!AY231)","v":""},{"$f":"IF(RaceCard!AZ231=\"\",\"\",RaceCard!AZ231)","v":""},{"$f":"IF(RaceCard!BA231=\"\",\"\",RaceCard!BA231)","v":""},{"$f":"IF(RaceCard!BB231=\"\",\"\",RaceCard!BB231)","v":""},{"$f":"IF(RaceCard!BC231=\"\",\"\",RaceCard!BC231)","v":""},{"$f":"IF(AI230=\"\",\"\",IF(ISERROR(VLOOKUP(AI230,RaceCard!$AD$2:$AF$48,2,FALSE)),\"X\",VLOOKUP(AI230,RaceCard!$AD$2:$AF$48,3,FALSE)))","v":""},""]
[{"$nulls":31},231,"",{"$f":"IF(RaceCard!AY232=\"\",\"\",RaceCard!AY232)","v":""},{"$f":"IF(RaceCard!AZ232=\"\",\"\",RaceCard!AZ232)","v":""},{"$f":"IF(RaceCard!BA232=\"\",\"\",RaceCard!BA232)","v":""},{"$f":"IF(RaceCard!BB232=\"\",\"\",RaceCard!BB232)","v":""},{"$f":"IF(RaceCard!BC232=\"\",\"\",RaceCard!BC232)","v":""},{"$f":"IF(AI231=\"\",\"\",IF(ISERROR(VLOOKUP(AI231,RaceCard!$AD$2:$AF$48,2,FALSE)),\"X\",VLOOKUP(AI231,RaceCard!$AD$2:$AF$48,3,FALSE)))","v":""},""]
[{"$nulls":31},232,"",{"$f":"IF(RaceCard!AY233=\"\",\"\",RaceCard!AY233)","v":""},{"$f":"IF(RaceCard!AZ233=\"\",\"\",RaceCard!AZ233)","v":""},{"$f":"IF(RaceCard!BA233=\"\",\"\",RaceCard!BA233)","v":""},{"$f":"IF(RaceCard!BB233=\"\",\"\",RaceCard!BB233)","v":""},{"$f":"IF(RaceCard!BC233=\"\",\"\",RaceCard!BC233)","v":""},{"$f":"IF(AI232=\"\",\"\",IF(ISERROR(VLOOKUP(AI232,RaceCard!$AD$2:$AF$48,2,FALSE)),\"X\",VLOOKUP(AI232,RaceCard!$AD$2:$AF$48,3,FALSE)))","v":""},""]
[{"$nulls":31},233,"",{"$f":"IF(RaceCard!AY234=\"\",\"\",RaceCard!AY234)","v":""},{"$f":"IF(RaceCard!AZ234=\"\",\"\",RaceCard!AZ234)","v":""},{"$f":"IF(RaceCard!BA234=\"\",\"\",RaceCard!BA234)","v":""},{"$f":"IF(RaceCard!BB234=\"\",\"\",RaceCard!BB234)","v":""},{"$f":"IF(RaceCard!BC234=\"\",\"\",RaceCard!BC234)","v":""},{"$f":"IF(AI233=\"\",\"\",IF(ISERROR(VLOOKUP(AI233,RaceCard!$AD$2:$AF$48,2,FALSE)),\"X\",VLOOKUP(AI233,RaceCard!$AD$2:$AF$48,3,FALSE)))","v":""},""]
[{"$nulls":31},234,"",{"$f":"IF(RaceCard!AY235=\"\",\"\",RaceCard!AY235)","v":""},{"$f":"IF(RaceCard!AZ235=\"\",\"\",RaceCard!AZ235)","v":""},{"$f":"IF(RaceCard!BA235=\"\",\"\",RaceCard!BA235)","v":""},{"$f":"IF(RaceCard!BB235=\"\",\"\",RaceCard!BB235)","v":""},{"$f":"IF(RaceCard!BC235=\"\",\"\",RaceCard!BC235)","v":""},{"$f":"IF(AI234=\"\",\"\",IF(ISERROR(VLOOKUP(AI234,RaceCard!$AD$2:$AF$48,2,FALSE)),\"X\",VLOOKUP(AI234,RaceCard!$AD$2:$AF$48,3,FALSE)))","v":""},""]
[{"$nulls":31},235,"",{"$f":"IF(RaceCard!AY236=\"\",\"\",RaceCard!AY236)","v":""},{"$f":"IF(RaceCard!AZ236=\"\",\"\",RaceCard!AZ236)","v":""},{"$f":"IF(RaceCard!BA236=\"\",\"\",RaceCard!BA236)","v":""},{"$f":"IF(RaceCard!BB236=\"\",\"\",RaceCard!BB236)","v":""},{"$f":"IF(RaceCard!BC236=\"\",\"\",RaceCard!BC236)","v":""},{"$f":"IF(AI235=\"\",\"\",IF(ISERROR(VLOOKUP(AI235,RaceCard!$AD$2:$AF$48,2,FALSE)),\"X\",VLOOKUP(AI235,RaceCard!$AD$2:$AF$48,3,FALSE)))","v":""},""]
[{"$nulls":31},236,"",{"$f":"IF(RaceCard!AY237=\"\",\"\",RaceCard!AY237)","v":""},{"$f":"IF(RaceCard!AZ237=\"\",\"\",RaceCard!AZ237)","v":""},{"$f":"IF(RaceCard!BA237=\"\",\"\",RaceCard!BA237)","v":""},{"$f":"IF(RaceCard!BB237=\"\",\"\",RaceCard!BB237)","v":""},{"$f":"IF(RaceCard!BC237=\"\",\"\",RaceCard!BC237)","v":""},{"$f":"IF(AI236=\"\",\"\",IF(ISERROR(VLOOKUP(AI236,RaceCard!$AD$2:$AF$48,2,FALSE)),\"X\",VLOOKUP(AI236,RaceCard!$AD$2:$AF$48,3,FALSE)))","v":""},""]
[{"$nulls":31},237,"",{"$f":"IF(RaceCard!AY238=\"\",\"\",RaceCard!AY238)","v":""},{"$f":"IF(RaceCard!AZ238=\"\",\"\",RaceCard!AZ238)","v":""},{"$f":"IF(RaceCard!BA238=\"\",\"\",RaceCard!BA238)","v":""},{"$f":"IF(RaceCard!BB238=\"\",\"\",RaceCard!BB238)","v":""},{"$f":"IF(RaceCard!BC238=\"\",\"\",RaceCard!BC238)","v":""},{"$f":"IF(AI237=\"\",\"\",IF(ISERROR(VLOOKUP(AI237,RaceCard!$AD$2:$AF$48,2,FALSE)),\"X\",VLOOKUP(AI237,RaceCard!$AD$2:$AF$48,3,FALSE)))","v":""},""]
[{"$nulls":31},238,"",{"$f":"IF(RaceCard!AY239=\"\",\"\",RaceCard!AY239)","v":""},{"$f":"IF(RaceCard!AZ239=\"\",\"\",RaceCard!AZ239)","v":""},{"$f":"IF(RaceCard!BA239=\"\",\"\",RaceCard!BA239)","v":""},{"$f":"IF(RaceCard!BB239=\"\",\"\",RaceCard!BB239)","v":""},{"$f":"IF(RaceCard!BC239=\"\",\"\",RaceCard!BC239)","v":""},{"$f":"IF(AI238=\"\",\"\",IF(ISERROR(VLOOKUP(AI238,RaceCard!$AD$2:$AF$48,2,FALSE)),\"X\",VLOOKUP(AI238,RaceCard!$AD$2:$AF$48,3,FALSE)))","v":""},""]
[{"$nulls":31},239,"",{"$f":"IF(RaceCard!AY240=\"\",\"\",RaceCard!AY240)","v":""},{"$f":"IF(RaceCard!AZ240=\"\",\"\",RaceCard!AZ240)","v":""},{"$f":"IF(RaceCard!BA240=\"\",\"\",RaceCard!BA240)","v":""},{"$f":"IF(RaceCard!BB240=\"\",\"\",RaceCard!BB240)","v":""},{"$f":"IF(RaceCard!BC240=\"\",\"\",RaceCard!BC240)","v":""},{"$f":"IF(AI239=\"\",\"\",IF(ISERROR(VLOOKUP(AI239,RaceCard!$AD$2:$AF$48,2,FALSE)),\"X\",VLOOKUP(AI239,RaceCard!$AD$2:$AF$48,3,FALSE)))","v":""},""]
[{"$nulls":31},240,"",{"$f":"IF(RaceCard!AY241=\"\",\"\",RaceCard!AY241)","v":""},{"$f":"IF(RaceCard!AZ241=\"\",\"\",RaceCard!AZ241)","v":""},{"$f":"IF(RaceCard!BA241=\"\",\"\",RaceCard!BA241)","v":""},{"$f":"IF(RaceCard!BB241=\"\",\"\",RaceCard!BB241)","v":""},{"$f":"IF(RaceCard!BC241=\"\",\"\",RaceCard!BC241)","v":""},{"$f":"IF(AI240=\"\",\"\",IF(ISERROR(VLOOKUP(AI240,RaceCard!$AD$2:$AF$48,2,FALSE)),\"X\",VLOOKUP(AI240,RaceCard!$AD$2:$AF$48,3,FALSE)))","v":""},""]
[{"$nulls":31},241,"",{"$f":"IF(RaceCard!AY242=\"\",\"\",RaceCard!AY242)","v":""},{"$f":"IF(RaceCard!AZ242=\"\",\"\",RaceCard!AZ242)","v":""},{"$f":"IF(RaceCard!BA242=\"\",\"\",RaceCard!BA242)","v":""},{"$f":"IF(RaceCard!BB242=\"\",\"\",RaceCard!BB242)","v":""},{"$f":"IF(RaceCard!BC242=\"\",\"\",RaceCard!BC242)","v":""},{"$f":"IF(AI241=\"\",\"\",IF(ISERROR(VLOOKUP(AI241,RaceCard!$AD$2:$AF$48,2,FALSE)),\"X\",VLOOKUP(AI241,RaceCard!$AD$2:$AF$48,3,FALSE)))","v":""},""]
[{"$nulls":31},242,"",{"$f":"IF(RaceCard!AY243=\"\",\"\",RaceCard!AY243)","v":""},{"$f":"IF(RaceCard!AZ243=\"\",\"\",RaceCard!AZ243)","v":""},{"$f":"IF(RaceCard!BA243=\"\",\"\",RaceCard!BA243)","v":""},{"$f":"IF(RaceCard!BB243=\"\",\"\",RaceCard!BB243)","v":""},{"$f":"IF(RaceCard!BC243=\"\",\"\",RaceCard!BC243)","v":""},{"$f":"IF(AI242=\"\",\"\",IF(ISERROR(VLOOKUP(AI242,RaceCard!$AD$2:$AF$48,2,FALSE)),\"X\",VLOOKUP(AI242,RaceCard!$AD$2:$AF$48,3,FALSE)))","v":""},""]
[{"$nulls":31},243,"",{"$f":"IF(RaceCard!AY244=\"\",\"\",RaceCard!AY244)","v":""},{"$f":"IF(RaceCard!AZ244=\"\",\"\",RaceCard!AZ244)","v":""},{"$f":"IF(RaceCard!BA244=\"\",\"\",RaceCard!BA244)","v":""},{"$f":"IF(RaceCard!BB244=\"\",\"\",RaceCard!BB244)","v":""},{"$f":"IF(RaceCard!BC244=\"\",\"\",RaceCard!BC244)","v":""},{"$f":"IF(AI243=\"\",\"\",IF(ISERROR(VLOOKUP(AI243,RaceCard!$AD$2:$AF$48,2,FALSE)),\"X\",VLOOKUP(AI243,RaceCard!$AD$2:$AF$48,3,FALSE)))","v":""},""]
[{"$nulls":31},244,"",{"$f":"IF(RaceCard!AY245=\"\",\"\",RaceCard!AY245)","v":""},{"$f":"IF(RaceCard!AZ245=\"\",\"\",RaceCard!AZ245)","v":""},{"$f":"IF(RaceCard!BA245=\"\",\"\",RaceCard!BA245)","v":""},{"$f":"IF(RaceCard!BB245=\"\",\"\",RaceCard!BB245)","v":""},{"$f":"IF(RaceCard!BC245=\"\",\"\",RaceCard!BC245)","v":""},{"$f":"IF(AI244=\"\",\"\",IF(ISERROR(VLOOKUP(AI244,RaceCard!$AD$2:$AF$48,2,FALSE)),\"X\",VLOOKUP(AI244,RaceCard!$AD$2:$AF$48,3,FALSE)))","v":""},""]
[{"$nulls":31},245,"",{"$f":"IF(RaceCard!AY246=\"\",\"\",RaceCard!AY246)","v":""},{"$f":"IF(RaceCard!AZ246=\"\",\"\",RaceCard!AZ246)","v":""},{"$f":"IF(RaceCard!BA246=\"\",\"\",RaceCard!BA246)","v":""},{"$f":"IF(RaceCard!BB246=\"\",\"\",RaceCard!BB246)","v":""},{"$f":"IF(RaceCard!BC246=\"\",\"\",RaceCard!BC246)","v":""},{"$f":"IF(AI245=\"\",\"\",IF(ISERROR(VLOOKUP(AI245,RaceCard!$AD$2:$AF$48,2,FALSE)),\"X\",VLOOKUP(AI245,RaceCard!$AD$2:$AF$48,3,FALSE)))","v":""},""]
[{"$nulls":31},246,"",{"$f":"IF(RaceCard!AY247=\"\",\"\",RaceCard!AY247)","v":""},{"$f":"IF(RaceCard!AZ247=\"\",\"\",RaceCard!AZ247)","v":""},{"$f":"IF(RaceCard!BA247=\"\",\"\",RaceCard!BA247)","v":""},{"$f":"IF(RaceCard!BB247=\"\",\"\",RaceCard!BB247)","v":""},{"$f":"IF(RaceCard!BC247=\"\",\"\",RaceCard!BC247)","v":""},{"$f":"IF(AI246=\"\",\"\",IF(ISERROR(VLOOKUP(AI246,RaceCard!$AD$2:$AF$48,2,FALSE)),\"X\",VLOOKUP(AI246,RaceCard!$AD$2:$AF$48,3,FALSE)))","v":""},""]
[{"$nulls":31},247,"",{"$f":"IF(RaceCard!AY248=\"\",\"\",RaceCard!AY248)","v":""},{"$f":"IF(RaceCard!AZ248=\"\",\"\",RaceCard!AZ248)","v":""},{"$f":"IF(RaceCard!BA248=\"\",\"\",RaceCard!BA248)","v":""},{"$f":"IF(RaceCard!BB248=\"\",\"\",RaceCard!BB248)","v":""},{"$f":"IF(RaceCard!BC248=\"\",\"\",RaceCard!BC248)","v":""},{"$f":"IF(AI247=\"\",\"\",IF(ISERROR(VLOOKUP(AI247,RaceCard!$AD$2:$AF$48,2,FALSE)),\"X\",VLOOKUP(AI247,RaceCard!$AD$2:$AF$48,3,FALSE)))","v":""},""]
[{"$nulls":31},248,"",{"$f":"IF(RaceCard!AY249=\"\",\"\",RaceCard!AY249)","v":""},{"$f":"IF(RaceCard!AZ249=\"\",\"\",RaceCard!AZ249)","v":""},{"$f":"IF(RaceCard!BA249=\"\",\"\",RaceCard!BA249)","v":""},{"$f":"IF(RaceCard!BB249=\"\",\"\",RaceCard!BB249)","v":""},{"$f":"IF(RaceCard!BC249=\"\",\"\",RaceCard!BC249)","v":""},{"$f":"IF(AI248=\"\",\"\",IF(ISERROR(VLOOKUP(AI248,RaceCard!$AD$2:$AF$48,2,FALSE)),\"X\",VLOOKUP(AI248,RaceCard!$AD$2:$AF$48,3,FALSE)))","v":""},""]
[{"$nulls":31},249,"",{"$f":"IF(RaceCard!AY250=\"\",\"\",RaceCard!AY250)","v":""},{"$f":"IF(RaceCard!AZ250=\"\",\"\",RaceCard!AZ250)","v":""},{"$f":"IF(RaceCard!BA250=\"\",\"\",RaceCard!BA250)","v":""},{"$f":"IF(RaceCard!BB250=\"\",\"\",RaceCard!BB250)","v":""},{"$f":"IF(RaceCard!BC250=\"\",\"\",RaceCard!BC250)","v":""},{"$f":"IF(AI249=\"\",\"\",IF(ISERROR(VLOOKUP(AI249,RaceCard!$AD$2:$AF$48,2,FALSE)),\"X\",VLOOKUP(AI249,RaceCard!$AD$2:$AF$48,3,FALSE)))","v":""},""]
[{"$nulls":31},250,"",{"$f":"IF(RaceCard!AY251=\"\",\"\",RaceCard!AY251)","v":""},{"$f":"IF(RaceCard!AZ251=\"\",\"\",RaceCard!AZ251)","v":""},{"$f":"IF(RaceCard!BA251=\"\",\"\",RaceCard!BA251)","v":""},{"$f":"IF(RaceCard!BB251=\"\",\"\",RaceCard!BB251)","v":""},{"$f":"IF(RaceCard!BC251=\"\",\"\",RaceCard!BC251)","v":""},{"$f":"IF(AI250=\"\",\"\",IF(ISERROR(VLOOKUP(AI250,RaceCard!$AD$2:$AF$48,2,FALSE)),\"X\",VLOOKUP(AI250,RaceCard!$AD$2:$AF$48,3,FALSE)))","v":""},""]
[{"$nulls":31},251,"",{"$f":"IF(RaceCard!AY252=\"\",\"\",RaceCard!AY252)","v":""},{"$f":"IF(RaceCard!AZ252=\"\",\"\",RaceCard!AZ252)","v":""},{"$f":"IF(RaceCard!BA252=\"\",\"\",RaceCard!BA252)","v":""},{"$f":"IF(RaceCard!BB252=\"\",\"\",RaceCard!BB252)","v":""},{"$f":"IF(RaceCard!BC252=\"\",\"\",RaceCard!BC252)","v":""},{"$f":"IF(AI251=\"\",\"\",IF(ISERROR(VLOOKUP(AI251,RaceCard!$AD$2:$AF$48,2,FALSE)),\"X\",VLOOKUP(AI251,RaceCard!$AD$2:$AF$48,3,FALSE)))","v":""},""]
[{"$nulls":31},252,"",{"$f":"IF(RaceCard!AY253=\"\",\"\",RaceCard!AY253)","v":""},{"$f":"IF(RaceCard!AZ253=\"\",\"\",RaceCard!AZ253)","v":""},{"$f":"IF(RaceCard!BA253=\"\",\"\",RaceCard!BA253)","v":""},{"$f":"IF(RaceCard!BB253=\"\",\"\",RaceCard!BB253)","v":""},{"$f":"IF(RaceCard!BC253=\"\",\"\",RaceCard!BC253)","v":""},{"$f":"IF(AI252=\"\",\"\",IF(ISERROR(VLOOKUP(AI252,RaceCard!$AD$2:$AF$48,2,FALSE)),\"X\",VLOOKUP(AI252,RaceCard!$AD$2:$AF$48,3,FALSE)))","v":""},""]
[{"$nulls":31},253,"",{"$f":"IF(RaceCard!AY254=\"\",\"\",RaceCard!AY254)","v":""},{"$f":"IF(RaceCard!AZ254=\"\",\"\",RaceCard!AZ254)","v":""},{"$f":"IF(RaceCard!BA254=\"\",\"\",RaceCard!BA254)","v":""},{"$f":"IF(RaceCard!BB254=\"\",\"\",RaceCard!BB254)","v":""},{"$f":"IF(RaceCard!BC254=\"\",\"\",RaceCard!BC254)","v":""},{"$f":"IF(AI253=\"\",\"\",IF(ISERROR(VLOOKUP(AI253,RaceCard!$AD$2:$AF$48,2,FALSE)),\"X\",VLOOKUP(AI253,RaceCard!$AD$2:$AF$48,3,FALSE)))","v":""},""]
[{"$nulls":31},254,"",{"$f":"IF(RaceCard!AY255=\"\",\"\",RaceCard!AY255)","v":""},{"$f":"IF(RaceCard!AZ255=\"\",\"\",RaceCard!AZ255)","v":""},{"$f":"IF(RaceCard!BA255=\"\",\"\",RaceCard!BA255)","v":""},{"$f":"IF(RaceCard!BB255=\"\",\"\",RaceCard!BB255)","v":""},{"$f":"IF(RaceCard!BC255=\"\",\"\",RaceCard!BC255)","v":""},{"$f":"IF(AI254=\"\",\"\",IF(ISERROR(VLOOKUP(AI254,RaceCard!$AD$2:$AF$48,2,FALSE)),\"X\",VLOOKUP(AI254,RaceCard!$AD$2:$AF$48,3,FALSE)))","v":""},""]
[{"$nulls":31},255,"",{"$f":"IF(RaceCard!AY256=\"\",\"\",RaceCard!AY256)","v":""},{"$f":"IF(RaceCard!AZ256=\"\",\"\",RaceCard!AZ256)","v":""},{"$f":"IF(RaceCard!BA256=\"\",\"\",RaceCard!BA256)","v":""},{"$f":"IF(RaceCard!BB256=\"\",\"\",RaceCard!BB256)","v":""},{"$f":"IF(RaceCard!BC256=\"\",\"\",RaceCard!BC256)","v":""},{"$f":"IF(AI255=\"\",\"\",IF(ISERROR(VLOOKUP(AI255,RaceCard!$AD$2:$AF$48,2,FALSE)),\"X\",VLOOKUP(AI255,RaceCard!$AD$2:$AF$48,3,FALSE)))","v":""},""]
[{"$nulls":31},256,"",{"$f":"IF(RaceCard!AY257=\"\",\"\",RaceCard!AY257)","v":""},{"$f":"IF(RaceCard!AZ257=\"\",\"\",RaceCard!AZ257)","v":""},{"$f":"IF(RaceCard!BA257=\"\",\"\",RaceCard!BA257)","v":""},{"$f":"IF(RaceCard!BB257=\"\",\"\",RaceCard!BB257)","v":""},{"$f":"IF(RaceCard!BC257=\"\",\"\",RaceCard!BC257)","v":""},{"$f":"IF(AI256=\"\",\"\",IF(ISERROR(VLOOKUP(AI256,RaceCard!$AD$2:$AF$48,2,FALSE)),\"X\",VLOOKUP(AI256,RaceCard!$AD$2:$AF$48,3,FALSE)))","v":""},""]
[{"$nulls":31},257,"",{"$f":"IF(RaceCard!AY258=\"\",\"\",RaceCard!AY258)","v":""},{"$f":"IF(RaceCard!AZ258=\"\",\"\",RaceCard!AZ258)","v":""},{"$f":"IF(RaceCard!BA258=\"\",\"\",RaceCard!BA258)","v":""},{"$f":"IF(RaceCard!BB258=\"\",\"\",RaceCard!BB258)","v":""},{"$f":"IF(RaceCard!BC258=\"\",\"\",RaceCard!BC258)","v":""},{"$f":"IF(AI257=\"\",\"\",IF(ISERROR(VLOOKUP(AI257,RaceCard!$AD$2:$AF$48,2,FALSE)),\"X\",VLOOKUP(AI257,RaceCard!$AD$2:$AF$48,3,FALSE)))","v":""},""]
[{"$nulls":31},258,{"$f":"IF(AI258=\"\",\"\",CONCATENATE(TEXT(AH258,\"HH:MM AM/PM\"),\"-\",AI258,\"-\",AJ258))","v":""},{"$f":"IF(RaceCard!AY259=\"\",\"\",RaceCard!AY259)","v":""},{"$f":"IF(RaceCard!AZ259=\"\",\"\",RaceCard!AZ259)","v":""},{"$f":"IF(RaceCard!BA259=\"\",\"\",RaceCard!BA259)","v":""},{"$f":"IF(RaceCard!BB259=\"\",\"\",RaceCard!BB259)","v":""},{"$f":"IF(RaceCard!BC259=\"\",\"\",RaceCard!BC259)","v":""},{"$f":"IF(AI258=\"\",\"\",IF(ISERROR(VLOOKUP(AI258,RaceCard!$AD$2:$AF$48,2,FALSE)),\"X\",VLOOKUP(AI258,RaceCard!$AD$2:$AF$48,3,FALSE)))","v":""},""]
[{"$nulls":31},259,"",{"$f":"IF(RaceCard!AY260=\"\",\"\",RaceCard!AY260)","v":""},{"$f":"IF(RaceCard!AZ260=\"\",\"\",RaceCard!AZ260)","v":""},{"$f":"IF(RaceCard!BA260=\"\",\"\",RaceCard!BA260)","v":""},{"$f":"IF(RaceCard!BB260=\"\",\"\",RaceCard!BB260)","v":""},{"$f":"IF(RaceCard!BC260=\"\",\"\",RaceCard!BC260)","v":""},{"$f":"IF(AI259=\"\",\"\",IF(ISERROR(VLOOKUP(AI259,RaceCard!$AD$2:$AF$48,2,FALSE)),\"X\",VLOOKUP(AI259,RaceCard!$AD$2:$AF$48,3,FALSE)))","v":""},""]
[{"$nulls":31},260,"",{"$f":"IF(RaceCard!AY261=\"\",\"\",RaceCard!AY261)","v":""},{"$f":"IF(RaceCard!AZ261=\"\",\"\",RaceCard!AZ261)","v":""},{"$f":"IF(RaceCard!BA261=\"\",\"\",RaceCard!BA261)","v":""},{"$f":"IF(RaceCard!BB261=\"\",\"\",RaceCard!BB261)","v":""},{"$f":"IF(RaceCard!BC261=\"\",\"\",RaceCard!BC261)","v":""},{"$f":"IF(AI260=\"\",\"\",IF(ISERROR(VLOOKUP(AI260,RaceCard!$AD$2:$AF$48,2,FALSE)),\"X\",VLOOKUP(AI260,RaceCard!$AD$2:$AF$48,3,FALSE)))","v":""},""]
[{"$nulls":31},261,"",{"$f":"IF(RaceCard!AY262=\"\",\"\",RaceCard!AY262)","v":""},{"$f":"IF(RaceCard!AZ262=\"\",\"\",RaceCard!AZ262)","v":""},{"$f":"IF(RaceCard!BA262=\"\",\"\",RaceCard!BA262)","v":""},{"$f":"IF(RaceCard!BB262=\"\",\"\",RaceCard!BB262)","v":""},{"$f":"IF(RaceCard!BC262=\"\",\"\",RaceCard!BC262)","v":""},{"$f":"IF(AI261=\"\",\"\",IF(ISERROR(VLOOKUP(AI261,RaceCard!$AD$2:$AF$48,2,FALSE)),\"X\",VLOOKUP(AI261,RaceCard!$AD$2:$AF$48,3,FALSE)))","v":""},""]
[{"$nulls":31},262,"",{"$f":"IF(RaceCard!AY263=\"\",\"\",RaceCard!AY263)","v":""},{"$f":"IF(RaceCard!AZ263=\"\",\"\",RaceCard!AZ263)","v":""},{"$f":"IF(RaceCard!BA263=\"\",\"\",RaceCard!BA263)","v":""},{"$f":"IF(RaceCard!BB263=\"\",\"\",RaceCard!BB263)","v":""},{"$f":"IF(RaceCard!BC263=\"\",\"\",RaceCard!BC263)","v":""},{"$f":"IF(AI262=\"\",\"\",IF(ISERROR(VLOOKUP(AI262,RaceCard!$AD$2:$AF$48,2,FALSE)),\"X\",VLOOKUP(AI262,RaceCard!$AD$2:$AF$48,3,FALSE)))","v":""},""]
[{"$nulls":31},263,"",{"$f":"IF(RaceCard!AY264=\"\",\"\",RaceCard!AY264)","v":""},{"$f":"IF(RaceCard!AZ264=\"\",\"\",RaceCard!AZ264)","v":""},{"$f":"IF(RaceCard!BA264=\"\",\"\",RaceCard!BA264)","v":""},{"$f":"IF(RaceCard!BB264=\"\",\"\",RaceCard!BB264)","v":""},{"$f":"IF(RaceCard!BC264=\"\",\"\",RaceCard!BC264)","v":""},{"$f":"IF(AI263=\"\",\"\",IF(ISERROR(VLOOKUP(AI263,RaceCard!$AD$2:$AF$48,2,FALSE)),\"X\",VLOOKUP(AI263,RaceCard!$AD$2:$AF$48,3,FALSE)))","v":""},""]
[{"$nulls":31},264,"",{"$f":"IF(RaceCard!AY265=\"\",\"\",RaceCard!AY265)","v":""},{"$f":"IF(RaceCard!AZ265=\"\",\"\",RaceCard!AZ265)","v":""},{"$f":"IF(RaceCard!BA265=\"\",\"\",RaceCard!BA265)","v":""},{"$f":"IF(RaceCard!BB265=\"\",\"\",RaceCard!BB265)","v":""},{"$f":"IF(RaceCard!BC265=\"\",\"\",RaceCard!BC265)","v":""},{"$f":"IF(AI264=\"\",\"\",IF(ISERROR(VLOOKUP(AI264,RaceCard!$AD$2:$AF$48,2,FALSE)),\"X\",VLOOKUP(AI264,RaceCard!$AD$2:$AF$48,3,FALSE)))","v":""},""]
[{"$nulls":31},265,"",{"$f":"IF(RaceCard!AY266=\"\",\"\",RaceCard!AY266)","v":""},{"$f":"IF(RaceCard!AZ266=\"\",\"\",RaceCard!AZ266)","v":""},{"$f":"IF(RaceCard!BA266=\"\",\"\",RaceCard!BA266)","v":""},{"$f":"IF(RaceCard!BB266=\"\",\"\",RaceCard!BB266)","v":""},{"$f":"IF(RaceCard!BC266=\"\",\"\",RaceCard!BC266)","v":""},{"$f":"IF(AI265=\"\",\"\",IF(ISERROR(VLOOKUP(AI265,RaceCard!$AD$2:$AF$48,2,FALSE)),\"X\",VLOOKUP(AI265,RaceCard!$AD$2:$AF$48,3,FALSE)))","v":""},""]
[{"$nulls":31},266,"",{"$f":"IF(RaceCard!AY267=\"\",\"\",RaceCard!AY267)","v":""},{"$f":"IF(RaceCard!AZ267=\"\",\"\",RaceCard!AZ267)","v":""},{"$f":"IF(RaceCard!BA267=\"\",\"\",RaceCard!BA267)","v":""},{"$f":"IF(RaceCard!BB267=\"\",\"\",RaceCard!BB267)","v":""},{"$f":"IF(RaceCard!BC267=\"\",\"\",RaceCard!BC267)","v":""},{"$f":"IF(AI266=\"\",\"\",IF(ISERROR(VLOOKUP(AI266,RaceCard!$AD$2:$AF$48,2,FALSE)),\"X\",VLOOKUP(AI266,RaceCard!$AD$2:$AF$48,3,FALSE)))","v":""},""]
[{"$nulls":31},267,"",{"$f":"IF(RaceCard!AY268=\"\",\"\",RaceCard!AY268)","v":""},{"$f":"IF(RaceCard!AZ268=\"\",\"\",RaceCard!AZ268)","v":""},{"$f":"IF(RaceCard!BA268=\"\",\"\",RaceCard!BA268)","v":""},{"$f":"IF(RaceCard!BB268=\"\",\"\",RaceCard!BB268)","v":""},{"$f":"IF(RaceCard!BC268=\"\",\"\",RaceCard!BC268)","v":""},{"$f":"IF(AI267=\"\",\"\",IF(ISERROR(VLOOKUP(AI267,RaceCard!$AD$2:$AF$48,2,FALSE)),\"X\",VLOOKUP(AI267,RaceCard!$AD$2:$AF$48,3,FALSE)))","v":""},""]
[{"$nulls":31},268,"",{"$f":"IF(RaceCard!AY269=\"\",\"\",RaceCard!AY269)","v":""},{"$f":"IF(RaceCard!AZ269=\"\",\"\",RaceCard!AZ269)","v":""},{"$f":"IF(RaceCard!BA269=\"\",\"\",RaceCard!BA269)","v":""},{"$f":"IF(RaceCard!BB269=\"\",\"\",RaceCard!BB269)","v":""},{"$f":"IF(RaceCard!BC269=\"\",\"\",RaceCard!BC269)","v":""},{"$f":"IF(AI268=\"\",\"\",IF(ISERROR(VLOOKUP(AI268,RaceCard!$AD$2:$AF$48,2,FALSE)),\"X\",VLOOKUP(AI268,RaceCard!$AD$2:$AF$48,3,FALSE)))","v":""},""]
[{"$nulls":31},269,"",{"$f":"IF(RaceCard!AY270=\"\",\"\",RaceCard!AY270)","v":""},{"$f":"IF(RaceCard!AZ270=\"\",\"\",RaceCard!AZ270)","v":""},{"$f":"IF(RaceCard!BA270=\"\",\"\",RaceCard!BA270)","v":""},{"$f":"IF(RaceCard!BB270=\"\",\"\",RaceCard!BB270)","v":""},{"$f":"IF(RaceCard!BC270=\"\",\"\",RaceCard!BC270)","v":""},{"$f":"IF(AI269=\"\",\"\",IF(ISERROR(VLOOKUP(AI269,RaceCard!$AD$2:$AF$48,2,FALSE)),\"X\",VLOOKUP(AI269,RaceCard!$AD$2:$AF$48,3,FALSE)))","v":""},""]
[{"$nulls":31},270,"",{"$f":"IF(RaceCard!AY271=\"\",\"\",RaceCard!AY271)","v":""},{"$f":"IF(RaceCard!AZ271=\"\",\"\",RaceCard!AZ271)","v":""},{"$f":"IF(RaceCard!BA271=\"\",\"\",RaceCard!BA271)","v":""},{"$f":"IF(RaceCard!BB271=\"\",\"\",RaceCard!BB271)","v":""},{"$f":"IF(RaceCard!BC271=\"\",\"\",RaceCard!BC271)","v":""},{"$f":"IF(AI270=\"\",\"\",IF(ISERROR(VLOOKUP(AI270,RaceCard!$AD$2:$AF$48,2,FALSE)),\"X\",VLOOKUP(AI270,RaceCard!$AD$2:$AF$48,3,FALSE)))","v":""},""]
[{"$nulls":31},271,"",{"$f":"IF(RaceCard!AY272=\"\",\"\",RaceCard!AY272)","v":""},{"$f":"IF(RaceCard!AZ272=\"\",\"\",RaceCard!AZ272)","v":""},{"$f":"IF(RaceCard!BA272=\"\",\"\",RaceCard!BA272)","v":""},{"$f":"IF(RaceCard!BB272=\"\",\"\",RaceCard!BB272)","v":""},{"$f":"IF(RaceCard!BC272=\"\",\"\",RaceCard!BC272)","v":""},{"$f":"IF(AI271=\"\",\"\",IF(ISERROR(VLOOKUP(AI271,RaceCard!$AD$2:$AF$48,2,FALSE)),\"X\",VLOOKUP(AI271,RaceCard!$AD$2:$AF$48,3,FALSE)))","v":""},""]
[{"$nulls":31},272,"",{"$f":"IF(RaceCard!AY273=\"\",\"\",RaceCard!AY273)","v":""},{"$f":"IF(RaceCard!AZ273=\"\",\"\",RaceCard!AZ273)","v":""},{"$f":"IF(RaceCard!BA273=\"\",\"\",RaceCard!BA273)","v":""},{"$f":"IF(RaceCard!BB273=\"\",\"\",RaceCard!BB273)","v":""},{"$f":"IF(RaceCard!BC273=\"\",\"\",RaceCard!BC273)","v":""},{"$f":"IF(AI272=\"\",\"\",IF(ISERROR(VLOOKUP(AI272,RaceCard!$AD$2:$AF$48,2,FALSE)),\"X\",VLOOKUP(AI272,RaceCard!$AD$2:$AF$48,3,FALSE)))","v":""},""]
[{"$nulls":31},273,"",{"$f":"IF(RaceCard!AY274=\"\",\"\",RaceCard!AY274)","v":""},{"$f":"IF(RaceCard!AZ274=\"\",\"\",RaceCard!AZ274)","v":""},{"$f":"IF(RaceCard!BA274=\"\",\"\",RaceCard!BA274)","v":""},{"$f":"IF(RaceCard!BB274=\"\",\"\",RaceCard!BB274)","v":""},{"$f":"IF(RaceCard!BC274=\"\",\"\",RaceCard!BC274)","v":""},{"$f":"IF(AI273=\"\",\"\",IF(ISERROR(VLOOKUP(AI273,RaceCard!$AD$2:$AF$48,2,FALSE)),\"X\",VLOOKUP(AI273,RaceCard!$AD$2:$AF$48,3,FALSE)))","v":""},""]
[{"$nulls":31},274,"",{"$f":"IF(RaceCard!AY275=\"\",\"\",RaceCard!AY275)","v":""},{"$f":"IF(RaceCard!AZ275=\"\",\"\",RaceCard!AZ275)","v":""},{"$f":"IF(RaceCard!BA275=\"\",\"\",RaceCard!BA275)","v":""},{"$f":"IF(RaceCard!BB275=\"\",\"\",RaceCard!BB275)","v":""},{"$f":"IF(RaceCard!BC275=\"\",\"\",RaceCard!BC275)","v":""},{"$f":"IF(AI274=\"\",\"\",IF(ISERROR(VLOOKUP(AI274,RaceCard!$AD$2:$AF$48,2,FALSE)),\"X\",VLOOKUP(AI274,RaceCard!$AD$2:$AF$48,3,FALSE)))","v":""},""]
[{"$nulls":31},275,"",{"$f":"IF(RaceCard!AY276=\"\",\"\",RaceCard!AY276)","v":""},{"$f":"IF(RaceCard!AZ276=\"\",\"\",RaceCard!AZ276)","v":""},{"$f":"IF(RaceCard!BA276=\"\",\"\",RaceCard!BA276)","v":""},{"$f":"IF(RaceCard!BB276=\"\",\"\",RaceCard!BB276)","v":""},{"$f":"IF(RaceCard!BC276=\"\",\"\",RaceCard!BC276)","v":""},{"$f":"IF(AI275=\"\",\"\",IF(ISERROR(VLOOKUP(AI275,RaceCard!$AD$2:$AF$48,2,FALSE)),\"X\",VLOOKUP(AI275,RaceCard!$AD$2:$AF$48,3,FALSE)))","v":""},""]
[{"$nulls":31},276,"",{"$f":"IF(RaceCard!AY277=\"\",\"\",RaceCard!AY277)","v":""},{"$f":"IF(RaceCard!AZ277=\"\",\"\",RaceCard!AZ277)","v":""},{"$f":"IF(RaceCard!BA277=\"\",\"\",RaceCard!BA277)","v":""},{"$f":"IF(RaceCard!BB277=\"\",\"\",RaceCard!BB277)","v":""},{"$f":"IF(RaceCard!BC277=\"\",\"\",RaceCard!BC277)","v":""},{"$f":"IF(AI276=\"\",\"\",IF(ISERROR(VLOOKUP(AI276,RaceCard!$AD$2:$AF$48,2,FALSE)),\"X\",VLOOKUP(AI276,RaceCard!$AD$2:$AF$48,3,FALSE)))","v":""},""]
[{"$nulls":31},277,"",{"$f":"IF(RaceCard!AY278=\"\",\"\",RaceCard!AY278)","v":""},{"$f":"IF(RaceCard!AZ278=\"\",\"\",RaceCard!AZ278)","v":""},{"$f":"IF(RaceCard!BA278=\"\",\"\",RaceCard!BA278)","v":""},{"$f":"IF(RaceCard!BB278=\"\",\"\",RaceCard!BB278)","v":""},{"$f":"IF(RaceCard!BC278=\"\",\"\",RaceCard!BC278)","v":""},{"$f":"IF(AI277=\"\",\"\",IF(ISERROR(VLOOKUP(AI277,RaceCard!$AD$2:$AF$48,2,FALSE)),\"X\",VLOOKUP(AI277,RaceCard!$AD$2:$AF$48,3,FALSE)))","v":""},""]
[{"$nulls":31},278,"",{"$f":"IF(RaceCard!AY279=\"\",\"\",RaceCard!AY279)","v":""},{"$f":"IF(RaceCard!AZ279=\"\",\"\",RaceCard!AZ279)","v":""},{"$f":"IF(RaceCard!BA279=\"\",\"\",RaceCard!BA279)","v":""},{"$f":"IF(RaceCard!BB279=\"\",\"\",RaceCard!BB279)","v":""},{"$f":"IF(RaceCard!BC279=\"\",\"\",RaceCard!BC279)","v":""},{"$f":"IF(AI278=\"\",\"\",IF(ISERROR(VLOOKUP(AI278,RaceCard!$AD$2:$AF$48,2,FALSE)),\"X\",VLOOKUP(AI278,RaceCard!$AD$2:$AF$48,3,FALSE)))","v":""},""]
[{"$nulls":31},279,"",{"$f":"IF(RaceCard!AY280=\"\",\"\",RaceCard!AY280)","v":""},{"$f":"IF(RaceCard!AZ280=\"\",\"\",RaceCard!AZ280)","v":""},{"$f":"IF(RaceCard!BA280=\"\",\"\",RaceCard!BA280)","v":""},{"$f":"IF(RaceCard!BB280=\"\",\"\",RaceCard!BB280)","v":""},{"$f":"IF(RaceCard!BC280=\"\",\"\",RaceCard!BC280)","v":""},{"$f":"IF(AI279=\"\",\"\",IF(ISERROR(VLOOKUP(AI279,RaceCard!$AD$2:$AF$48,2,FALSE)),\"X\",VLOOKUP(AI279,RaceCard!$AD$2:$AF$48,3,FALSE)))","v":""},""]
[{"$nulls":31},280,"",{"$f":"IF(RaceCard!AY281=\"\",\"\",RaceCard!AY281)","v":""},{"$f":"IF(RaceCard!AZ281=\"\",\"\",RaceCard!AZ281)","v":""},{"$f":"IF(RaceCard!BA281=\"\",\"\",RaceCard!BA281)","v":""},{"$f":"IF(RaceCard!BB281=\"\",\"\",RaceCard!BB281)","v":""},{"$f":"IF(RaceCard!BC281=\"\",\"\",RaceCard!BC281)","v":""},{"$f":"IF(AI280=\"\",\"\",IF(ISERROR(VLOOKUP(AI280,RaceCard!$AD$2:$AF$48,2,FALSE)),\"X\",VLOOKUP(AI280,RaceCard!$AD$2:$AF$48,3,FALSE)))","v":""},{"$f":"IF(AG280=\"\",\"\",CONCATENATE(AM280,\"-\",TEXT(AJ280,\"00\")))","v":""}]
[{"$nulls":31},281,"",{"$f":"IF(RaceCard!AY282=\"\",\"\",RaceCard!AY282)","v":""},{"$f":"IF(RaceCard!AZ282=\"\",\"\",RaceCard!AZ282)","v":""},{"$f":"IF(RaceCard!BA282=\"\",\"\",RaceCard!BA282)","v":""},{"$f":"IF(RaceCard!BB282=\"\",\"\",RaceCard!BB282)","v":""},{"$f":"IF(RaceCard!BC282=\"\",\"\",RaceCard!BC282)","v":""},{"$f":"IF(AI281=\"\",\"\",IF(ISERROR(VLOOKUP(AI281,RaceCard!$AD$2:$AF$48,2,FALSE)),\"X\",VLOOKUP(AI281,RaceCard!$AD$2:$AF$48,3,FALSE)))","v":""},""]
[{"$nulls":31},282,"",{"$f":"IF(RaceCard!AY283=\"\",\"\",RaceCard!AY283)","v":""},{"$f":"IF(RaceCard!AZ283=\"\",\"\",RaceCard!AZ283)","v":""},{"$f":"IF(RaceCard!BA283=\"\",\"\",RaceCard!BA283)","v":""},{"$f":"IF(RaceCard!BB283=\"\",\"\",RaceCard!BB283)","v":""},{"$f":"IF(RaceCard!BC283=\"\",\"\",RaceCard!BC283)","v":""},{"$f":"IF(AI282=\"\",\"\",IF(ISERROR(VLOOKUP(AI282,RaceCard!$AD$2:$AF$48,2,FALSE)),\"X\",VLOOKUP(AI282,RaceCard!$AD$2:$AF$48,3,FALSE)))","v":""},""]
[{"$nulls":31},283,"",{"$f":"IF(RaceCard!AY284=\"\",\"\",RaceCard!AY284)","v":""},{"$f":"IF(RaceCard!AZ284=\"\",\"\",RaceCard!AZ284)","v":""},{"$f":"IF(RaceCard!BA284=\"\",\"\",RaceCard!BA284)","v":""},{"$f":"IF(RaceCard!BB284=\"\",\"\",RaceCard!BB284)","v":""},{"$f":"IF(RaceCard!BC284=\"\",\"\",RaceCard!BC284)","v":""},{"$f":"IF(AI283=\"\",\"\",IF(ISERROR(VLOOKUP(AI283,RaceCard!$AD$2:$AF$48,2,FALSE)),\"X\",VLOOKUP(AI283,RaceCard!$AD$2:$AF$48,3,FALSE)))","v":""},""]
[{"$nulls":31},284,"",{"$f":"IF(RaceCard!AY285=\"\",\"\",RaceCard!AY285)","v":""},{"$f":"IF(RaceCard!AZ285=\"\",\"\",RaceCard!AZ285)","v":""},{"$f":"IF(RaceCard!BA285=\"\",\"\",RaceCard!BA285)","v":""},{"$f":"IF(RaceCard!BB285=\"\",\"\",RaceCard!BB285)","v":""},{"$f":"IF(RaceCard!BC285=\"\",\"\",RaceCard!BC285)","v":""},{"$f":"IF(AI284=\"\",\"\",IF(ISERROR(VLOOKUP(AI284,RaceCard!$AD$2:$AF$48,2,FALSE)),\"X\",VLOOKUP(AI284,RaceCard!$AD$2:$AF$48,3,FALSE)))","v":""},""]
[{"$nulls":31},285,"",{"$f":"IF(RaceCard!AY286=\"\",\"\",RaceCard!AY286)","v":""},{"$f":"IF(RaceCard!AZ286=\"\",\"\",RaceCard!AZ286)","v":""},{"$f":"IF(RaceCard!BA286=\"\",\"\",RaceCard!BA286)","v":""},{"$f":"IF(RaceCard!BB286=\"\",\"\",RaceCard!BB286)","v":""},{"$f":"IF(RaceCard!BC286=\"\",\"\",RaceCard!BC286)","v":""},{"$f":"IF(AI285=\"\",\"\",IF(ISERROR(VLOOKUP(AI285,RaceCard!$AD$2:$AF$48,2,FALSE)),\"X\",VLOOKUP(AI285,RaceCard!$AD$2:$AF$48,3,FALSE)))","v":""},""]
[{"$nulls":31},286,"",{"$f":"IF(RaceCard!AY287=\"\",\"\",RaceCard!AY287)","v":""},{"$f":"IF(RaceCard!AZ287=\"\",\"\",RaceCard!AZ287)","v":""},{"$f":"IF(RaceCard!BA287=\"\",\"\",RaceCard!BA287)","v":""},{"$f":"IF(RaceCard!BB287=\"\",\"\",RaceCard!BB287)","v":""},{"$f":"IF(RaceCard!BC287=\"\",\"\",RaceCard!BC287)","v":""},{"$f":"IF(AI286=\"\",\"\",IF(ISERROR(VLOOKUP(AI286,RaceCard!$AD$2:$AF$48,2,FALSE)),\"X\",VLOOKUP(AI286,RaceCard!$AD$2:$AF$48,3,FALSE)))","v":""},""]
[{"$nulls":31},287,"",{"$f":"IF(RaceCard!AY288=\"\",\"\",RaceCard!AY288)","v":""},{"$f":"IF(RaceCard!AZ288=\"\",\"\",RaceCard!AZ288)","v":""},{"$f":"IF(RaceCard!BA288=\"\",\"\",RaceCard!BA288)","v":""},{"$f":"IF(RaceCard!BB288=\"\",\"\",RaceCard!BB288)","v":""},{"$f":"IF(RaceCard!BC288=\"\",\"\",RaceCard!BC288)","v":""},{"$f":"IF(AI287=\"\",\"\",IF(ISERROR(VLOOKUP(AI287,RaceCard!$AD$2:$AF$48,2,FALSE)),\"X\",VLOOKUP(AI287,RaceCard!$AD$2:$AF$48,3,FALSE)))","v":""},""]
[{"$nulls":31},288,"",{"$f":"IF(RaceCard!AY289=\"\",\"\",RaceCard!AY289)","v":""},{"$f":"IF(RaceCard!AZ289=\"\",\"\",RaceCard!AZ289)","v":""},{"$f":"IF(RaceCard!BA289=\"\",\"\",RaceCard!BA289)","v":""},{"$f":"IF(RaceCard!BB289=\"\",\"\",RaceCard!BB289)","v":""},{"$f":"IF(RaceCard!BC289=\"\",\"\",RaceCard!BC289)","v":""},{"$f":"IF(AI288=\"\",\"\",IF(ISERROR(VLOOKUP(AI288,RaceCard!$AD$2:$AF$48,2,FALSE)),\"X\",VLOOKUP(AI288,RaceCard!$AD$2:$AF$48,3,FALSE)))","v":""},""]
[{"$nulls":31},289,"",{"$f":"IF(RaceCard!AY290=\"\",\"\",RaceCard!AY290)","v":""},{"$f":"IF(RaceCard!AZ290=\"\",\"\",RaceCard!AZ290)","v":""},{"$f":"IF(RaceCard!BA290=\"\",\"\",RaceCard!BA290)","v":""},{"$f":"IF(RaceCard!BB290=\"\",\"\",RaceCard!BB290)","v":""},{"$f":"IF(RaceCard!BC290=\"\",\"\",RaceCard!BC290)","v":""},{"$f":"IF(AI289=\"\",\"\",IF(ISERROR(VLOOKUP(AI289,RaceCard!$AD$2:$AF$48,2,FALSE)),\"X\",VLOOKUP(AI289,RaceCard!$AD$2:$AF$48,3,FALSE)))","v":""},""]
[{"$nulls":31},290,"",{"$f":"IF(RaceCard!AY291=\"\",\"\",RaceCard!AY291)","v":""},{"$f":"IF(RaceCard!AZ291=\"\",\"\",RaceCard!AZ291)","v":""},{"$f":"IF(RaceCard!BA291=\"\",\"\",RaceCard!BA291)","v":""},{"$f":"IF(RaceCard!BB291=\"\",\"\",RaceCard!BB291)","v":""},{"$f":"IF(RaceCard!BC291=\"\",\"\",RaceCard!BC291)","v":""},{"$f":"IF(AI290=\"\",\"\",IF(ISERROR(VLOOKUP(AI290,RaceCard!$AD$2:$AF$48,2,FALSE)),\"X\",VLOOKUP(AI290,RaceCard!$AD$2:$AF$48,3,FALSE)))","v":""},""]
[{"$nulls":31},291,"",{"$f":"IF(RaceCard!AY292=\"\",\"\",RaceCard!AY292)","v":""},{"$f":"IF(RaceCard!AZ292=\"\",\"\",RaceCard!AZ292)","v":""},{"$f":"IF(RaceCard!BA292=\"\",\"\",RaceCard!BA292)","v":""},{"$f":"IF(RaceCard!BB292=\"\",\"\",RaceCard!BB292)","v":""},{"$f":"IF(RaceCard!BC292=\"\",\"\",RaceCard!BC292)","v":""},{"$f":"IF(AI291=\"\",\"\",IF(ISERROR(VLOOKUP(AI291,RaceCard!$AD$2:$AF$48,2,FALSE)),\"X\",VLOOKUP(AI291,RaceCard!$AD$2:$AF$48,3,FALSE)))","v":""},""]
[{"$nulls":31},292,"",{"$f":"IF(RaceCard!AY293=\"\",\"\",RaceCard!AY293)","v":""},{"$f":"IF(RaceCard!AZ293=\"\",\"\",RaceCard!AZ293)","v":""},{"$f":"IF(RaceCard!BA293=\"\",\"\",RaceCard!BA293)","v":""},{"$f":"IF(RaceCard!BB293=\"\",\"\",RaceCard!BB293)","v":""},{"$f":"IF(RaceCard!BC293=\"\",\"\",RaceCard!BC293)","v":""},{"$f":"IF(AI292=\"\",\"\",IF(ISERROR(VLOOKUP(AI292,RaceCard!$AD$2:$AF$48,2,FALSE)),\"X\",VLOOKUP(AI292,RaceCard!$AD$2:$AF$48,3,FALSE)))","v":""},""]
[{"$nulls":31},293,"",{"$f":"IF(RaceCard!AY294=\"\",\"\",RaceCard!AY294)","v":""},{"$f":"IF(RaceCard!AZ294=\"\",\"\",RaceCard!AZ294)","v":""},{"$f":"IF(RaceCard!BA294=\"\",\"\",RaceCard!BA294)","v":""},{"$f":"IF(RaceCard!BB294=\"\",\"\",RaceCard!BB294)","v":""},{"$f":"IF(RaceCard!BC294=\"\",\"\",RaceCard!BC294)","v":""},{"$f":"IF(AI293=\"\",\"\",IF(ISERROR(VLOOKUP(AI293,RaceCard!$AD$2:$AF$48,2,FALSE)),\"X\",VLOOKUP(AI293,RaceCard!$AD$2:$AF$48,3,FALSE)))","v":""},""]
[{"$nulls":31},294,"",{"$f":"IF(RaceCard!AY295=\"\",\"\",RaceCard!AY295)","v":""},{"$f":"IF(RaceCard!AZ295=\"\",\"\",RaceCard!AZ295)","v":""},{"$f":"IF(RaceCard!BA295=\"\",\"\",RaceCard!BA295)","v":""},{"$f":"IF(RaceCard!BB295=\"\",\"\",RaceCard!BB295)","v":""},{"$f":"IF(RaceCard!BC295=\"\",\"\",RaceCard!BC295)","v":""},{"$f":"IF(AI294=\"\",\"\",IF(ISERROR(VLOOKUP(AI294,RaceCard!$AD$2:$AF$48,2,FALSE)),\"X\",VLOOKUP(AI294,RaceCard!$AD$2:$AF$48,3,FALSE)))","v":""},""]
[{"$nulls":31},295,"",{"$f":"IF(RaceCard!AY296=\"\",\"\",RaceCard!AY296)","v":""},{"$f":"IF(RaceCard!AZ296=\"\",\"\",RaceCard!AZ296)","v":""},{"$f":"IF(RaceCard!BA296=\"\",\"\",RaceCard!BA296)","v":""},{"$f":"IF(RaceCard!BB296=\"\",\"\",RaceCard!BB296)","v":""},{"$f":"IF(RaceCard!BC296=\"\",\"\",RaceCard!BC296)","v":""},{"$f":"IF(AI295=\"\",\"\",IF(ISERROR(VLOOKUP(AI295,RaceCard!$AD$2:$AF$48,2,FALSE)),\"X\",VLOOKUP(AI295,RaceCard!$AD$2:$AF$48,3,FALSE)))","v":""},""]
[{"$nulls":31},296,"",{"$f":"IF(RaceCard!AY297=\"\",\"\",RaceCard!AY297)","v":""},{"$f":"IF(RaceCard!AZ297=\"\",\"\",RaceCard!AZ297)","v":""},{"$f":"IF(RaceCard!BA297=\"\",\"\",RaceCard!BA297)","v":""},{"$f":"IF(RaceCard!BB297=\"\",\"\",RaceCard!BB297)","v":""},{"$f":"IF(RaceCard!BC297=\"\",\"\",RaceCard!BC297)","v":""},{"$f":"IF(AI296=\"\",\"\",IF(ISERROR(VLOOKUP(AI296,RaceCard!$AD$2:$AF$48,2,FALSE)),\"X\",VLOOKUP(AI296,RaceCard!$AD$2:$AF$48,3,FALSE)))","v":""},""]
[{"$nulls":31},297,"",{"$f":"IF(RaceCard!AY298=\"\",\"\",RaceCard!AY298)","v":""},{"$f":"IF(RaceCard!AZ298=\"\",\"\",RaceCard!AZ298)","v":""},{"$f":"IF(RaceCard!BA298=\"\",\"\",RaceCard!BA298)","v":""},{"$f":"IF(RaceCard!BB298=\"\",\"\",RaceCard!BB298)","v":""},{"$f":"IF(RaceCard!BC298=\"\",\"\",RaceCard!BC298)","v":""},{"$f":"IF(AI297=\"\",\"\",IF(ISERROR(VLOOKUP(AI297,RaceCard!$AD$2:$AF$48,2,FALSE)),\"X\",VLOOKUP(AI297,RaceCard!$AD$2:$AF$48,3,FALSE)))","v":""},""]
[{"$nulls":31},298,"",{"$f":"IF(RaceCard!AY299=\"\",\"\",RaceCard!AY299)","v":""},{"$f":"IF(RaceCard!AZ299=\"\",\"\",RaceCard!AZ299)","v":""},{"$f":"IF(RaceCard!BA299=\"\",\"\",RaceCard!BA299)","v":""},{"$f":"IF(RaceCard!BB299=\"\",\"\",RaceCard!BB299)","v":""},{"$f":"IF(RaceCard!BC299=\"\",\"\",RaceCard!BC299)","v":""},{"$f":"IF(AI298=\"\",\"\",IF(ISERROR(VLOOKUP(AI298,RaceCard!$AD$2:$AF$48,2,FALSE)),\"X\",VLOOKUP(AI298,RaceCard!$AD$2:$AF$48,3,FALSE)))","v":""},""]
[{"$nulls":31},299,"",{"$f":"IF(RaceCard!AY300=\"\",\"\",RaceCard!AY300)","v":""},{"$f":"IF(RaceCard!AZ300=\"\",\"\",RaceCard!AZ300)","v":""},{"$f":"IF(RaceCard!BA300=\"\",\"\",RaceCard!BA300)","v":""},{"$f":"IF(RaceCard!BB300=\"\",\"\",RaceCard!BB300)","v":""},{"$f":"IF(RaceCard!BC300=\"\",\"\",RaceCard!BC300)","v":""},{"$f":"IF(AI299=\"\",\"\",IF(ISERROR(VLOOKUP(AI299,RaceCard!$AD$2:$AF$48,2,FALSE)),\"X\",VLOOKUP(AI299,RaceCard!$AD$2:$AF$48,3,FALSE)))","v":""},""]
[{"$nulls":31},300,"",{"$f":"IF(RaceCard!AY301=\"\",\"\",RaceCard!AY301)","v":""},{"$f":"IF(RaceCard!AZ301=\"\",\"\",RaceCard!AZ301)","v":""},{"$f":"IF(RaceCard!BA301=\"\",\"\",RaceCard!BA301)","v":""},{"$f":"IF(RaceCard!BB301=\"\",\"\",RaceCard!BB301)","v":""},{"$f":"IF(RaceCard!BC301=\"\",\"\",RaceCard!BC301)","v":""},{"$f":"IF(AI300=\"\",\"\",IF(ISERROR(VLOOKUP(AI300,RaceCard!$AD$2:$AF$48,2,FALSE)),\"X\",VLOOKUP(AI300,RaceCard!$AD$2:$AF$48,3,FALSE)))","v":""},""]
[{"$nulls":31},301,"",{"$f":"IF(RaceCard!AY302=\"\",\"\",RaceCard!AY302)","v":""},{"$f":"IF(RaceCard!AZ302=\"\",\"\",RaceCard!AZ302)","v":""},{"$f":"IF(RaceCard!BA302=\"\",\"\",RaceCard!BA302)","v":""},{"$f":"IF(RaceCard!BB302=\"\",\"\",RaceCard!BB302)","v":""},{"$f":"IF(RaceCard!BC302=\"\",\"\",RaceCard!BC302)","v":""},{"$f":"IF(AI301=\"\",\"\",IF(ISERROR(VLOOKUP(AI301,RaceCard!$AD$2:$AF$48,2,FALSE)),\"X\",VLOOKUP(AI301,RaceCard!$AD$2:$AF$48,3,FALSE)))","v":""},""]

{"sheet":"Start here","index":2,"n_rows":25,"n_cols":3,"rows_kept":25,"cut":false,"hidden":false,"merged":[]}
[]
[null,"Instructions/Notes"]
[null,"1) Enter a Date in cell A1 in the Review Worksheet"]
[]
[null,"2) In cell B2, select which Race Types you wish to see loaded (R = Horses, G = Greyhounds, RG = Both Greyhounds and Horses)"]
[]
[null,"3) Click the 'Load Races' button and the day's races will appear in the left-hand navigation panel"]
[]
[null,"4) Click on a Race to retrieve race details"]
[]
[null,"5) Sort of Fields as needed"]
[]
[null,"6) if you wish to update only the prices, click the big red 'Update' button in the Review Worksheet"]
[]
[null,"Things to watch out for"]
[null,"1) Sometimes there is a discrepancy between the two tote's Venue Names (Morphettville Park vs. Morphettville, or Sandown-Lakeside vs. Sandown)"]
[null,null,"If this happens and you cannot see a Venue in the Race List navigation panel, , just go to Columns AJ or AD in the Racecard Worksheet, clean up the Venue Names so they match then"]
[null,null," click the 'Reload Races' Button in the Review Worksheet"]
[null,null,"This will reload the Races in the Race List navigation Panel"]
[]
[null,"2) I have not had time to fully test this, but given there are quite a few Excel guns on this forum, I am sure they fix what needs fixing if a bug or error is found."]
[]
[null,"3) If a meeting is abandoned, it will pop up a message saying so. Click OK and move on to a different race. Today( 27/01/2012), you will see this if you click on Ipswich races"]
[]
[null,"4) Enjoy!"]