{"text_format":"2","workbook":"xlsx","n_sheets":16,"sheets":["Instructions","Sheet2","consensus","Sheet3","Impact","Formbook","class","Tops","Nines","BlackBook","RacePage","form","Prices","albury","test","form2"],"not_rendered":{"charts":0,"images":0,"macros":1,"external_links":0,"defined_names":2043,"comments":4,"pivot_tables":0},"unopened":[],"bounds":{"document_bytes":16777216,"sheet_cells":100000,"run_cost":"one","rows_first":2000,"rows_last":500,"rows_between":2000,"halvings":0,"cell_chars":16384,"cell_head_chars":4096},"cells_cut":0,"cells_raw":0,"read":"whole","date_system":"1900"}

{"sheet":"Instructions","index":0,"n_rows":109,"n_cols":4,"rows_kept":109,"cut":false,"hidden":false,"merged":[]}
[" "]
[null,"Updated",null,{"$f":"NOW()","v":"2023-06-07T11:58:31.380"}]
[]
[null,"Instructions"]
[]
[null,"1) The \"Reset\" button will clear the sheet and delete any stored races or selections."]
[null,"2) Go to \"https://www.racingaustralia.horse/home.aspx\"  to select your venues."]
[null,"3) Choose a venue, when the page loads click on \"Recent Form\" then click on \"Print Friendly.\""]
[null,"4) Press the \"CTRL\" and the letter \"A\" on your keyboard at the same time, it should highlight the page."]
[null,"5) Press the \"CTRL\" and the letter \"C\" on your keyboard at the same time, it should copyt the page."]
[null,"6) Come back to excel and press the \"Master\" tab, the yellow one at the bottom of the page."]
[null,"8) Click A3 cell, right click and select paste values, press the \"Copy Venue\" button, It will take about 10 seconds for it to finish, "]
[null,"     you should see a new tab with the venue name at the bottom."]
[null,"9) Go back to the webpage, close the \"Recent Form\" website then click back on the \"Racing Australia\" site and click the \"Racing Australia\" logo at the top to return to home screen."]
[null,"10) Repeat steps 3 to 8 for all venues needed, the excel sheet may slow a bit if you choose more than about 8 venues, When you have added all races click \"Finished Races\""]
[]
[]
[null,"Selecting Races"]
[]
[null,"Manual Mode"]
[null,"1) Select the \"RacePage\" sheet there is a dropdown menue under \"Venue\" you can select your venue here then just type in the race number,"]
[null,"     this will display the runners, you can make changes in the drop down box next to \"Rating System\" and \"No of Selections\",  press the \"Copy\" button  the selections for that race, "]
[null,"    will be copied to the \"Selections\" sheet, a green display will indicate when copied."]
[null,"2) Late scratchings can be added by putting an \"X\" in the box next to each runners price under the heading \"L/Scr\"."]
[]
[]
[null,"Automatic Mode"]
[]
[null,"1) Under the selections box you will see some options, \"Min Race Class\", \"Min Rated Price\" & \"Max Rated Price\"  you can filter the races"]
[null,"      you want,  for example to select all OPEN and above races select \"Open\",the races are listed in a reasonably accurate class order from lowest to highest."]
[null,"2) You can also filter the rated price selected, these are left at 0.00 and 100.00 to include all runners."]
[null,"3) There is a dropdown box above \"Auto Select\" button that gives you the option to select from \"Race Card\" or \"Venue\", if you choose \"Venue\" it will start from the current race number"]
[null,"      and selected venue, this could be usefull in just selecting from quaddie races."]
[null,"4) If a race qualifies with selections the current rated prices will be added and the selections copied to the \"Selections\" sheet."]
[null,"5) \"Auto Select\" button starts the process, the \"Clear Sel\" button will clear all saved selections, this is used to start a fresh filter with out erasing the venues."]
[null,"6) The \"Selections\" tab is where you will find your selections, the grey shaded area contains fomulas, "]
[null,"     this part is designed to work with an automated betting sheet for \"Gruss Betting Assistant\" used with betfair."]
[]
[null,"Ratings Sheets"]
[null,"I have colour coded the top 4 runners along with scratchings to make it easier to identify."]
[]
[null,"Green = 1st Selection"]
[null,"Yellow = 2nd Selections"]
[null,"Orange = 3rd Selection"]
[null,"Blue = 4th Selection"]
[null,"Red = 2nd Scratched"]
[]
[]
[]
[null,"Ratings Sheets"]
[]
[null,"The sheets provided are from a few different articles I read in my time and adapted to suit my needs, I won't say they are total winners but used with selected races "]
[null,"they can perform well and will throw up some nice overlays."]
[null,"The pricing model I use is another gem I found and used with the correct ratings can be one of the most accurate I have used, "]
[null,"the formulas are on the \"Prices\" tab and will utilise most systems."]
[]
[null,"Consensus"]
[null,"These ratings take in to account a lot of variables from form,fitness, track conditions and class, some of these elements are only available based on conditions,"]
[null,"such as rain effected ground or first and second up form."]
[]
[null,"Impact"]
[null,"I got the basics of these from an old PPM magazine,a lot of what they sold and posted was crap but these made sense."]
[null,"The idea was that they studied 10.000 races and looked at each form variable and found that a particular number of runners won more or lost more "]
[null,"than the average of all runners, so looking at the ratings if you consider 1 as 100%,  a runner scoring 1.22 has 22% more chance of winning, "]
[null,"a runner with say 0.67 would lose 33% more races."]
[]
[null,"FormBook"]
[null,"This was another PPM system, essential it provided a rating number for the last 2 runs and the last 2 finish positions."]
[]
[null,"Class"]
[null,"Just an Idea using just race class as a rating."]
[]
[null,"Tops"]
[null,"This selects the best on strike rate and ave prizemoney."]
[]
[null,"BlackBook"]
[null,"I had an idea once that a lot of winners come from the first 4 starts from a spell, I added a couple other criteria, these selections should be followed for a few runs."]
[]
[null,"Nines"]
[null,"Another system from the 90s, it will select runners that the last 3 finished positions add to 9 or less, spells and zeroa are 10."]
[]
[null,"Consensus Botton"]
[]
[null,"You will see a \"Consensus\" button on the \"RacePage\" what this will do is provide a consensus of up to 4 runners in these ratings choices."]
[null,"\"Consensus\", \"Impact\", FormBook\" and \"Class\"."]
[null,"1) Clear current selections, use drop down box to select up to 4 runners."]
[null,"2) Choose \"Consensus\" as the ratings system then copy the results, when light is green change your ratings selection to \"Impact\" when the light goes out press \"Copy\" again."]
[null,"3) Continue this untill you have copied all 4 ratings systems, press \"Consensus\" button. This will arange the selections on the \"Selections\" page,"]
[null,"     with a 4,3,2,1 rating based on the ratings plans you chose, just add up each runners rating and back the top couple or just the highest runner, your choice."]
[]
[null,"Adding Your Own Ratings"]
[null,"The \"Form\" sheet connects to the venue sheets, there is code in A1 and A2 that tell it which venue and race to look at, the best advice I could give would be to create a copy "]
[null,"of the \"Impact\" ratings sheet, if you look at the code under each heading you will see it connects to form on the form sheet, start by renaming your new sheet, "]
[null,"add that name to the \"Form\" sheet under \"Ratings Systems\"."]
[null,"You also need to add the worksheet name to the list on the \"Master\" sheet at \"HO\" any other sheets you add to the workbook also need to be listed here."]
[]
[null,"if you have a basic understanding of excel formulas you should be able to manipulate your new sheet with new ratings, you will notice a green line at the bottom of the sheet,"]
[null,"this is the max rating for each criteria, this is used in the pricing and is not a fomula so make sure you update this."]
[]
[null,"Word Filter"]
[null,"The Racing Australia site likes to add additional items to the runners names, these are filtered out so the lookup function works correctly, if you notice additional words"]
[null,"being added to the runners name go to the \"Master\" sheet and look for column \"HM\" you can add to the filter in that list anything that needs to be removed."]
[]
[null,"Class Rating"]
[null,"The main class rating is on the \"Master\" sheet column HB to HC you can adjust the figures in HB if you wish, these number are used in calculations to separate the classes,"]
[null,"you will see some extra class figures in HF/HG these are used as bonus and panalties, the figures in HF can be adjusted also."]
[null,"These figures will affect the \"Consensus Ratings\"and the race class filter when using \"Austo Select\", just a word of warning, if you add or delete ratings classes "]
[null,"make sure you adjust the code on the \"Consensus Ratings\" sheet in column AK and AO this fomula looks at the total number of cells displaying a rating, "]
[null,"if the ratings go down to line 93 then your formula must be adjusted to this."]

{"sheet":"Sheet2","index":1,"n_rows":1,"n_cols":1,"rows_kept":1,"cut":false,"hidden":false,"merged":[]}
[{"$f":"IF($B2=\"\", \"\", IF($B2=\"SCRATCHED\", \"Red\", IF(COUNTIF($B$2:$B2, $B2)<=4, CHOOSE(COUNTIF($B$2:$B2, $B2), \"Green\", \"Yellow\", \"Orange\", \"Blue\"), \"\")))","v":""}]

{"sheet":"consensus","index":2,"n_rows":18,"n_cols":14,"rows_kept":18,"cut":false,"hidden":false,"merged":[]}
[]
["Rating",null,"No","tab +","Name","Form Element",null,"trn","jkt","api","lsr","dls"]
[{"$f":"IF(form!D3=\"\",\"\",IF(E3=\"\",\"\",D3+M3+J3))","v":21.9},{"$f":"IF(A3=\"\",\"\",$A$15/A3*85%)","v":6.7223744292237448},{"$f":"form!D3","v":"1"},{"$f":"IF($E3=\"\",\"\",IFERROR(test!C2,0))","v":20},{"$f":"IF($C3=\"\",\"\",IFERROR(form!E3,0))","v":"VITAL GEM"},{"$f":"IF($C3=\"\",\"\",IFERROR(form!F3,0))","v":"233"},{"$f":"IF(MID(F3,3,1)=\"1\", 10, IF(MID(F3,3,1)=\"2\", 9, IF(MID(F3,3,1)=\"3\", 8, IF(MID(F3,3,1)=\"4\", 7, \"\"))))","v":8},{"$f":"IF($E3=\"\",\"\",IFERROR(form2!E3,0))","v":1.9},{"$f":"IF($E3=\"\",\"\",IFERROR(form!I3,0))","v":"3.4"},{"$f":"IF($E3=\"\",\"\",IFERROR(form!J3,0))","v":"1.9"},{"$f":"IF($E3=\"\",\"\",IFERROR(form!K3,0))","v":"30.5"},{"$f":"IF($C3<>\"\",IFERROR(form!L3,0),\"\")","v":"14"},null,{"$f":"IF($E3=\"\",\"\",IFERROR(test!C2,0))","v":20}]
[{"$f":"IF(form!D4=\"\",\"\",IF(E4=\"\",\"\",D4+M4+J4))","v":22.3},{"$f":"IF(A4=\"\",\"\",$A$15/A4*85%)","v":6.6017937219730944},{"$f":"form!D4","v":"2"},{"$f":"IF($E4=\"\",\"\",IFERROR(test!C3,0))","v":19},{"$f":"IF($C4=\"\",\"\",IFERROR(form!E4,0))","v":"ARNRAY"},{"$f":"IF($C4=\"\",\"\",IFERROR(form!F4,0))","v":"0x7"},{"$f":"IF(MID(F4,3,1)=\"1\", 10, IF(MID(F4,3,1)=\"2\", 9, IF(MID(F4,3,1)=\"3\", 8, IF(MID(F4,3,1)=\"4\", 7, \"\"))))","v":""},{"$f":"IF($E4=\"\",\"\",IFERROR(form!H4,0))","v":"1.9"},{"$f":"IF($E4=\"\",\"\",IFERROR(form!I4,0))","v":"1.7"},{"$f":"IF($E4=\"\",\"\",IFERROR(form!J4,0))","v":"3.3"},{"$f":"IF($E4=\"\",\"\",IFERROR(form!K4,0))","v":"22"},{"$f":"IF($C4<>\"\",IFERROR(form!L4,0),\"\")","v":"14"},null,{"$f":"IF($E4=\"\",\"\",IFERROR(test!C3,0))","v":19}]
[{"$f":"IF(form!D5=\"\",\"\",IF(E5=\"\",\"\",D5+M5+J5))","v":20.100000000000001},{"$f":"IF(A5=\"\",\"\",$A$15/A5*85%)","v":7.324378109452736},{"$f":"form!D5","v":"3"},{"$f":"IF($E5=\"\",\"\",IFERROR(test!C4,0))","v":18},{"$f":"IF($C5=\"\",\"\",IFERROR(form!E5,0))","v":"SUPER SALSA"},{"$f":"IF($C5=\"\",\"\",IFERROR(form!F5,0))","v":"641"},10,{"$f":"IF($E5=\"\",\"\",IFERROR(form!H5,0))","v":"4.4"},{"$f":"IF($E5=\"\",\"\",IFERROR(form!I5,0))","v":"2.3"},{"$f":"IF($E5=\"\",\"\",IFERROR(form!J5,0))","v":"2.1"},{"$f":"IF($E5=\"\",\"\",IFERROR(form!K5,0))","v":"26"},{"$f":"IF($C5<>\"\",IFERROR(form!L5,0),\"\")","v":"10"},null,{"$f":"IF($E5=\"\",\"\",IFERROR(test!C4,0))","v":18}]
[{"$f":"IF(form!D6=\"\",\"\",IF(E6=\"\",\"\",D6+M6+J6))","v":19.600000000000001},7.5112244897959179,{"$f":"form!D6","v":"4"},{"$f":"IF($E6=\"\",\"\",IFERROR(test!C5,0))","v":17},{"$f":"IF($C6=\"\",\"\",IFERROR(form!E6,0))","v":"LATHAMS WISH"},{"$f":"IF($C6=\"\",\"\",IFERROR(form!F6,0))","v":"x60"},"",{"$f":"IF($E6=\"\",\"\",IFERROR(form!H6,0))","v":"2.3"},{"$f":"IF($E6=\"\",\"\",IFERROR(form!I6,0))","v":"2.4"},{"$f":"IF($E6=\"\",\"\",IFERROR(form!J6,0))","v":"2.6"},{"$f":"IF($E6=\"\",\"\",IFERROR(form!K6,0))","v":"21"},{"$f":"IF($C6<>\"\",IFERROR(form!L6,0),\"\")","v":"13"},null,{"$f":"IF($E6=\"\",\"\",IFERROR(test!C5,0))","v":17}]
[{"$f":"IF(form!D7=\"\",\"\",IF(E7=\"\",\"\",D7+M7+J7))","v":20.399999999999999},7.2166666666666677,{"$f":"form!D7","v":"5"},{"$f":"IF($E7=\"\",\"\",IFERROR(test!C6,0))","v":16},{"$f":"IF($C7=\"\",\"\",IFERROR(form!E7,0))","v":"I LOVE YOUR SMILE"},{"$f":"IF($C7=\"\",\"\",IFERROR(form!F7,0))","v":"421"},10,{"$f":"IF($E7=\"\",\"\",IFERROR(form!H7,0))","v":"1.8"},{"$f":"IF($E7=\"\",\"\",IFERROR(form!I7,0))","v":"1.7"},{"$f":"IF($E7=\"\",\"\",IFERROR(form!J7,0))","v":"4.4"},{"$f":"IF($E7=\"\",\"\",IFERROR(form!K7,0))","v":"30"},{"$f":"IF($C7<>\"\",IFERROR(form!L7,0),\"\")","v":"14"},null,{"$f":"IF($E7=\"\",\"\",IFERROR(test!C6,0))","v":16}]
[{"$f":"IF(form!D8=\"\",\"\",IF(E8=\"\",\"\",D8+M8+J8))","v":19.5},7.5497435897435903,{"$f":"form!D8","v":"6"},{"$f":"IF($E8=\"\",\"\",IFERROR(test!C7,0))","v":15},{"$f":"IF($C8=\"\",\"\",IFERROR(form!E8,0))","v":"YONGA LASS"},{"$f":"IF($C8=\"\",\"\",IFERROR(form!F8,0))","v":0},"",{"$f":"IF($E8=\"\",\"\",IFERROR(form!H8,0))","v":"2.3"},{"$f":"IF($E8=\"\",\"\",IFERROR(form!I8,0))","v":"2.1"},{"$f":"IF($E8=\"\",\"\",IFERROR(form!J8,0))","v":"4.5"},{"$f":"IF($E8=\"\",\"\",IFERROR(form!K8,0))","v":0},{"$f":"IF($C8<>\"\",IFERROR(form!L8,0),\"\")","v":"14"},null,{"$f":"IF($E8=\"\",\"\",IFERROR(test!C7,0))","v":15}]
[{"$f":"IF(form!D9=\"\",\"\",IF(E9=\"\",\"\",D9+M9+J9))","v":12.4},11.872580645161291,{"$f":"form!D9","v":"7"},{"$f":"IF($E9=\"\",\"\",IFERROR(test!C8,0))","v":10},{"$f":"IF($C9=\"\",\"\",IFERROR(form!E9,0))","v":"ADELANTE"},{"$f":"IF($C9=\"\",\"\",IFERROR(form!F9,0))","v":"513"},8,{"$f":"IF($E9=\"\",\"\",IFERROR(form!H9,0))","v":"2.2"},{"$f":"IF($E9=\"\",\"\",IFERROR(form!I9,0))","v":"3.5"},{"$f":"IF($E9=\"\",\"\",IFERROR(form!J9,0))","v":"2.4"},{"$f":"IF($E9=\"\",\"\",IFERROR(form!K9,0))","v":"27.5"},{"$f":"IF($C9<>\"\",IFERROR(form!L9,0),\"\")","v":"13"},null,{"$f":"IF($E9=\"\",\"\",IFERROR(test!C8,0))","v":10}]
[{"$f":"IF(form!D10=\"\",\"\",IF(E10=\"\",\"\",D10+M10+J10))","v":11.2},13.144642857142859,{"$f":"form!D10","v":"8"},{"$f":"IF($E10=\"\",\"\",IFERROR(test!C9,0))","v":9},{"$f":"IF($C10=\"\",\"\",IFERROR(form!E10,0))","v":"DEVIL GIRL"},{"$f":"IF($C10=\"\",\"\",IFERROR(form!F10,0))","v":"177"},"",{"$f":"IF($E10=\"\",\"\",IFERROR(form!H10,0))","v":"3.4"},{"$f":"IF($E10=\"\",\"\",IFERROR(form!I10,0))","v":"2.6"},{"$f":"IF($E10=\"\",\"\",IFERROR(form!J10,0))","v":"2.2"},{"$f":"IF($E10=\"\",\"\",IFERROR(form!K10,0))","v":"21.5"},{"$f":"IF($C10<>\"\",IFERROR(form!L10,0),\"\")","v":"21"},null,{"$f":"IF($E10=\"\",\"\",IFERROR(test!C9,0))","v":9}]
[{"$f":"IF(form!D11=\"\",\"\",IF(E11=\"\",\"\",D11+M11+J11))","v":9.3000000000000007},15.83010752688172,{"$f":"form!D11","v":"9"},{"$f":"IF($E11=\"\",\"\",IFERROR(test!C10,0))","v":8},{"$f":"IF($C11=\"\",\"\",IFERROR(form!E11,0))","v":"FLOPPY"},{"$f":"IF($C11=\"\",\"\",IFERROR(form!F11,0))","v":"354"},7,{"$f":"IF($E11=\"\",\"\",IFERROR(form!H11,0))","v":"3.4"},{"$f":"IF($E11=\"\",\"\",IFERROR(form!I11,0))","v":"3.9"},{"$f":"IF($E11=\"\",\"\",IFERROR(form!J11,0))","v":"1.3"},{"$f":"IF($E11=\"\",\"\",IFERROR(form!K11,0))","v":"30"},{"$f":"IF($C11<>\"\",IFERROR(form!L11,0),\"\")","v":"7"},null,{"$f":"IF($E11=\"\",\"\",IFERROR(test!C10,0))","v":8}]
[{"$f":"IF(form!D12=\"\",\"\",IF(E12=\"\",\"\",D12+M12+J12))","v":8.3000000000000007},17.737349397590361,{"$f":"form!D12","v":"10"},{"$f":"IF($E12=\"\",\"\",IFERROR(test!C11,0))","v":7},{"$f":"IF($C12=\"\",\"\",IFERROR(form!E12,0))","v":"JOLLY ODD"},{"$f":"IF($C12=\"\",\"\",IFERROR(form!F12,0))","v":"814"},7,{"$f":"IF($E12=\"\",\"\",IFERROR(form!H12,0))","v":"1.9"},{"$f":"IF($E12=\"\",\"\",IFERROR(form!I12,0))","v":"2.2"},{"$f":"IF($E12=\"\",\"\",IFERROR(form!J12,0))","v":"1.3"},{"$f":"IF($E12=\"\",\"\",IFERROR(form!K12,0))","v":"22.5"},{"$f":"IF($C12<>\"\",IFERROR(form!L12,0),\"\")","v":"13"},null,{"$f":"IF($E12=\"\",\"\",IFERROR(test!C11,0))","v":7}]
[{"$f":"IF(form!D13=\"\",\"\",IF(E13=\"\",\"\",D13+M13+J13))","v":8.1999999999999993},17.953658536585369,{"$f":"form!D13","v":"11"},{"$f":"IF($E13=\"\",\"\",IFERROR(test!C12,0))","v":6},{"$f":"IF($C13=\"\",\"\",IFERROR(form!E13,0))","v":"working"},{"$f":"IF($C13=\"\",\"\",IFERROR(form!F13,0))","v":"235"},"",{"$f":"IF($E13=\"\",\"\",IFERROR(form!H13,0))","v":"2"},{"$f":"IF($E13=\"\",\"\",IFERROR(form!I13,0))","v":"2"},{"$f":"IF($E13=\"\",\"\",IFERROR(form!J13,0))","v":"2.2"},{"$f":"IF($E13=\"\",\"\",IFERROR(form!K13,0))","v":"28.5"},{"$f":"IF($C13<>\"\",IFERROR(form!L13,0),\"\")","v":"34"}]
[{"$f":"IF(form!D14=\"\",\"\",IF(E14=\"\",\"\",D14+M14+J14))","v":""},"",{"$f":"form!D14","v":"12"},{"$f":"IF($E14=\"\",\"\",IFERROR(test!C13,0))","v":""},null,{"$f":"IF($C14=\"\",\"\",IFERROR(form!F14,0))","v":"782"},9]
[{"$f":"SUM(A3:A14)","v":173.20000000000002},0.85,null,{"$f":"IF(ISBLANK(C15),\"\",CHOOSE(C15,20,19,18,17,16,15,14,13,12,11,10,9))","v":""},null,{"$f":"IF($C15=\"\",\"\",IFERROR(form!F15,0))","v":""}]
[{"$nulls":5},{"$f":"IF($C16=\"\",\"\",IFERROR(form!F16,0))","v":""}]
[{"$nulls":5},{"$f":"IF($C17=\"\",\"\",IFERROR(form!F17,0))","v":""}]
[null,null,null,"FORMULA WORKS"]

{"sheet":"Sheet3","index":3,"n_rows":3,"n_cols":7,"rows_kept":3,"cut":false,"hidden":false,"merged":[]}
[{"$nulls":5},342]
[]
[{"$nulls":5},"32x",{"$f":"IF(MID(F3,3,1)=\"1\", 10, IF(MID(F3,3,1)=\"2\", 9, IF(MID(F3,3,1)=\"3\", 8, IF(MID(F3,3,1)=\"x\", 7, \"\"))))","v":7}]

{"sheet":"Impact","index":4,"n_rows":89,"n_cols":19,"rows_kept":89,"cut":false,"hidden":false,"merged":[]}
[]
["Rating","Name","Form Element",null,"No",null,null,"TR","JK","API","LSR","DLR",{"$nulls":5},"price"]
[{"$f":"IF(form!D3=\"\",\"\",IF(B3=\"\",\"\",H3*5+I3*5+J3*5+K3+F3))","v":89.5},{"$f":"IF($E3=\"\",\"\",IFERROR(form!E3,0))","v":"VITAL GEM"},{"$f":"IF($E3=\"\",\"\",IFERROR(form!F3,0))","v":"233"},{"$f":"IF(MID(C3,3,1)=\"1\", 10, IF(MID(C3,3,1)=\"2\", 9, IF(MID(C3,3,1)=\"3\", 8, IF(MID(C3,3,1)=\"4\", 7, \"\"))))","v":8},{"$f":"form!C3","v":1},{"$f":"IF(E3=1,20,0+IF(E4=2,18,0+IF(E3=3,16,0+IF(E3=4,14,0+IF(E3=5,12,0+IF(E3=6,10,0+IF(E3=7,8,0+IF(E3=8,6,0))))))))","v":20},null,{"$f":"IF($B3=\"\",\"\",IFERROR(form!H3,0))","v":"2.5"},{"$f":"IF($B3=\"\",\"\",IFERROR(form!I3,0))","v":"3.4"},{"$f":"IF($B3=\"\",\"\",IFERROR(form!J3,0))","v":"1.9"},{"$f":"IF($B3=\"\",\"\",IFERROR(form!K3,0))","v":"30.5"},{"$f":"IF($B3=\"\",\"\",IFERROR(form!L3,0))","v":"14"},{"$nulls":4},{"$f":"IF(form!D3=\"\",\"\",IF(B3=\"\",\"\",H3+I3+J3+K3+F3))","v":58.3},{"$f":"IF(B3=\"\",\"\",$Q$17/Q3*85%)","v":7.1572041166380798},{"$f":"1/(Q3/$Q$17)*0.85","v":7.1572041166380798}]
[{"$f":"IF(form!D4=\"\",\"\",IF(B4=\"\",\"\",H4*5+I4*5+J4*5+K4+F4))","v":74.5},{"$f":"IF($E4=\"\",\"\",IFERROR(form!E4,0))","v":"ARNRAY"},{"$f":"IF($E4=\"\",\"\",IFERROR(form!F4,0))","v":"0x7"},{"$f":"IF(MID(C4,3,1)=\"1\", 10, IF(MID(C4,3,1)=\"2\", 9, IF(MID(C4,3,1)=\"3\", 8, IF(MID(C4,3,1)=\"4\", 7, \"\"))))","v":""},{"$f":"form!C4","v":2},{"$f":"IF(E4=1,20,0+IF(E4=2,18,0+IF(E4=3,16,0+IF(E4=4,14,0+IF(E4=5,12,0+IF(E4=6,10,0+IF(E4=7,8,0+IF(E4=8,6,0))))))))","v":18},null,{"$f":"IF($B4=\"\",\"\",IFERROR(form!H4,0))","v":"1.9"},{"$f":"IF($B4=\"\",\"\",IFERROR(form!I4,0))","v":"1.7"},{"$f":"IF($B4=\"\",\"\",IFERROR(form!J4,0))","v":"3.3"},{"$f":"IF($B4=\"\",\"\",IFERROR(form!K4,0))","v":"22"},{"$f":"IF($B4=\"\",\"\",IFERROR(form!L4,0))","v":"14"},{"$nulls":4},{"$f":"IF(form!D4=\"\",\"\",IF(B4=\"\",\"\",H4+I4+J4+K4+F4))","v":46.9},8.8969083155650335,{"$f":"1/(Q4/$Q$17)*0.85","v":8.8969083155650317}]
[{"$f":"IF(form!D5=\"\",\"\",IF(B5=\"\",\"\",H5*5+I5*5+J5*5+K5+F5))","v":86},{"$f":"IF($E5=\"\",\"\",IFERROR(form!E5,0))","v":"SUPER SALSA"},{"$f":"IF($E5=\"\",\"\",IFERROR(form!F5,0))","v":"641"},10,{"$f":"form!C5","v":3},{"$f":"IF(E5=1,20,0+IF(E5=2,18,0+IF(E5=3,16,0+IF(E5=4,14,0+IF(E5=5,12,0+IF(E5=6,10,0+IF(E5=7,8,0+IF(E5=8,6,0))))))))","v":16},null,{"$f":"IF($B5=\"\",\"\",IFERROR(form!H5,0))","v":"4.4"},{"$f":"IF($B5=\"\",\"\",IFERROR(form!I5,0))","v":"2.3"},{"$f":"IF($B5=\"\",\"\",IFERROR(form!J5,0))","v":"2.1"},{"$f":"IF($B5=\"\",\"\",IFERROR(form!K5,0))","v":"26"},{"$f":"IF($B5=\"\",\"\",IFERROR(form!L5,0))","v":"10"},{"$nulls":4},{"$f":"IF(form!D5=\"\",\"\",IF(B5=\"\",\"\",H5+I5+J5+K5+F5))","v":50.8},8.2138779527559063,8.2138779527559063]
[{"$f":"IF(form!D6=\"\",\"\",IF(B6=\"\",\"\",H6*5+I6*5+J6*5+K6+F6))","v":71.5},{"$f":"IF($E6=\"\",\"\",IFERROR(form!E6,0))","v":"LATHAMS WISH"},{"$f":"IF($E6=\"\",\"\",IFERROR(form!F6,0))","v":"x60"},"",{"$f":"form!C6","v":4},14,null,{"$f":"IF($B6=\"\",\"\",IFERROR(form!H6,0))","v":"2.3"},{"$f":"IF($B6=\"\",\"\",IFERROR(form!I6,0))","v":"2.4"},{"$f":"IF($B6=\"\",\"\",IFERROR(form!J6,0))","v":"2.6"},{"$f":"IF($B6=\"\",\"\",IFERROR(form!K6,0))","v":"21"},{"$f":"IF($B6=\"\",\"\",IFERROR(form!L6,0))","v":"13"},{"$nulls":4},{"$f":"IF(form!D6=\"\",\"\",IF(B6=\"\",\"\",H6+I6+J6+K6+F6))","v":42.3},9.8644208037825063,9.8644208037825063]
[{"$f":"IF(form!D7=\"\",\"\",IF(B7=\"\",\"\",H7*5+I7*5+J7*5+K7+F7))","v":81.5},{"$f":"IF($E7=\"\",\"\",IFERROR(form!E7,0))","v":"I LOVE YOUR SMILE"},{"$f":"IF($E7=\"\",\"\",IFERROR(form!F7,0))","v":"421"},10,{"$f":"form!C7","v":5},12,null,{"$f":"IF($B7=\"\",\"\",IFERROR(form!H7,0))","v":"1.8"},{"$f":"IF($B7=\"\",\"\",IFERROR(form!I7,0))","v":"1.7"},{"$f":"IF($B7=\"\",\"\",IFERROR(form!J7,0))","v":"4.4"},{"$f":"IF($B7=\"\",\"\",IFERROR(form!K7,0))","v":"30"},{"$f":"IF($B7=\"\",\"\",IFERROR(form!L7,0))","v":"14"},{"$nulls":4},{"$f":"IF(form!D7=\"\",\"\",IF(B7=\"\",\"\",H7+I7+J7+K7+F7))","v":49.9},8.3620240480961918,8.3620240480961918]
[{"$f":"IF(form!D8=\"\",\"\",IF(B8=\"\",\"\",H8*5+I8*5+J8*5+K8+F8))","v":54.5},{"$f":"IF($E8=\"\",\"\",IFERROR(form!E8,0))","v":"YONGA LASS"},{"$f":"IF($E8=\"\",\"\",IFERROR(form!F8,0))","v":0},"",{"$f":"form!C8","v":6},10,null,{"$f":"IF($B8=\"\",\"\",IFERROR(form!H8,0))","v":"2.3"},{"$f":"IF($B8=\"\",\"\",IFERROR(form!I8,0))","v":"2.1"},{"$f":"IF($B8=\"\",\"\",IFERROR(form!J8,0))","v":"4.5"},{"$f":"IF($B8=\"\",\"\",IFERROR(form!K8,0))","v":0},{"$f":"IF($B8=\"\",\"\",IFERROR(form!L8,0))","v":"14"},{"$nulls":4},{"$f":"IF(form!D8=\"\",\"\",IF(B8=\"\",\"\",H8+I8+J8+K8+F8))","v":18.899999999999999},22.077513227513229,22.077513227513229]
[{"$f":"IF(form!D9=\"\",\"\",IF(B9=\"\",\"\",H9*5+I9*5+J9*5+K9+F9))","v":76},{"$f":"IF($E9=\"\",\"\",IFERROR(form!E9,0))","v":"ADELANTE"},{"$f":"IF($E9=\"\",\"\",IFERROR(form!F9,0))","v":"513"},8,{"$f":"form!C9","v":7},8,null,{"$f":"IF($B9=\"\",\"\",IFERROR(form!H9,0))","v":"2.2"},{"$f":"IF($B9=\"\",\"\",IFERROR(form!I9,0))","v":"3.5"},{"$f":"IF($B9=\"\",\"\",IFERROR(form!J9,0))","v":"2.4"},{"$f":"IF($B9=\"\",\"\",IFERROR(form!K9,0))","v":"27.5"},{"$f":"IF($B9=\"\",\"\",IFERROR(form!L9,0))","v":"13"},{"$nulls":4},{"$f":"IF(form!D9=\"\",\"\",IF(B9=\"\",\"\",H9+I9+J9+K9+F9))","v":43.6},9.5702981651376149,9.5702981651376149]
[{"$f":"IF(form!D10=\"\",\"\",IF(B10=\"\",\"\",H10*5+I10*5+J10*5+K10+F10))","v":68.5},{"$f":"IF($E10=\"\",\"\",IFERROR(form!E10,0))","v":"DEVIL GIRL"},{"$f":"IF($E10=\"\",\"\",IFERROR(form!F10,0))","v":"177"},"",{"$f":"form!C10","v":8},6,null,{"$f":"IF($B10=\"\",\"\",IFERROR(form!H10,0))","v":"3.4"},{"$f":"IF($B10=\"\",\"\",IFERROR(form!I10,0))","v":"2.6"},{"$f":"IF($B10=\"\",\"\",IFERROR(form!J10,0))","v":"2.2"},{"$f":"IF($B10=\"\",\"\",IFERROR(form!K10,0))","v":"21.5"},{"$f":"IF($B10=\"\",\"\",IFERROR(form!L10,0))","v":"21"},{"$nulls":4},{"$f":"IF(form!D10=\"\",\"\",IF(B10=\"\",\"\",H10+I10+J10+K10+F10))","v":35.700000000000003},11.688095238095237,11.688095238095237]
[{"$f":"IF(form!D11=\"\",\"\",IF(B11=\"\",\"\",H11*5+I11*5+J11*5+K11+F11))","v":73},{"$f":"IF($E11=\"\",\"\",IFERROR(form!E11,0))","v":"FLOPPY"},null,"",{"$f":"form!C11","v":9},0,null,{"$f":"IF($B11=\"\",\"\",IFERROR(form!H11,0))","v":"3.4"},{"$f":"IF($B11=\"\",\"\",IFERROR(form!I11,0))","v":"3.9"},{"$f":"IF($B11=\"\",\"\",IFERROR(form!J11,0))","v":"1.3"},{"$f":"IF($B11=\"\",\"\",IFERROR(form!K11,0))","v":"30"},{"$f":"IF($B11=\"\",\"\",IFERROR(form!L11,0))","v":"7"},{"$nulls":4},{"$f":"IF(form!D11=\"\",\"\",IF(B11=\"\",\"\",H11+I11+J11+K11+F11))","v":38.6},10.809974093264248,10.809974093264248]
[{"$f":"IF(form!D12=\"\",\"\",IF(B12=\"\",\"\",H12*5+I12*5+J12*5+K12+F12))","v":49.5},{"$f":"IF($E12=\"\",\"\",IFERROR(form!E12,0))","v":"JOLLY ODD"},null,"",{"$f":"form!C12","v":10},0,null,{"$f":"IF($B12=\"\",\"\",IFERROR(form!H12,0))","v":"1.9"},{"$f":"IF($B12=\"\",\"\",IFERROR(form!I12,0))","v":"2.2"},{"$f":"IF($B12=\"\",\"\",IFERROR(form!J12,0))","v":"1.3"},{"$f":"IF($B12=\"\",\"\",IFERROR(form!K12,0))","v":"22.5"},{"$f":"IF($B12=\"\",\"\",IFERROR(form!L12,0))","v":"13"},{"$nulls":4},{"$f":"IF(form!D12=\"\",\"\",IF(B12=\"\",\"\",H12+I12+J12+K12+F12))","v":27.9},14.955734767025092,14.955734767025088]
[{"$f":"IF(form!D13=\"\",\"\",IF(B13=\"\",\"\",H13*5+I13*5+J13*5+K13+F13))","v":59.5},{"$f":"IF($E13=\"\",\"\",IFERROR(form!E13,0))","v":"working"},null,"",{"$f":"form!C13","v":11},0,null,{"$f":"IF($B13=\"\",\"\",IFERROR(form!H13,0))","v":"2"},{"$f":"IF($B13=\"\",\"\",IFERROR(form!I13,0))","v":"2"},{"$f":"IF($B13=\"\",\"\",IFERROR(form!J13,0))","v":"2.2"},{"$f":"IF($B13=\"\",\"\",IFERROR(form!K13,0))","v":"28.5"},{"$f":"IF($B13=\"\",\"\",IFERROR(form!L13,0))","v":"34"},{"$nulls":4},{"$f":"IF(form!D13=\"\",\"\",IF(B13=\"\",\"\",H13+I13+J13+K13+F13))","v":34.700000000000003},12.024927953890488,12.024927953890488]
[{"$f":"IF(form!D14=\"\",\"\",IF(B14=\"\",\"\",H14*5+I14*5+J14*5+K14+F14))","v":82.5},{"$f":"IF($E14=\"\",\"\",IFERROR(form!E14,0))","v":"VISIONS OF GRACE"},null,"",{"$f":"form!C14","v":12},0,null,{"$f":"IF($B14=\"\",\"\",IFERROR(form!H14,0))","v":"2.3"},{"$f":"IF($B14=\"\",\"\",IFERROR(form!I14,0))","v":"4.8"},{"$f":"IF($B14=\"\",\"\",IFERROR(form!J14,0))","v":"2.7"},{"$f":"IF($B14=\"\",\"\",IFERROR(form!K14,0))","v":"33.5"},{"$f":"IF($B14=\"\",\"\",IFERROR(form!L14,0))","v":"14"},{"$nulls":4},{"$f":"IF(form!D14=\"\",\"\",IF(B14=\"\",\"\",H14+I14+J14+K14+F14))","v":43.3},9.6366050808314103,9.6366050808314085]
[{"$f":"IF(form!D15=\"\",\"\",IF(B15=\"\",\"\",H15*5+I15+J15+K15+F15))","v":""},{"$nulls":6},{"$f":"IF($B15=\"\",\"\",IFERROR(form!H15,0))","v":""}]
[{"$f":"SUM(A3:A14)","v":866.5},{"$nulls":6},{"$f":"IF($B16=\"\",\"\",IFERROR(form!H14,0))","v":""},{"$f":"IF($B16=\"\",\"\",IFERROR(form!I14,0))","v":""},{"$f":"IF($B16=\"\",\"\",IFERROR(form!J14,0))","v":""},{"$f":"IF($B16=\"\",\"\",IFERROR(form!K14,0))","v":""},{"$nulls":6},{"$f":"IF(B16=\"\",\"\",Q28/Q16*85%)","v":""}]
[{"$nulls":8},{"$f":"IF(H17=\"\",\"\",0+SUBSTITUTE(H17,\"kg\",\"\"))","v":""},{"$nulls":7},{"$f":"SUM(Q3:Q14)","v":490.90000000000003}]
[{"$nulls":8},""]
[]
[{"$nulls":8},""]
[{"$nulls":8},""]
[{"$nulls":8},""]
[{"$nulls":8},""]
[{"$nulls":8},""]
[{"$nulls":8},""]
[{"$nulls":8},""]
[{"$nulls":8},""]
[{"$nulls":8},""]
[{"$nulls":8},""]
[{"$nulls":8},""]
[{"$nulls":8},""]
[{"$nulls":8},""]
[{"$nulls":8},""]
[{"$nulls":8},""]
[{"$nulls":8},""]
[{"$nulls":8},""]
[{"$nulls":8},""]
[{"$nulls":8},""]
[{"$nulls":8},""]
[{"$nulls":8},""]
[{"$nulls":8},""]
[{"$nulls":8},""]
[{"$nulls":8},""]
[{"$nulls":8},""]
[{"$nulls":8},""]
[{"$nulls":8},""]
[{"$nulls":8},""]
[{"$nulls":8},""]
[{"$nulls":8},""]
[{"$nulls":8},""]
[{"$nulls":8},""]
[{"$nulls":8},""]
[{"$nulls":8},""]
[{"$nulls":8},""]
[{"$nulls":8},""]
[{"$nulls":8},""]
[{"$nulls":8},""]
[{"$nulls":8},""]
[{"$nulls":8},""]
[{"$nulls":8},""]
[{"$nulls":8},""]
[{"$nulls":8},""]
[{"$nulls":8},""]
[{"$nulls":8},""]
[{"$nulls":8},""]
[{"$nulls":8},""]
[{"$nulls":8},""]
[{"$nulls":8},""]
[{"$nulls":8},""]
[{"$nulls":8},""]
[{"$nulls":8},""]
[{"$nulls":8},""]
[{"$nulls":8},""]
[{"$nulls":8},""]
[{"$nulls":8},""]
[{"$nulls":8},""]
[{"$nulls":8},""]
[{"$nulls":8},""]
[{"$nulls":8},""]
[{"$nulls":8},""]
[{"$nulls":8},{"$f":"IF(H81=\"\",\"\",0+SUBSTITUTE(H81,\"kg\",\"\"))","v":""}]
[{"$nulls":8},""]
[{"$nulls":8},""]
[{"$nulls":8},""]
[{"$nulls":8},""]
[{"$nulls":8},""]
[{"$nulls":8},""]
[{"$nulls":8},""]
[{"$nulls":8},""]

{"sheet":"Formbook","index":5,"n_rows":89,"n_cols":19,"rows_kept":89,"cut":false,"hidden":false,"merged":[]}
[{"$nulls":9},"A"]
["Rating","Name","Form Element",null,"No",null,null,"TR","JK","API","LSR","DLR",{"$nulls":5},"price"]
[{"$f":"IF(form!D3=\"\",\"\",IF(B3=\"\",\"\",H3+I3+J3+K3+F3))","v":58.3},{"$f":"IF($E3=\"\",\"\",IFERROR(form!E3,0))","v":"VITAL GEM"},{"$f":"IF($E3=\"\",\"\",IFERROR(form!F3,0))","v":"233"},null,{"$f":"form!C3","v":1},{"$f":"IF(E3=1,20,0+IF(E4=2,18,0+IF(E3=3,16,0+IF(E3=4,14,0+IF(E3=5,12,0+IF(E3=6,10,0+IF(E3=7,8,0+IF(E3=8,6,0))))))))","v":20},null,{"$f":"IF($B3=\"\",\"\",IFERROR(form!H3,0))","v":"2.5"},{"$f":"IF($B3=\"\",\"\",IFERROR(form!I3,0))","v":"3.4"},{"$f":"IF($B3=\"\",\"\",IFERROR(form!J3,0))","v":"1.9"},{"$f":"IF($B3=\"\",\"\",IFERROR(form!K3,0))","v":"30.5"},{"$f":"IF($B3=\"\",\"\",IFERROR(form!L3,0))","v":"14"},{"$nulls":4},{"$f":"IF(form!D3=\"\",\"\",IF(B3=\"\",\"\",H3+I3+J3+K3+F3))","v":58.3},{"$f":"IF(B3=\"\",\"\",$Q$17/Q3*85%)","v":7.1572041166380798},{"$f":"1/(Q3/$Q$17)*0.85","v":7.1572041166380798}]
[{"$f":"IF(form!D4=\"\",\"\",IF(B4=\"\",\"\",H4+I4+J4+K4+F4))","v":46.9},{"$f":"IF($E4=\"\",\"\",IFERROR(form!E4,0))","v":"ARNRAY"},{"$f":"IF($E4=\"\",\"\",IFERROR(form!F4,0))","v":"0x7"},null,{"$f":"form!C4","v":2},{"$f":"IF(E4=1,20,0+IF(E4=2,18,0+IF(E4=3,16,0+IF(E4=4,14,0+IF(E4=5,12,0+IF(E4=6,10,0+IF(E4=7,8,0+IF(E4=8,6,0))))))))","v":18},null,{"$f":"IF($B4=\"\",\"\",IFERROR(form!H4,0))","v":"1.9"},{"$f":"IF($B4=\"\",\"\",IFERROR(form!I4,0))","v":"1.7"},{"$f":"IF($B4=\"\",\"\",IFERROR(form!J4,0))","v":"3.3"},{"$f":"IF($B4=\"\",\"\",IFERROR(form!K4,0))","v":"22"},{"$f":"IF($B4=\"\",\"\",IFERROR(form!L4,0))","v":"14"},{"$nulls":4},{"$f":"IF(form!D4=\"\",\"\",IF(B4=\"\",\"\",H4+I4+J4+K4+F4))","v":46.9},8.8969083155650335,{"$f":"1/(Q4/$Q$17)*0.85","v":8.8969083155650317}]
[{"$f":"IF(form!D5=\"\",\"\",IF(B5=\"\",\"\",H5+I5+J5+K5+F5))","v":50.8},{"$f":"IF($E5=\"\",\"\",IFERROR(form!E5,0))","v":"SUPER SALSA"},{"$f":"IF($E5=\"\",\"\",IFERROR(form!F5,0))","v":"641"},null,{"$f":"form!C5","v":3},{"$f":"IF(E5=1,20,0+IF(E5=2,18,0+IF(E5=3,16,0+IF(E5=4,14,0+IF(E5=5,12,0+IF(E5=6,10,0+IF(E5=7,8,0+IF(E5=8,6,0))))))))","v":16},null,{"$f":"IF($B5=\"\",\"\",IFERROR(form!H5,0))","v":"4.4"},{"$f":"IF($B5=\"\",\"\",IFERROR(form!I5,0))","v":"2.3"},{"$f":"IF($B5=\"\",\"\",IFERROR(form!J5,0))","v":"2.1"},{"$f":"IF($B5=\"\",\"\",IFERROR(form!K5,0))","v":"26"},{"$f":"IF($B5=\"\",\"\",IFERROR(form!L5,0))","v":"10"},{"$nulls":4},{"$f":"IF(form!D5=\"\",\"\",IF(B5=\"\",\"\",H5+I5+J5+K5+F5))","v":50.8},8.2138779527559063,8.2138779527559063]
[{"$f":"IF(form!D6=\"\",\"\",IF(B6=\"\",\"\",H6+I6+J6+K6+F6))","v":42.3},{"$f":"IF($E6=\"\",\"\",IFERROR(form!E6,0))","v":"LATHAMS WISH"},{"$f":"IF($E6=\"\",\"\",IFERROR(form!F6,0))","v":"x60"},null,{"$f":"form!C6","v":4},14,null,{"$f":"IF($B6=\"\",\"\",IFERROR(form!H6,0))","v":"2.3"},{"$f":"IF($B6=\"\",\"\",IFERROR(form!I6,0))","v":"2.4"},{"$f":"IF($B6=\"\",\"\",IFERROR(form!J6,0))","v":"2.6"},{"$f":"IF($B6=\"\",\"\",IFERROR(form!K6,0))","v":"21"},{"$f":"IF($B6=\"\",\"\",IFERROR(form!L6,0))","v":"13"},{"$nulls":4},{"$f":"IF(form!D6=\"\",\"\",IF(B6=\"\",\"\",H6+I6+J6+K6+F6))","v":42.3},9.8644208037825063,9.8644208037825063]
[{"$f":"IF(form!D7=\"\",\"\",IF(B7=\"\",\"\",H7+I7+J7+K7+F7))","v":49.9},{"$f":"IF($E7=\"\",\"\",IFERROR(form!E7,0))","v":"I LOVE YOUR SMILE"},{"$f":"IF($E7=\"\",\"\",IFERROR(form!F7,0))","v":"421"},null,{"$f":"form!C7","v":5},12,null,{"$f":"IF($B7=\"\",\"\",IFERROR(form!H7,0))","v":"1.8"},{"$f":"IF($B7=\"\",\"\",IFERROR(form!I7,0))","v":"1.7"},{"$f":"IF($B7=\"\",\"\",IFERROR(form!J7,0))","v":"4.4"},{"$f":"IF($B7=\"\",\"\",IFERROR(form!K7,0))","v":"30"},{"$f":"IF($B7=\"\",\"\",IFERROR(form!L7,0))","v":"14"},{"$nulls":4},{"$f":"IF(form!D7=\"\",\"\",IF(B7=\"\",\"\",H7+I7+J7+K7+F7))","v":49.9},8.3620240480961918,8.3620240480961918]
[{"$f":"IF(form!D8=\"\",\"\",IF(B8=\"\",\"\",H8+I8+J8+K8+F8))","v":18.899999999999999},{"$f":"IF($E8=\"\",\"\",IFERROR(form!E8,0))","v":"YONGA LASS"},{"$f":"IF($E8=\"\",\"\",IFERROR(form!F8,0))","v":0},null,{"$f":"form!C8","v":6},10,null,{"$f":"IF($B8=\"\",\"\",IFERROR(form!H8,0))","v":"2.3"},{"$f":"IF($B8=\"\",\"\",IFERROR(form!I8,0))","v":"2.1"},{"$f":"IF($B8=\"\",\"\",IFERROR(form!J8,0))","v":"4.5"},{"$f":"IF($B8=\"\",\"\",IFERROR(form!K8,0))","v":0},{"$f":"IF($B8=\"\",\"\",IFERROR(form!L8,0))","v":"14"},{"$nulls":4},{"$f":"IF(form!D8=\"\",\"\",IF(B8=\"\",\"\",H8+I8+J8+K8+F8))","v":18.899999999999999},22.077513227513229,22.077513227513229]
[{"$f":"IF(form!D9=\"\",\"\",IF(B9=\"\",\"\",H9+I9+J9+K9+F9))","v":43.6},{"$f":"IF($E9=\"\",\"\",IFERROR(form!E9,0))","v":"ADELANTE"},{"$f":"IF($E9=\"\",\"\",IFERROR(form!F9,0))","v":"513"},null,{"$f":"form!C9","v":7},8,null,{"$f":"IF($B9=\"\",\"\",IFERROR(form!H9,0))","v":"2.2"},{"$f":"IF($B9=\"\",\"\",IFERROR(form!I9,0))","v":"3.5"},{"$f":"IF($B9=\"\",\"\",IFERROR(form!J9,0))","v":"2.4"},{"$f":"IF($B9=\"\",\"\",IFERROR(form!K9,0))","v":"27.5"},{"$f":"IF($B9=\"\",\"\",IFERROR(form!L9,0))","v":"13"},{"$nulls":4},{"$f":"IF(form!D9=\"\",\"\",IF(B9=\"\",\"\",H9+I9+J9+K9+F9))","v":43.6},9.5702981651376149,9.5702981651376149]
[{"$f":"IF(form!D10=\"\",\"\",IF(B10=\"\",\"\",H10+I10+J10+K10+F10))","v":35.700000000000003},{"$f":"IF($E10=\"\",\"\",IFERROR(form!E10,0))","v":"DEVIL GIRL"},{"$f":"IF($E10=\"\",\"\",IFERROR(form!F10,0))","v":"177"},null,{"$f":"form!C10","v":8},6,null,{"$f":"IF($B10=\"\",\"\",IFERROR(form!H10,0))","v":"3.4"},{"$f":"IF($B10=\"\",\"\",IFERROR(form!I10,0))","v":"2.6"},{"$f":"IF($B10=\"\",\"\",IFERROR(form!J10,0))","v":"2.2"},{"$f":"IF($B10=\"\",\"\",IFERROR(form!K10,0))","v":"21.5"},{"$f":"IF($B10=\"\",\"\",IFERROR(form!L10,0))","v":"21"},{"$nulls":4},{"$f":"IF(form!D10=\"\",\"\",IF(B10=\"\",\"\",H10+I10+J10+K10+F10))","v":35.700000000000003},11.688095238095237,11.688095238095237]
[{"$f":"IF(form!D11=\"\",\"\",IF(B11=\"\",\"\",H11+I11+J11+K11+F11))","v":38.6},{"$f":"IF($E11=\"\",\"\",IFERROR(form!E11,0))","v":"FLOPPY"},null,null,{"$f":"form!C11","v":9},0,null,{"$f":"IF($B11=\"\",\"\",IFERROR(form!H11,0))","v":"3.4"},{"$f":"IF($B11=\"\",\"\",IFERROR(form!I11,0))","v":"3.9"},{"$f":"IF($B11=\"\",\"\",IFERROR(form!J11,0))","v":"1.3"},{"$f":"IF($B11=\"\",\"\",IFERROR(form!K11,0))","v":"30"},{"$f":"IF($B11=\"\",\"\",IFERROR(form!L11,0))","v":"7"},{"$nulls":4},{"$f":"IF(form!D11=\"\",\"\",IF(B11=\"\",\"\",H11+I11+J11+K11+F11))","v":38.6},10.809974093264248,10.809974093264248]
[{"$f":"IF(form!D12=\"\",\"\",IF(B12=\"\",\"\",H12+I12+J12+K12+F12))","v":27.9},{"$f":"IF($E12=\"\",\"\",IFERROR(form!E12,0))","v":"JOLLY ODD"},null,null,{"$f":"form!C12","v":10},0,null,{"$f":"IF($B12=\"\",\"\",IFERROR(form!H12,0))","v":"1.9"},{"$f":"IF($B12=\"\",\"\",IFERROR(form!I12,0))","v":"2.2"},{"$f":"IF($B12=\"\",\"\",IFERROR(form!J12,0))","v":"1.3"},{"$f":"IF($B12=\"\",\"\",IFERROR(form!K12,0))","v":"22.5"},{"$f":"IF($B12=\"\",\"\",IFERROR(form!L12,0))","v":"13"},{"$nulls":4},{"$f":"IF(form!D12=\"\",\"\",IF(B12=\"\",\"\",H12+I12+J12+K12+F12))","v":27.9},14.955734767025092,14.955734767025088]
[{"$f":"IF(form!D13=\"\",\"\",IF(B13=\"\",\"\",H13+I13+J13+K13+F13))","v":34.700000000000003},{"$f":"IF($E13=\"\",\"\",IFERROR(form!E13,0))","v":"working"},null,null,{"$f":"form!C13","v":11},0,null,{"$f":"IF($B13=\"\",\"\",IFERROR(form!H13,0))","v":"2"},{"$f":"IF($B13=\"\",\"\",IFERROR(form!I13,0))","v":"2"},{"$f":"IF($B13=\"\",\"\",IFERROR(form!J13,0))","v":"2.2"},{"$f":"IF($B13=\"\",\"\",IFERROR(form!K13,0))","v":"28.5"},{"$f":"IF($B13=\"\",\"\",IFERROR(form!L13,0))","v":"34"},{"$nulls":4},{"$f":"IF(form!D13=\"\",\"\",IF(B13=\"\",\"\",H13+I13+J13+K13+F13))","v":34.700000000000003},12.024927953890488,12.024927953890488]
[{"$f":"IF(form!D14=\"\",\"\",IF(B14=\"\",\"\",H14+I14+J14+K14+F14))","v":43.3},{"$f":"IF($E14=\"\",\"\",IFERROR(form!E14,0))","v":"VISIONS OF GRACE"},null,null,{"$f":"form!C14","v":12},0,null,{"$f":"IF($B14=\"\",\"\",IFERROR(form!H14,0))","v":"2.3"},{"$f":"IF($B14=\"\",\"\",IFERROR(form!I14,0))","v":"4.8"},{"$f":"IF($B14=\"\",\"\",IFERROR(form!J14,0))","v":"2.7"},{"$f":"IF($B14=\"\",\"\",IFERROR(form!K14,0))","v":"33.5"},{"$f":"IF($B14=\"\",\"\",IFERROR(form!L14,0))","v":"14"},{"$nulls":4},{"$f":"IF(form!D14=\"\",\"\",IF(B14=\"\",\"\",H14+I14+J14+K14+F14))","v":43.3},9.6366050808314103,9.6366050808314085]
[]
[{"$f":"SUM(A3:A14)","v":490.90000000000003},{"$nulls":6},{"$f":"IF($B16=\"\",\"\",IFERROR(form!H14,0))","v":""},{"$f":"IF($B16=\"\",\"\",IFERROR(form!I14,0))","v":""},{"$f":"IF($B16=\"\",\"\",IFERROR(form!J14,0))","v":""},{"$f":"IF($B16=\"\",\"\",IFERROR(form!K14,0))","v":""},{"$nulls":6},{"$f":"IF(B16=\"\",\"\",Q28/Q16*85%)","v":""}]
[{"$nulls":8},{"$f":"IF(H17=\"\",\"\",0+SUBSTITUTE(H17,\"kg\",\"\"))","v":""},{"$nulls":7},{"$f":"SUM(Q3:Q14)","v":490.90000000000003}]
[{"$nulls":8},""]
[]
[{"$nulls":8},""]
[{"$nulls":8},""]
[{"$nulls":8},""]
[{"$nulls":8},""]
[{"$nulls":8},""]
[{"$nulls":8},""]
[{"$nulls":8},""]
[{"$nulls":8},""]
[{"$nulls":8},""]
[{"$nulls":8},""]
[{"$nulls":8},""]
[{"$nulls":8},""]
[{"$nulls":8},""]
[{"$nulls":8},""]
[{"$nulls":8},""]
[{"$nulls":8},""]
[{"$nulls":8},""]
[{"$nulls":8},""]
[{"$nulls":8},""]
[{"$nulls":8},""]
[{"$nulls":8},""]
[{"$nulls":8},""]
[{"$nulls":8},""]
[{"$nulls":8},""]
[{"$nulls":8},""]
[{"$nulls":8},""]
[{"$nulls":8},""]
[{"$nulls":8},""]
[{"$nulls":8},""]
[{"$nulls":8},""]
[{"$nulls":8},""]
[{"$nulls":8},""]
[{"$nulls":8},""]
[{"$nulls":8},""]
[{"$nulls":8},""]
[{"$nulls":8},""]
[{"$nulls":8},""]
[{"$nulls":8},""]
[{"$nulls":8},""]
[{"$nulls":8},""]
[{"$nulls":8},""]
[{"$nulls":8},""]
[{"$nulls":8},""]
[{"$nulls":8},""]
[{"$nulls":8},""]
[{"$nulls":8},""]
[{"$nulls":8},""]
[{"$nulls":8},""]
[{"$nulls":8},""]
[{"$nulls":8},""]
[{"$nulls":8},""]
[{"$nulls":8},""]
[{"$nulls":8},""]
[{"$nulls":8},""]
[{"$nulls":8},""]
[{"$nulls":8},""]
[{"$nulls":8},""]
[{"$nulls":8},""]
[{"$nulls":8},""]
[{"$nulls":8},""]
[{"$nulls":8},""]
[{"$nulls":8},{"$f":"IF(H81=\"\",\"\",0+SUBSTITUTE(H81,\"kg\",\"\"))","v":""}]
[{"$nulls":8},""]
[{"$nulls":8},""]
[{"$nulls":8},""]
[{"$nulls":8},""]
[{"$nulls":8},""]
[{"$nulls":8},""]
[{"$nulls":8},""]
[{"$nulls":8},""]

{"sheet":"class","index":6,"n_rows":89,"n_cols":19,"rows_kept":89,"cut":false,"hidden":false,"merged":[]}
[]
["Rating","Name","Form Element",null,"No",null,null,"TR","JK","API","LSR","DLR",{"$nulls":5},"price"]
[{"$f":"IF(form!D3=\"\",\"\",IF(B3=\"\",\"\",H3+I3+J3+K3+F3))","v":58.3},{"$f":"IF($E3=\"\",\"\",IFERROR(form!E3,0))","v":"VITAL GEM"},{"$f":"IF($E3=\"\",\"\",IFERROR(form!F3,0))","v":"233"},null,{"$f":"form!C3","v":1},{"$f":"IF(E3=1,20,0+IF(E4=2,18,0+IF(E3=3,16,0+IF(E3=4,14,0+IF(E3=5,12,0+IF(E3=6,10,0+IF(E3=7,8,0+IF(E3=8,6,0))))))))","v":20},null,{"$f":"IF($B3=\"\",\"\",IFERROR(form!H3,0))","v":"2.5"},{"$f":"IF($B3=\"\",\"\",IFERROR(form!I3,0))","v":"3.4"},{"$f":"IF($B3=\"\",\"\",IFERROR(form!J3,0))","v":"1.9"},{"$f":"IF($B3=\"\",\"\",IFERROR(form!K3,0))","v":"30.5"},{"$f":"IF($B3=\"\",\"\",IFERROR(form!L3,0))","v":"14"},{"$nulls":4},{"$f":"IF(form!D3=\"\",\"\",IF(B3=\"\",\"\",H3+I3+J3+K3+F3))","v":58.3},{"$f":"IF(B3=\"\",\"\",$Q$17/Q3*85%)","v":7.1572041166380798},{"$f":"1/(Q3/$Q$17)*0.85","v":7.1572041166380798}]
[{"$f":"IF(form!D4=\"\",\"\",IF(B4=\"\",\"\",H4+I4+J4+K4+F4))","v":46.9},{"$f":"IF($E4=\"\",\"\",IFERROR(form!E4,0))","v":"ARNRAY"},{"$f":"IF($E4=\"\",\"\",IFERROR(form!F4,0))","v":"0x7"},null,{"$f":"form!C4","v":2},{"$f":"IF(E4=1,20,0+IF(E4=2,18,0+IF(E4=3,16,0+IF(E4=4,14,0+IF(E4=5,12,0+IF(E4=6,10,0+IF(E4=7,8,0+IF(E4=8,6,0))))))))","v":18},null,{"$f":"IF($B4=\"\",\"\",IFERROR(form!H4,0))","v":"1.9"},{"$f":"IF($B4=\"\",\"\",IFERROR(form!I4,0))","v":"1.7"},{"$f":"IF($B4=\"\",\"\",IFERROR(form!J4,0))","v":"3.3"},{"$f":"IF($B4=\"\",\"\",IFERROR(form!K4,0))","v":"22"},{"$f":"IF($B4=\"\",\"\",IFERROR(form!L4,0))","v":"14"},{"$nulls":4},{"$f":"IF(form!D4=\"\",\"\",IF(B4=\"\",\"\",H4+I4+J4+K4+F4))","v":46.9},8.8969083155650335,{"$f":"1/(Q4/$Q$17)*0.85","v":8.8969083155650317}]
[{"$f":"IF(form!D5=\"\",\"\",IF(B5=\"\",\"\",H5+I5+J5+K5+F5))","v":50.8},{"$f":"IF($E5=\"\",\"\",IFERROR(form!E5,0))","v":"SUPER SALSA"},{"$f":"IF($E5=\"\",\"\",IFERROR(form!F5,0))","v":"641"},null,{"$f":"form!C5","v":3},{"$f":"IF(E5=1,20,0+IF(E5=2,18,0+IF(E5=3,16,0+IF(E5=4,14,0+IF(E5=5,12,0+IF(E5=6,10,0+IF(E5=7,8,0+IF(E5=8,6,0))))))))","v":16},null,{"$f":"IF($B5=\"\",\"\",IFERROR(form!H5,0))","v":"4.4"},{"$f":"IF($B5=\"\",\"\",IFERROR(form!I5,0))","v":"2.3"},{"$f":"IF($B5=\"\",\"\",IFERROR(form!J5,0))","v":"2.1"},{"$f":"IF($B5=\"\",\"\",IFERROR(form!K5,0))","v":"26"},{"$f":"IF($B5=\"\",\"\",IFERROR(form!L5,0))","v":"10"},{"$nulls":4},{"$f":"IF(form!D5=\"\",\"\",IF(B5=\"\",\"\",H5+I5+J5+K5+F5))","v":50.8},8.2138779527559063,8.2138779527559063]
[{"$f":"IF(form!D6=\"\",\"\",IF(B6=\"\",\"\",H6+I6+J6+K6+F6))","v":42.3},{"$f":"IF($E6=\"\",\"\",IFERROR(form!E6,0))","v":"LATHAMS WISH"},{"$f":"IF($E6=\"\",\"\",IFERROR(form!F6,0))","v":"x60"},null,{"$f":"form!C6","v":4},14,null,{"$f":"IF($B6=\"\",\"\",IFERROR(form!H6,0))","v":"2.3"},{"$f":"IF($B6=\"\",\"\",IFERROR(form!I6,0))","v":"2.4"},{"$f":"IF($B6=\"\",\"\",IFERROR(form!J6,0))","v":"2.6"},{"$f":"IF($B6=\"\",\"\",IFERROR(form!K6,0))","v":"21"},{"$f":"IF($B6=\"\",\"\",IFERROR(form!L6,0))","v":"13"},{"$nulls":4},{"$f":"IF(form!D6=\"\",\"\",IF(B6=\"\",\"\",H6+I6+J6+K6+F6))","v":42.3},9.8644208037825063,9.8644208037825063]
[{"$f":"IF(form!D7=\"\",\"\",IF(B7=\"\",\"\",H7+I7+J7+K7+F7))","v":49.9},{"$f":"IF($E7=\"\",\"\",IFERROR(form!E7,0))","v":"I LOVE YOUR SMILE"},{"$f":"IF($E7=\"\",\"\",IFERROR(form!F7,0))","v":"421"},null,{"$f":"form!C7","v":5},12,null,{"$f":"IF($B7=\"\",\"\",IFERROR(form!H7,0))","v":"1.8"},{"$f":"IF($B7=\"\",\"\",IFERROR(form!I7,0))","v":"1.7"},{"$f":"IF($B7=\"\",\"\",IFERROR(form!J7,0))","v":"4.4"},{"$f":"IF($B7=\"\",\"\",IFERROR(form!K7,0))","v":"30"},{"$f":"IF($B7=\"\",\"\",IFERROR(form!L7,0))","v":"14"},{"$nulls":4},{"$f":"IF(form!D7=\"\",\"\",IF(B7=\"\",\"\",H7+I7+J7+K7+F7))","v":49.9},8.3620240480961918,8.3620240480961918]
[{"$f":"IF(form!D8=\"\",\"\",IF(B8=\"\",\"\",H8+I8+J8+K8+F8))","v":18.899999999999999},{"$f":"IF($E8=\"\",\"\",IFERROR(form!E8,0))","v":"YONGA LASS"},{"$f":"IF($E8=\"\",\"\",IFERROR(form!F8,0))","v":0},null,{"$f":"form!C8","v":6},10,null,{"$f":"IF($B8=\"\",\"\",IFERROR(form!H8,0))","v":"2.3"},{"$f":"IF($B8=\"\",\"\",IFERROR(form!I8,0))","v":"2.1"},{"$f":"IF($B8=\"\",\"\",IFERROR(form!J8,0))","v":"4.5"},{"$f":"IF($B8=\"\",\"\",IFERROR(form!K8,0))","v":0},{"$f":"IF($B8=\"\",\"\",IFERROR(form!L8,0))","v":"14"},{"$nulls":4},{"$f":"IF(form!D8=\"\",\"\",IF(B8=\"\",\"\",H8+I8+J8+K8+F8))","v":18.899999999999999},22.077513227513229,22.077513227513229]
[{"$f":"IF(form!D9=\"\",\"\",IF(B9=\"\",\"\",H9+I9+J9+K9+F9))","v":43.6},{"$f":"IF($E9=\"\",\"\",IFERROR(form!E9,0))","v":"ADELANTE"},{"$f":"IF($E9=\"\",\"\",IFERROR(form!F9,0))","v":"513"},null,{"$f":"form!C9","v":7},8,null,{"$f":"IF($B9=\"\",\"\",IFERROR(form!H9,0))","v":"2.2"},{"$f":"IF($B9=\"\",\"\",IFERROR(form!I9,0))","v":"3.5"},{"$f":"IF($B9=\"\",\"\",IFERROR(form!J9,0))","v":"2.4"},{"$f":"IF($B9=\"\",\"\",IFERROR(form!K9,0))","v":"27.5"},{"$f":"IF($B9=\"\",\"\",IFERROR(form!L9,0))","v":"13"},{"$nulls":4},{"$f":"IF(form!D9=\"\",\"\",IF(B9=\"\",\"\",H9+I9+J9+K9+F9))","v":43.6},9.5702981651376149,9.5702981651376149]
[{"$f":"IF(form!D10=\"\",\"\",IF(B10=\"\",\"\",H10+I10+J10+K10+F10))","v":35.700000000000003},{"$f":"IF($E10=\"\",\"\",IFERROR(form!E10,0))","v":"DEVIL GIRL"},{"$f":"IF($E10=\"\",\"\",IFERROR(form!F10,0))","v":"177"},null,{"$f":"form!C10","v":8},6,null,{"$f":"IF($B10=\"\",\"\",IFERROR(form!H10,0))","v":"3.4"},{"$f":"IF($B10=\"\",\"\",IFERROR(form!I10,0))","v":"2.6"},{"$f":"IF($B10=\"\",\"\",IFERROR(form!J10,0))","v":"2.2"},{"$f":"IF($B10=\"\",\"\",IFERROR(form!K10,0))","v":"21.5"},{"$f":"IF($B10=\"\",\"\",IFERROR(form!L10,0))","v":"21"},{"$nulls":4},{"$f":"IF(form!D10=\"\",\"\",IF(B10=\"\",\"\",H10+I10+J10+K10+F10))","v":35.700000000000003},11.688095238095237,11.688095238095237]
[{"$f":"IF(form!D11=\"\",\"\",IF(B11=\"\",\"\",H11+I11+J11+K11+F11))","v":38.6},{"$f":"IF($E11=\"\",\"\",IFERROR(form!E11,0))","v":"FLOPPY"},null,null,{"$f":"form!C11","v":9},0,null,{"$f":"IF($B11=\"\",\"\",IFERROR(form!H11,0))","v":"3.4"},{"$f":"IF($B11=\"\",\"\",IFERROR(form!I11,0))","v":"3.9"},{"$f":"IF($B11=\"\",\"\",IFERROR(form!J11,0))","v":"1.3"},{"$f":"IF($B11=\"\",\"\",IFERROR(form!K11,0))","v":"30"},{"$f":"IF($B11=\"\",\"\",IFERROR(form!L11,0))","v":"7"},{"$nulls":4},{"$f":"IF(form!D11=\"\",\"\",IF(B11=\"\",\"\",H11+I11+J11+K11+F11))","v":38.6},10.809974093264248,10.809974093264248]
[{"$f":"IF(form!D12=\"\",\"\",IF(B12=\"\",\"\",H12+I12+J12+K12+F12))","v":27.9},{"$f":"IF($E12=\"\",\"\",IFERROR(form!E12,0))","v":"JOLLY ODD"},null,null,{"$f":"form!C12","v":10},0,null,{"$f":"IF($B12=\"\",\"\",IFERROR(form!H12,0))","v":"1.9"},{"$f":"IF($B12=\"\",\"\",IFERROR(form!I12,0))","v":"2.2"},{"$f":"IF($B12=\"\",\"\",IFERROR(form!J12,0))","v":"1.3"},{"$f":"IF($B12=\"\",\"\",IFERROR(form!K12,0))","v":"22.5"},{"$f":"IF($B12=\"\",\"\",IFERROR(form!L12,0))","v":"13"},{"$nulls":4},{"$f":"IF(form!D12=\"\",\"\",IF(B12=\"\",\"\",H12+I12+J12+K12+F12))","v":27.9},14.955734767025092,14.955734767025088]
[{"$f":"IF(form!D13=\"\",\"\",IF(B13=\"\",\"\",H13+I13+J13+K13+F13))","v":34.700000000000003},{"$f":"IF($E13=\"\",\"\",IFERROR(form!E13,0))","v":"working"},null,null,{"$f":"form!C13","v":11},0,null,{"$f":"IF($B13=\"\",\"\",IFERROR(form!H13,0))","v":"2"},{"$f":"IF($B13=\"\",\"\",IFERROR(form!I13,0))","v":"2"},{"$f":"IF($B13=\"\",\"\",IFERROR(form!J13,0))","v":"2.2"},{"$f":"IF($B13=\"\",\"\",IFERROR(form!K13,0))","v":"28.5"},{"$f":"IF($B13=\"\",\"\",IFERROR(form!L13,0))","v":"34"},{"$nulls":4},{"$f":"IF(form!D13=\"\",\"\",IF(B13=\"\",\"\",H13+I13+J13+K13+F13))","v":34.700000000000003},12.024927953890488,12.024927953890488]
[{"$f":"IF(form!D14=\"\",\"\",IF(B14=\"\",\"\",H14+I14+J14+K14+F14))","v":43.3},{"$f":"IF($E14=\"\",\"\",IFERROR(form!E14,0))","v":"VISIONS OF GRACE"},null,null,{"$f":"form!C14","v":12},0,null,{"$f":"IF($B14=\"\",\"\",IFERROR(form!H14,0))","v":"2.3"},{"$f":"IF($B14=\"\",\"\",IFERROR(form!I14,0))","v":"4.8"},{"$f":"IF($B14=\"\",\"\",IFERROR(form!J14,0))","v":"2.7"},{"$f":"IF($B14=\"\",\"\",IFERROR(form!K14,0))","v":"33.5"},{"$f":"IF($B14=\"\",\"\",IFERROR(form!L14,0))","v":"14"},{"$nulls":4},{"$f":"IF(form!D14=\"\",\"\",IF(B14=\"\",\"\",H14+I14+J14+K14+F14))","v":43.3},9.6366050808314103,9.6366050808314085]
[]
[{"$f":"SUM(A3:A14)","v":490.90000000000003},{"$nulls":6},{"$f":"IF($B16=\"\",\"\",IFERROR(form!H14,0))","v":""},{"$f":"IF($B16=\"\",\"\",IFERROR(form!I14,0))","v":""},{"$f":"IF($B16=\"\",\"\",IFERROR(form!J14,0))","v":""},{"$f":"IF($B16=\"\",\"\",IFERROR(form!K14,0))","v":""},{"$nulls":6},{"$f":"IF(B16=\"\",\"\",Q28/Q16*85%)","v":""}]
[{"$nulls":8},{"$f":"IF(H17=\"\",\"\",0+SUBSTITUTE(H17,\"kg\",\"\"))","v":""},{"$nulls":7},{"$f":"SUM(Q3:Q14)","v":490.90000000000003}]
[{"$nulls":8},""]
[]
[{"$nulls":8},""]
[{"$nulls":8},""]
[{"$nulls":8},""]
[{"$nulls":8},""]
[{"$nulls":8},""]
[{"$nulls":8},""]
[{"$nulls":8},""]
[{"$nulls":8},""]
[{"$nulls":8},""]
[{"$nulls":8},""]
[{"$nulls":8},""]
[{"$nulls":8},""]
[{"$nulls":8},""]
[{"$nulls":8},""]
[{"$nulls":8},""]
[{"$nulls":8},""]
[{"$nulls":8},""]
[{"$nulls":8},""]
[{"$nulls":8},""]
[{"$nulls":8},""]
[{"$nulls":8},""]
[{"$nulls":8},""]
[{"$nulls":8},""]
[{"$nulls":8},""]
[{"$nulls":8},""]
[{"$nulls":8},""]
[{"$nulls":8},""]
[{"$nulls":8},""]
[{"$nulls":8},""]
[{"$nulls":8},""]
[{"$nulls":8},""]
[{"$nulls":8},""]
[{"$nulls":8},""]
[{"$nulls":8},""]
[{"$nulls":8},""]
[{"$nulls":8},""]
[{"$nulls":8},""]
[{"$nulls":8},""]
[{"$nulls":8},""]
[{"$nulls":8},""]
[{"$nulls":8},""]
[{"$nulls":8},""]
[{"$nulls":8},""]
[{"$nulls":8},""]
[{"$nulls":8},""]
[{"$nulls":8},""]
[{"$nulls":8},""]
[{"$nulls":8},""]
[{"$nulls":8},""]
[{"$nulls":8},""]
[{"$nulls":8},""]
[{"$nulls":8},""]
[{"$nulls":8},""]
[{"$nulls":8},""]
[{"$nulls":8},""]
[{"$nulls":8},""]
[{"$nulls":8},""]
[{"$nulls":8},""]
[{"$nulls":8},""]
[{"$nulls":8},""]
[{"$nulls":8},""]
[{"$nulls":8},{"$f":"IF(H81=\"\",\"\",0+SUBSTITUTE(H81,\"kg\",\"\"))","v":""}]
[{"$nulls":8},""]
[{"$nulls":8},""]
[{"$nulls":8},""]
[{"$nulls":8},""]
[{"$nulls":8},""]
[{"$nulls":8},""]
[{"$nulls":8},""]
[{"$nulls":8},""]

{"sheet":"Tops","index":7,"n_rows":89,"n_cols":19,"rows_kept":89,"cut":false,"hidden":false,"merged":[]}
[]
["Rating","Name","Form Element",null,"No",null,null,"TR","JK","API","LSR","DLR",{"$nulls":5},"price"]
[{"$f":"IF(form!D3=\"\",\"\",IF(B3=\"\",\"\",H3+I3+J3+K3+F3))","v":58.3},{"$f":"IF($E3=\"\",\"\",IFERROR(form!E3,0))","v":"VITAL GEM"},{"$f":"IF($E3=\"\",\"\",IFERROR(form!F3,0))","v":"233"},null,{"$f":"form!C3","v":1},{"$f":"IF(E3=1,20,0+IF(E4=2,18,0+IF(E3=3,16,0+IF(E3=4,14,0+IF(E3=5,12,0+IF(E3=6,10,0+IF(E3=7,8,0+IF(E3=8,6,0))))))))","v":20},null,{"$f":"IF($B3=\"\",\"\",IFERROR(form!H3,0))","v":"2.5"},{"$f":"IF($B3=\"\",\"\",IFERROR(form!I3,0))","v":"3.4"},{"$f":"IF($B3=\"\",\"\",IFERROR(form!J3,0))","v":"1.9"},{"$f":"IF($B3=\"\",\"\",IFERROR(form!K3,0))","v":"30.5"},{"$f":"IF($B3=\"\",\"\",IFERROR(form!L3,0))","v":"14"},{"$nulls":4},{"$f":"IF(form!D3=\"\",\"\",IF(B3=\"\",\"\",H3+I3+J3+K3+F3))","v":58.3},{"$f":"IF(B3=\"\",\"\",$Q$17/Q3*85%)","v":7.1572041166380798},{"$f":"1/(Q3/$Q$17)*0.85","v":7.1572041166380798}]
[{"$f":"IF(form!D4=\"\",\"\",IF(B4=\"\",\"\",H4+I4+J4+K4+F4))","v":46.9},{"$f":"IF($E4=\"\",\"\",IFERROR(form!E4,0))","v":"ARNRAY"},{"$f":"IF($E4=\"\",\"\",IFERROR(form!F4,0))","v":"0x7"},null,{"$f":"form!C4","v":2},{"$f":"IF(E4=1,20,0+IF(E4=2,18,0+IF(E4=3,16,0+IF(E4=4,14,0+IF(E4=5,12,0+IF(E4=6,10,0+IF(E4=7,8,0+IF(E4=8,6,0))))))))","v":18},null,{"$f":"IF($B4=\"\",\"\",IFERROR(form!H4,0))","v":"1.9"},{"$f":"IF($B4=\"\",\"\",IFERROR(form!I4,0))","v":"1.7"},{"$f":"IF($B4=\"\",\"\",IFERROR(form!J4,0))","v":"3.3"},{"$f":"IF($B4=\"\",\"\",IFERROR(form!K4,0))","v":"22"},{"$f":"IF($B4=\"\",\"\",IFERROR(form!L4,0))","v":"14"},{"$nulls":4},{"$f":"IF(form!D4=\"\",\"\",IF(B4=\"\",\"\",H4+I4+J4+K4+F4))","v":46.9},8.8969083155650335,{"$f":"1/(Q4/$Q$17)*0.85","v":8.8969083155650317}]
[{"$f":"IF(form!D5=\"\",\"\",IF(B5=\"\",\"\",H5+I5+J5+K5+F5))","v":50.8},{"$f":"IF($E5=\"\",\"\",IFERROR(form!E5,0))","v":"SUPER SALSA"},{"$f":"IF($E5=\"\",\"\",IFERROR(form!F5,0))","v":"641"},null,{"$f":"form!C5","v":3},{"$f":"IF(E5=1,20,0+IF(E5=2,18,0+IF(E5=3,16,0+IF(E5=4,14,0+IF(E5=5,12,0+IF(E5=6,10,0+IF(E5=7,8,0+IF(E5=8,6,0))))))))","v":16},null,{"$f":"IF($B5=\"\",\"\",IFERROR(form!H5,0))","v":"4.4"},{"$f":"IF($B5=\"\",\"\",IFERROR(form!I5,0))","v":"2.3"},{"$f":"IF($B5=\"\",\"\",IFERROR(form!J5,0))","v":"2.1"},{"$f":"IF($B5=\"\",\"\",IFERROR(form!K5,0))","v":"26"},{"$f":"IF($B5=\"\",\"\",IFERROR(form!L5,0))","v":"10"},{"$nulls":4},{"$f":"IF(form!D5=\"\",\"\",IF(B5=\"\",\"\",H5+I5+J5+K5+F5))","v":50.8},8.2138779527559063,8.2138779527559063]
[{"$f":"IF(form!D6=\"\",\"\",IF(B6=\"\",\"\",H6+I6+J6+K6+F6))","v":42.3},{"$f":"IF($E6=\"\",\"\",IFERROR(form!E6,0))","v":"LATHAMS WISH"},{"$f":"IF($E6=\"\",\"\",IFERROR(form!F6,0))","v":"x60"},null,{"$f":"form!C6","v":4},14,null,{"$f":"IF($B6=\"\",\"\",IFERROR(form!H6,0))","v":"2.3"},{"$f":"IF($B6=\"\",\"\",IFERROR(form!I6,0))","v":"2.4"},{"$f":"IF($B6=\"\",\"\",IFERROR(form!J6,0))","v":"2.6"},{"$f":"IF($B6=\"\",\"\",IFERROR(form!K6,0))","v":"21"},{"$f":"IF($B6=\"\",\"\",IFERROR(form!L6,0))","v":"13"},{"$nulls":4},{"$f":"IF(form!D6=\"\",\"\",IF(B6=\"\",\"\",H6+I6+J6+K6+F6))","v":42.3},9.8644208037825063,9.8644208037825063]
[{"$f":"IF(form!D7=\"\",\"\",IF(B7=\"\",\"\",H7+I7+J7+K7+F7))","v":49.9},{"$f":"IF($E7=\"\",\"\",IFERROR(form!E7,0))","v":"I LOVE YOUR SMILE"},{"$f":"IF($E7=\"\",\"\",IFERROR(form!F7,0))","v":"421"},null,{"$f":"form!C7","v":5},12,null,{"$f":"IF($B7=\"\",\"\",IFERROR(form!H7,0))","v":"1.8"},{"$f":"IF($B7=\"\",\"\",IFERROR(form!I7,0))","v":"1.7"},{"$f":"IF($B7=\"\",\"\",IFERROR(form!J7,0))","v":"4.4"},{"$f":"IF($B7=\"\",\"\",IFERROR(form!K7,0))","v":"30"},{"$f":"IF($B7=\"\",\"\",IFERROR(form!L7,0))","v":"14"},{"$nulls":4},{"$f":"IF(form!D7=\"\",\"\",IF(B7=\"\",\"\",H7+I7+J7+K7+F7))","v":49.9},8.3620240480961918,8.3620240480961918]
[{"$f":"IF(form!D8=\"\",\"\",IF(B8=\"\",\"\",H8+I8+J8+K8+F8))","v":18.899999999999999},{"$f":"IF($E8=\"\",\"\",IFERROR(form!E8,0))","v":"YONGA LASS"},{"$f":"IF($E8=\"\",\"\",IFERROR(form!F8,0))","v":0},null,{"$f":"form!C8","v":6},10,null,{"$f":"IF($B8=\"\",\"\",IFERROR(form!H8,0))","v":"2.3"},{"$f":"IF($B8=\"\",\"\",IFERROR(form!I8,0))","v":"2.1"},{"$f":"IF($B8=\"\",\"\",IFERROR(form!J8,0))","v":"4.5"},{"$f":"IF($B8=\"\",\"\",IFERROR(form!K8,0))","v":0},{"$f":"IF($B8=\"\",\"\",IFERROR(form!L8,0))","v":"14"},{"$nulls":4},{"$f":"IF(form!D8=\"\",\"\",IF(B8=\"\",\"\",H8+I8+J8+K8+F8))","v":18.899999999999999},22.077513227513229,22.077513227513229]
[{"$f":"IF(form!D9=\"\",\"\",IF(B9=\"\",\"\",H9+I9+J9+K9+F9))","v":43.6},{"$f":"IF($E9=\"\",\"\",IFERROR(form!E9,0))","v":"ADELANTE"},{"$f":"IF($E9=\"\",\"\",IFERROR(form!F9,0))","v":"513"},null,{"$f":"form!C9","v":7},8,null,{"$f":"IF($B9=\"\",\"\",IFERROR(form!H9,0))","v":"2.2"},{"$f":"IF($B9=\"\",\"\",IFERROR(form!I9,0))","v":"3.5"},{"$f":"IF($B9=\"\",\"\",IFERROR(form!J9,0))","v":"2.4"},{"$f":"IF($B9=\"\",\"\",IFERROR(form!K9,0))","v":"27.5"},{"$f":"IF($B9=\"\",\"\",IFERROR(form!L9,0))","v":"13"},{"$nulls":4},{"$f":"IF(form!D9=\"\",\"\",IF(B9=\"\",\"\",H9+I9+J9+K9+F9))","v":43.6},9.5702981651376149,9.5702981651376149]
[{"$f":"IF(form!D10=\"\",\"\",IF(B10=\"\",\"\",H10+I10+J10+K10+F10))","v":35.700000000000003},{"$f":"IF($E10=\"\",\"\",IFERROR(form!E10,0))","v":"DEVIL GIRL"},{"$f":"IF($E10=\"\",\"\",IFERROR(form!F10,0))","v":"177"},null,{"$f":"form!C10","v":8},6,null,{"$f":"IF($B10=\"\",\"\",IFERROR(form!H10,0))","v":"3.4"},{"$f":"IF($B10=\"\",\"\",IFERROR(form!I10,0))","v":"2.6"},{"$f":"IF($B10=\"\",\"\",IFERROR(form!J10,0))","v":"2.2"},{"$f":"IF($B10=\"\",\"\",IFERROR(form!K10,0))","v":"21.5"},{"$f":"IF($B10=\"\",\"\",IFERROR(form!L10,0))","v":"21"},{"$nulls":4},{"$f":"IF(form!D10=\"\",\"\",IF(B10=\"\",\"\",H10+I10+J10+K10+F10))","v":35.700000000000003},11.688095238095237,11.688095238095237]
[{"$f":"IF(form!D11=\"\",\"\",IF(B11=\"\",\"\",H11+I11+J11+K11+F11))","v":38.6},{"$f":"IF($E11=\"\",\"\",IFERROR(form!E11,0))","v":"FLOPPY"},null,null,{"$f":"form!C11","v":9},0,null,{"$f":"IF($B11=\"\",\"\",IFERROR(form!H11,0))","v":"3.4"},{"$f":"IF($B11=\"\",\"\",IFERROR(form!I11,0))","v":"3.9"},{"$f":"IF($B11=\"\",\"\",IFERROR(form!J11,0))","v":"1.3"},{"$f":"IF($B11=\"\",\"\",IFERROR(form!K11,0))","v":"30"},{"$f":"IF($B11=\"\",\"\",IFERROR(form!L11,0))","v":"7"},{"$nulls":4},{"$f":"IF(form!D11=\"\",\"\",IF(B11=\"\",\"\",H11+I11+J11+K11+F11))","v":38.6},10.809974093264248,10.809974093264248]
[{"$f":"IF(form!D12=\"\",\"\",IF(B12=\"\",\"\",H12+I12+J12+K12+F12))","v":27.9},{"$f":"IF($E12=\"\",\"\",IFERROR(form!E12,0))","v":"JOLLY ODD"},null,null,{"$f":"form!C12","v":10},0,null,{"$f":"IF($B12=\"\",\"\",IFERROR(form!H12,0))","v":"1.9"},{"$f":"IF($B12=\"\",\"\",IFERROR(form!I12,0))","v":"2.2"},{"$f":"IF($B12=\"\",\"\",IFERROR(form!J12,0))","v":"1.3"},{"$f":"IF($B12=\"\",\"\",IFERROR(form!K12,0))","v":"22.5"},{"$f":"IF($B12=\"\",\"\",IFERROR(form!L12,0))","v":"13"},{"$nulls":4},{"$f":"IF(form!D12=\"\",\"\",IF(B12=\"\",\"\",H12+I12+J12+K12+F12))","v":27.9},14.955734767025092,14.955734767025088]
[{"$f":"IF(form!D13=\"\",\"\",IF(B13=\"\",\"\",H13+I13+J13+K13+F13))","v":34.700000000000003},{"$f":"IF($E13=\"\",\"\",IFERROR(form!E13,0))","v":"working"},null,null,{"$f":"form!C13","v":11},0,null,{"$f":"IF($B13=\"\",\"\",IFERROR(form!H13,0))","v":"2"},{"$f":"IF($B13=\"\",\"\",IFERROR(form!I13,0))","v":"2"},{"$f":"IF($B13=\"\",\"\",IFERROR(form!J13,0))","v":"2.2"},{"$f":"IF($B13=\"\",\"\",IFERROR(form!K13,0))","v":"28.5"},{"$f":"IF($B13=\"\",\"\",IFERROR(form!L13,0))","v":"34"},{"$nulls":4},{"$f":"IF(form!D13=\"\",\"\",IF(B13=\"\",\"\",H13+I13+J13+K13+F13))","v":34.700000000000003},12.024927953890488,12.024927953890488]
[{"$f":"IF(form!D14=\"\",\"\",IF(B14=\"\",\"\",H14+I14+J14+K14+F14))","v":43.3},{"$f":"IF($E14=\"\",\"\",IFERROR(form!E14,0))","v":"VISIONS OF GRACE"},null,null,{"$f":"form!C14","v":12},0,null,{"$f":"IF($B14=\"\",\"\",IFERROR(form!H14,0))","v":"2.3"},{"$f":"IF($B14=\"\",\"\",IFERROR(form!I14,0))","v":"4.8"},{"$f":"IF($B14=\"\",\"\",IFERROR(form!J14,0))","v":"2.7"},{"$f":"IF($B14=\"\",\"\",IFERROR(form!K14,0))","v":"33.5"},{"$f":"IF($B14=\"\",\"\",IFERROR(form!L14,0))","v":"14"},{"$nulls":4},{"$f":"IF(form!D14=\"\",\"\",IF(B14=\"\",\"\",H14+I14+J14+K14+F14))","v":43.3},9.6366050808314103,9.6366050808314085]
[]
[{"$f":"SUM(A3:A14)","v":490.90000000000003},{"$nulls":6},{"$f":"IF($B16=\"\",\"\",IFERROR(form!H14,0))","v":""},{"$f":"IF($B16=\"\",\"\",IFERROR(form!I14,0))","v":""},{"$f":"IF($B16=\"\",\"\",IFERROR(form!J14,0))","v":""},{"$f":"IF($B16=\"\",\"\",IFERROR(form!K14,0))","v":""},{"$nulls":6},{"$f":"IF(B16=\"\",\"\",Q28/Q16*85%)","v":""}]
[{"$nulls":8},{"$f":"IF(H17=\"\",\"\",0+SUBSTITUTE(H17,\"kg\",\"\"))","v":""},{"$nulls":7},{"$f":"SUM(Q3:Q14)","v":490.90000000000003}]
[{"$nulls":8},""]
[]
[{"$nulls":8},""]
[{"$nulls":8},""]
[{"$nulls":8},""]
[{"$nulls":8},""]
[{"$nulls":8},""]
[{"$nulls":8},""]
[{"$nulls":8},""]
[{"$nulls":8},""]
[{"$nulls":8},""]
[{"$nulls":8},""]
[{"$nulls":8},""]
[{"$nulls":8},""]
[{"$nulls":8},""]
[{"$nulls":8},""]
[{"$nulls":8},""]
[{"$nulls":8},""]
[{"$nulls":8},""]
[{"$nulls":8},""]
[{"$nulls":8},""]
[{"$nulls":8},""]
[{"$nulls":8},""]
[{"$nulls":8},""]
[{"$nulls":8},""]
[{"$nulls":8},""]
[{"$nulls":8},""]
[{"$nulls":8},""]
[{"$nulls":8},""]
[{"$nulls":8},""]
[{"$nulls":8},""]
[{"$nulls":8},""]
[{"$nulls":8},""]
[{"$nulls":8},""]
[{"$nulls":8},""]
[{"$nulls":8},""]
[{"$nulls":8},""]
[{"$nulls":8},""]
[{"$nulls":8},""]
[{"$nulls":8},""]
[{"$nulls":8},""]
[{"$nulls":8},""]
[{"$nulls":8},""]
[{"$nulls":8},""]
[{"$nulls":8},""]
[{"$nulls":8},""]
[{"$nulls":8},""]
[{"$nulls":8},""]
[{"$nulls":8},""]
[{"$nulls":8},""]
[{"$nulls":8},""]
[{"$nulls":8},""]
[{"$nulls":8},""]
[{"$nulls":8},""]
[{"$nulls":8},""]
[{"$nulls":8},""]
[{"$nulls":8},""]
[{"$nulls":8},""]
[{"$nulls":8},""]
[{"$nulls":8},""]
[{"$nulls":8},""]
[{"$nulls":8},""]
[{"$nulls":8},""]
[{"$nulls":8},{"$f":"IF(H81=\"\",\"\",0+SUBSTITUTE(H81,\"kg\",\"\"))","v":""}]
[{"$nulls":8},""]
[{"$nulls":8},""]
[{"$nulls":8},""]
[{"$nulls":8},""]
[{"$nulls":8},""]
[{"$nulls":8},""]
[{"$nulls":8},""]
[{"$nulls":8},""]

{"sheet":"Nines","index":8,"n_rows":89,"n_cols":19,"rows_kept":89,"cut":false,"hidden":false,"merged":[]}
[]
["Rating","Name","Form Element",null,"No",null,null,"TR","JK","API","LSR","DLR",{"$nulls":5},"price"]
[{"$f":"IF(form!D3=\"\",\"\",IF(B3=\"\",\"\",H3+I3+J3+K3+F3))","v":58.3},{"$f":"IF($E3=\"\",\"\",IFERROR(form!E3,0))","v":"VITAL GEM"},{"$f":"IF($E3=\"\",\"\",IFERROR(form!F3,0))","v":"233"},null,{"$f":"form!C3","v":1},{"$f":"IF(E3=1,20,0+IF(E4=2,18,0+IF(E3=3,16,0+IF(E3=4,14,0+IF(E3=5,12,0+IF(E3=6,10,0+IF(E3=7,8,0+IF(E3=8,6,0))))))))","v":20},null,{"$f":"IF($B3=\"\",\"\",IFERROR(form!H3,0))","v":"2.5"},{"$f":"IF($B3=\"\",\"\",IFERROR(form!I3,0))","v":"3.4"},{"$f":"IF($B3=\"\",\"\",IFERROR(form!J3,0))","v":"1.9"},{"$f":"IF($B3=\"\",\"\",IFERROR(form!K3,0))","v":"30.5"},{"$f":"IF($B3=\"\",\"\",IFERROR(form!L3,0))","v":"14"},{"$nulls":4},{"$f":"IF(form!D3=\"\",\"\",IF(B3=\"\",\"\",H3+I3+J3+K3+F3))","v":58.3},{"$f":"IF(B3=\"\",\"\",$Q$17/Q3*85%)","v":7.1572041166380798},{"$f":"1/(Q3/$Q$17)*0.85","v":7.1572041166380798}]
[{"$f":"IF(form!D4=\"\",\"\",IF(B4=\"\",\"\",H4+I4+J4+K4+F4))","v":46.9},{"$f":"IF($E4=\"\",\"\",IFERROR(form!E4,0))","v":"ARNRAY"},{"$f":"IF($E4=\"\",\"\",IFERROR(form!F4,0))","v":"0x7"},null,{"$f":"form!C4","v":2},{"$f":"IF(E4=1,20,0+IF(E4=2,18,0+IF(E4=3,16,0+IF(E4=4,14,0+IF(E4=5,12,0+IF(E4=6,10,0+IF(E4=7,8,0+IF(E4=8,6,0))))))))","v":18},null,{"$f":"IF($B4=\"\",\"\",IFERROR(form!H4,0))","v":"1.9"},{"$f":"IF($B4=\"\",\"\",IFERROR(form!I4,0))","v":"1.7"},{"$f":"IF($B4=\"\",\"\",IFERROR(form!J4,0))","v":"3.3"},{"$f":"IF($B4=\"\",\"\",IFERROR(form!K4,0))","v":"22"},{"$f":"IF($B4=\"\",\"\",IFERROR(form!L4,0))","v":"14"},{"$nulls":4},{"$f":"IF(form!D4=\"\",\"\",IF(B4=\"\",\"\",H4+I4+J4+K4+F4))","v":46.9},8.8969083155650335,{"$f":"1/(Q4/$Q$17)*0.85","v":8.8969083155650317}]
[{"$f":"IF(form!D5=\"\",\"\",IF(B5=\"\",\"\",H5+I5+J5+K5+F5))","v":50.8},{"$f":"IF($E5=\"\",\"\",IFERROR(form!E5,0))","v":"SUPER SALSA"},{"$f":"IF($E5=\"\",\"\",IFERROR(form!F5,0))","v":"641"},null,{"$f":"form!C5","v":3},{"$f":"IF(E5=1,20,0+IF(E5=2,18,0+IF(E5=3,16,0+IF(E5=4,14,0+IF(E5=5,12,0+IF(E5=6,10,0+IF(E5=7,8,0+IF(E5=8,6,0))))))))","v":16},null,{"$f":"IF($B5=\"\",\"\",IFERROR(form!H5,0))","v":"4.4"},{"$f":"IF($B5=\"\",\"\",IFERROR(form!I5,0))","v":"2.3"},{"$f":"IF($B5=\"\",\"\",IFERROR(form!J5,0))","v":"2.1"},{"$f":"IF($B5=\"\",\"\",IFERROR(form!K5,0))","v":"26"},{"$f":"IF($B5=\"\",\"\",IFERROR(form!L5,0))","v":"10"},{"$nulls":4},{"$f":"IF(form!D5=\"\",\"\",IF(B5=\"\",\"\",H5+I5+J5+K5+F5))","v":50.8},8.2138779527559063,8.2138779527559063]
[{"$f":"IF(form!D6=\"\",\"\",IF(B6=\"\",\"\",H6+I6+J6+K6+F6))","v":42.3},{"$f":"IF($E6=\"\",\"\",IFERROR(form!E6,0))","v":"LATHAMS WISH"},{"$f":"IF($E6=\"\",\"\",IFERROR(form!F6,0))","v":"x60"},null,{"$f":"form!C6","v":4},14,null,{"$f":"IF($B6=\"\",\"\",IFERROR(form!H6,0))","v":"2.3"},{"$f":"IF($B6=\"\",\"\",IFERROR(form!I6,0))","v":"2.4"},{"$f":"IF($B6=\"\",\"\",IFERROR(form!J6,0))","v":"2.6"},{"$f":"IF($B6=\"\",\"\",IFERROR(form!K6,0))","v":"21"},{"$f":"IF($B6=\"\",\"\",IFERROR(form!L6,0))","v":"13"},{"$nulls":4},{"$f":"IF(form!D6=\"\",\"\",IF(B6=\"\",\"\",H6+I6+J6+K6+F6))","v":42.3},9.8644208037825063,9.8644208037825063]
[{"$f":"IF(form!D7=\"\",\"\",IF(B7=\"\",\"\",H7+I7+J7+K7+F7))","v":49.9},{"$f":"IF($E7=\"\",\"\",IFERROR(form!E7,0))","v":"I LOVE YOUR SMILE"},{"$f":"IF($E7=\"\",\"\",IFERROR(form!F7,0))","v":"421"},null,{"$f":"form!C7","v":5},12,null,{"$f":"IF($B7=\"\",\"\",IFERROR(form!H7,0))","v":"1.8"},{"$f":"IF($B7=\"\",\"\",IFERROR(form!I7,0))","v":"1.7"},{"$f":"IF($B7=\"\",\"\",IFERROR(form!J7,0))","v":"4.4"},{"$f":"IF($B7=\"\",\"\",IFERROR(form!K7,0))","v":"30"},{"$f":"IF($B7=\"\",\"\",IFERROR(form!L7,0))","v":"14"},{"$nulls":4},{"$f":"IF(form!D7=\"\",\"\",IF(B7=\"\",\"\",H7+I7+J7+K7+F7))","v":49.9},8.3620240480961918,8.3620240480961918]
[{"$f":"IF(form!D8=\"\",\"\",IF(B8=\"\",\"\",H8+I8+J8+K8+F8))","v":18.899999999999999},{"$f":"IF($E8=\"\",\"\",IFERROR(form!E8,0))","v":"YONGA LASS"},{"$f":"IF($E8=\"\",\"\",IFERROR(form!F8,0))","v":0},null,{"$f":"form!C8","v":6},10,null,{"$f":"IF($B8=\"\",\"\",IFERROR(form!H8,0))","v":"2.3"},{"$f":"IF($B8=\"\",\"\",IFERROR(form!I8,0))","v":"2.1"},{"$f":"IF($B8=\"\",\"\",IFERROR(form!J8,0))","v":"4.5"},{"$f":"IF($B8=\"\",\"\",IFERROR(form!K8,0))","v":0},{"$f":"IF($B8=\"\",\"\",IFERROR(form!L8,0))","v":"14"},{"$nulls":4},{"$f":"IF(form!D8=\"\",\"\",IF(B8=\"\",\"\",H8+I8+J8+K8+F8))","v":18.899999999999999},22.077513227513229,22.077513227513229]
[{"$f":"IF(form!D9=\"\",\"\",IF(B9=\"\",\"\",H9+I9+J9+K9+F9))","v":43.6},{"$f":"IF($E9=\"\",\"\",IFERROR(form!E9,0))","v":"ADELANTE"},{"$f":"IF($E9=\"\",\"\",IFERROR(form!F9,0))","v":"513"},null,{"$f":"form!C9","v":7},8,null,{"$f":"IF($B9=\"\",\"\",IFERROR(form!H9,0))","v":"2.2"},{"$f":"IF($B9=\"\",\"\",IFERROR(form!I9,0))","v":"3.5"},{"$f":"IF($B9=\"\",\"\",IFERROR(form!J9,0))","v":"2.4"},{"$f":"IF($B9=\"\",\"\",IFERROR(form!K9,0))","v":"27.5"},{"$f":"IF($B9=\"\",\"\",IFERROR(form!L9,0))","v":"13"},{"$nulls":4},{"$f":"IF(form!D9=\"\",\"\",IF(B9=\"\",\"\",H9+I9+J9+K9+F9))","v":43.6},9.5702981651376149,9.5702981651376149]
[{"$f":"IF(form!D10=\"\",\"\",IF(B10=\"\",\"\",H10+I10+J10+K10+F10))","v":35.700000000000003},{"$f":"IF($E10=\"\",\"\",IFERROR(form!E10,0))","v":"DEVIL GIRL"},{"$f":"IF($E10=\"\",\"\",IFERROR(form!F10,0))","v":"177"},null,{"$f":"form!C10","v":8},6,null,{"$f":"IF($B10=\"\",\"\",IFERROR(form!H10,0))","v":"3.4"},{"$f":"IF($B10=\"\",\"\",IFERROR(form!I10,0))","v":"2.6"},{"$f":"IF($B10=\"\",\"\",IFERROR(form!J10,0))","v":"2.2"},{"$f":"IF($B10=\"\",\"\",IFERROR(form!K10,0))","v":"21.5"},{"$f":"IF($B10=\"\",\"\",IFERROR(form!L10,0))","v":"21"},{"$nulls":4},{"$f":"IF(form!D10=\"\",\"\",IF(B10=\"\",\"\",H10+I10+J10+K10+F10))","v":35.700000000000003},11.688095238095237,11.688095238095237]
[{"$f":"IF(form!D11=\"\",\"\",IF(B11=\"\",\"\",H11+I11+J11+K11+F11))","v":38.6},{"$f":"IF($E11=\"\",\"\",IFERROR(form!E11,0))","v":"FLOPPY"},null,null,{"$f":"form!C11","v":9},0,null,{"$f":"IF($B11=\"\",\"\",IFERROR(form!H11,0))","v":"3.4"},{"$f":"IF($B11=\"\",\"\",IFERROR(form!I11,0))","v":"3.9"},{"$f":"IF($B11=\"\",\"\",IFERROR(form!J11,0))","v":"1.3"},{"$f":"IF($B11=\"\",\"\",IFERROR(form!K11,0))","v":"30"},{"$f":"IF($B11=\"\",\"\",IFERROR(form!L11,0))","v":"7"},{"$nulls":4},{"$f":"IF(form!D11=\"\",\"\",IF(B11=\"\",\"\",H11+I11+J11+K11+F11))","v":38.6},10.809974093264248,10.809974093264248]
[{"$f":"IF(form!D12=\"\",\"\",IF(B12=\"\",\"\",H12+I12+J12+K12+F12))","v":27.9},{"$f":"IF($E12=\"\",\"\",IFERROR(form!E12,0))","v":"JOLLY ODD"},null,null,{"$f":"form!C12","v":10},0,null,{"$f":"IF($B12=\"\",\"\",IFERROR(form!H12,0))","v":"1.9"},{"$f":"IF($B12=\"\",\"\",IFERROR(form!I12,0))","v":"2.2"},{"$f":"IF($B12=\"\",\"\",IFERROR(form!J12,0))","v":"1.3"},{"$f":"IF($B12=\"\",\"\",IFERROR(form!K12,0))","v":"22.5"},{"$f":"IF($B12=\"\",\"\",IFERROR(form!L12,0))","v":"13"},{"$nulls":4},{"$f":"IF(form!D12=\"\",\"\",IF(B12=\"\",\"\",H12+I12+J12+K12+F12))","v":27.9},14.955734767025092,14.955734767025088]
[{"$f":"IF(form!D13=\"\",\"\",IF(B13=\"\",\"\",H13+I13+J13+K13+F13))","v":34.700000000000003},{"$f":"IF($E13=\"\",\"\",IFERROR(form!E13,0))","v":"working"},null,null,{"$f":"form!C13","v":11},0,null,{"$f":"IF($B13=\"\",\"\",IFERROR(form!H13,0))","v":"2"},{"$f":"IF($B13=\"\",\"\",IFERROR(form!I13,0))","v":"2"},{"$f":"IF($B13=\"\",\"\",IFERROR(form!J13,0))","v":"2.2"},{"$f":"IF($B13=\"\",\"\",IFERROR(form!K13,0))","v":"28.5"},{"$f":"IF($B13=\"\",\"\",IFERROR(form!L13,0))","v":"34"},{"$nulls":4},{"$f":"IF(form!D13=\"\",\"\",IF(B13=\"\",\"\",H13+I13+J13+K13+F13))","v":34.700000000000003},12.024927953890488,12.024927953890488]
[{"$f":"IF(form!D14=\"\",\"\",IF(B14=\"\",\"\",H14+I14+J14+K14+F14))","v":43.3},{"$f":"IF($E14=\"\",\"\",IFERROR(form!E14,0))","v":"VISIONS OF GRACE"},null,null,{"$f":"form!C14","v":12},0,null,{"$f":"IF($B14=\"\",\"\",IFERROR(form!H14,0))","v":"2.3"},{"$f":"IF($B14=\"\",\"\",IFERROR(form!I14,0))","v":"4.8"},{"$f":"IF($B14=\"\",\"\",IFERROR(form!J14,0))","v":"2.7"},{"$f":"IF($B14=\"\",\"\",IFERROR(form!K14,0))","v":"33.5"},{"$f":"IF($B14=\"\",\"\",IFERROR(form!L14,0))","v":"14"},{"$nulls":4},{"$f":"IF(form!D14=\"\",\"\",IF(B14=\"\",\"\",H14+I14+J14+K14+F14))","v":43.3},9.6366050808314103,9.6366050808314085]
[]
[{"$f":"SUM(A3:A14)","v":490.90000000000003},{"$nulls":6},{"$f":"IF($B16=\"\",\"\",IFERROR(form!H14,0))","v":""},{"$f":"IF($B16=\"\",\"\",IFERROR(form!I14,0))","v":""},{"$f":"IF($B16=\"\",\"\",IFERROR(form!J14,0))","v":""},{"$f":"IF($B16=\"\",\"\",IFERROR(form!K14,0))","v":""},{"$nulls":6},{"$f":"IF(B16=\"\",\"\",Q28/Q16*85%)","v":""}]
[{"$nulls":8},{"$f":"IF(H17=\"\",\"\",0+SUBSTITUTE(H17,\"kg\",\"\"))","v":""},{"$nulls":7},{"$f":"SUM(Q3:Q14)","v":490.90000000000003}]
[{"$nulls":8},""]
[]
[{"$nulls":8},""]
[{"$nulls":8},""]
[{"$nulls":8},""]
[{"$nulls":8},""]
[{"$nulls":8},""]
[{"$nulls":8},""]
[{"$nulls":8},""]
[{"$nulls":8},""]
[{"$nulls":8},""]
[{"$nulls":8},""]
[{"$nulls":8},""]
[{"$nulls":8},""]
[{"$nulls":8},""]
[{"$nulls":8},""]
[{"$nulls":8},""]
[{"$nulls":8},""]
[{"$nulls":8},""]
[{"$nulls":8},""]
[{"$nulls":8},""]
[{"$nulls":8},""]
[{"$nulls":8},""]
[{"$nulls":8},""]
[{"$nulls":8},""]
[{"$nulls":8},""]
[{"$nulls":8},""]
[{"$nulls":8},""]
[{"$nulls":8},""]
[{"$nulls":8},""]
[{"$nulls":8},""]
[{"$nulls":8},""]
[{"$nulls":8},""]
[{"$nulls":8},""]
[{"$nulls":8},""]
[{"$nulls":8},""]
[{"$nulls":8},""]
[{"$nulls":8},""]
[{"$nulls":8},""]
[{"$nulls":8},""]
[{"$nulls":8},""]
[{"$nulls":8},""]
[{"$nulls":8},""]
[{"$nulls":8},""]
[{"$nulls":8},""]
[{"$nulls":8},""]
[{"$nulls":8},""]
[{"$nulls":8},""]
[{"$nulls":8},""]
[{"$nulls":8},""]
[{"$nulls":8},""]
[{"$nulls":8},""]
[{"$nulls":8},""]
[{"$nulls":8},""]
[{"$nulls":8},""]
[{"$nulls":8},""]
[{"$nulls":8},""]
[{"$nulls":8},""]
[{"$nulls":8},""]
[{"$nulls":8},""]
[{"$nulls":8},""]
[{"$nulls":8},""]
[{"$nulls":8},""]
[{"$nulls":8},{"$f":"IF(H81=\"\",\"\",0+SUBSTITUTE(H81,\"kg\",\"\"))","v":""}]
[{"$nulls":8},""]
[{"$nulls":8},""]
[{"$nulls":8},""]
[{"$nulls":8},""]
[{"$nulls":8},""]
[{"$nulls":8},""]
[{"$nulls":8},""]
[{"$nulls":8},""]

{"sheet":"BlackBook","index":9,"n_rows":89,"n_cols":19,"rows_kept":89,"cut":false,"hidden":false,"merged":[]}
[]
["Rating","Name","Form Element",null,"No",null,null,"TR","JK","API","LSR","DLR",{"$nulls":5},"price"]
[{"$f":"IF(form!D3=\"\",\"\",IF(B3=\"\",\"\",H3*5+I3*5+J3+K3+F3))","v":81.900000000000006},{"$f":"IF($E3=\"\",\"\",IFERROR(form!E3,0))","v":"VITAL GEM"},{"$f":"IF($E3=\"\",\"\",IFERROR(form!F3,0))","v":"233"},{"$f":"IFERROR(VLOOKUP(MID(D3,3,1),lookup_table,2,FALSE),\"\")","v":0},{"$f":"form!C3","v":1},{"$f":"IF(E3=1,20,0+IF(E4=2,18,0+IF(E3=3,16,0+IF(E3=4,14,0+IF(E3=5,12,0+IF(E3=6,10,0+IF(E3=7,8,0+IF(E3=8,6,0))))))))","v":20},null,{"$f":"IF($B3=\"\",\"\",IFERROR(form!H3,0))","v":"2.5"},{"$f":"IF($B3=\"\",\"\",IFERROR(form!I3,0))","v":"3.4"},{"$f":"IF($B3=\"\",\"\",IFERROR(form!J3,0))","v":"1.9"},{"$f":"IF($B3=\"\",\"\",IFERROR(form!K3,0))","v":"30.5"},{"$f":"IF($B3=\"\",\"\",IFERROR(form!L3,0))","v":"14"},{"$nulls":4},{"$f":"IF(form!D3=\"\",\"\",IF(B3=\"\",\"\",H3+I3+J3+K3+F3))","v":58.3},{"$f":"IF(B3=\"\",\"\",$Q$17/Q3*85%)","v":7.1572041166380798},{"$f":"1/(Q3/$Q$17)*0.85","v":7.1572041166380798}]
[{"$f":"IF(form!D4=\"\",\"\",IF(B4=\"\",\"\",H4+I4+J4+K4+F4))","v":46.9},{"$f":"IF($E4=\"\",\"\",IFERROR(form!E4,0))","v":"ARNRAY"},{"$f":"IF($E4=\"\",\"\",IFERROR(form!F4,0))","v":"0x7"},{"$f":"IFERROR(VLOOKUP(MID(D4,3,1),lookup_table,2,FALSE),\"\")","v":0},{"$f":"form!C4","v":2},{"$f":"IF(E4=1,20,0+IF(E4=2,18,0+IF(E4=3,16,0+IF(E4=4,14,0+IF(E4=5,12,0+IF(E4=6,10,0+IF(E4=7,8,0+IF(E4=8,6,0))))))))","v":18},null,{"$f":"IF($B4=\"\",\"\",IFERROR(form!H4,0))","v":"1.9"},{"$f":"IF($B4=\"\",\"\",IFERROR(form!I4,0))","v":"1.7"},{"$f":"IF($B4=\"\",\"\",IFERROR(form!J4,0))","v":"3.3"},{"$f":"IF($B4=\"\",\"\",IFERROR(form!K4,0))","v":"22"},{"$f":"IF($B4=\"\",\"\",IFERROR(form!L4,0))","v":"14"},{"$nulls":4},{"$f":"IF(form!D4=\"\",\"\",IF(B4=\"\",\"\",H4+I4+J4+K4+F4))","v":46.9},8.8969083155650335,{"$f":"1/(Q4/$Q$17)*0.85","v":8.8969083155650317}]
[{"$f":"IF(form!D5=\"\",\"\",IF(B5=\"\",\"\",H5+I5+J5+K5+F5))","v":50.8},{"$f":"IF($E5=\"\",\"\",IFERROR(form!E5,0))","v":"SUPER SALSA"},{"$f":"IF($E5=\"\",\"\",IFERROR(form!F5,0))","v":"641"},{"$f":"IFERROR(VLOOKUP(MID(D5,3,1),lookup_table,2,FALSE),\"\")","v":0},{"$f":"form!C5","v":3},{"$f":"IF(E5=1,20,0+IF(E5=2,18,0+IF(E5=3,16,0+IF(E5=4,14,0+IF(E5=5,12,0+IF(E5=6,10,0+IF(E5=7,8,0+IF(E5=8,6,0))))))))","v":16},null,{"$f":"IF($B5=\"\",\"\",IFERROR(form!H5,0))","v":"4.4"},{"$f":"IF($B5=\"\",\"\",IFERROR(form!I5,0))","v":"2.3"},{"$f":"IF($B5=\"\",\"\",IFERROR(form!J5,0))","v":"2.1"},{"$f":"IF($B5=\"\",\"\",IFERROR(form!K5,0))","v":"26"},{"$f":"IF($B5=\"\",\"\",IFERROR(form!L5,0))","v":"10"},{"$nulls":4},{"$f":"IF(form!D5=\"\",\"\",IF(B5=\"\",\"\",H5+I5+J5+K5+F5))","v":50.8},8.2138779527559063,8.2138779527559063]
[{"$f":"IF(form!D6=\"\",\"\",IF(B6=\"\",\"\",H6+I6+J6+K6+F6))","v":42.3},{"$f":"IF($E6=\"\",\"\",IFERROR(form!E6,0))","v":"LATHAMS WISH"},{"$f":"IF($E6=\"\",\"\",IFERROR(form!F6,0))","v":"x60"},{"$f":"IFERROR(VLOOKUP(MID(D6,3,1),lookup_table,2,FALSE),\"\")","v":0},{"$f":"form!C6","v":4},14,null,{"$f":"IF($B6=\"\",\"\",IFERROR(form!H6,0))","v":"2.3"},{"$f":"IF($B6=\"\",\"\",IFERROR(form!I6,0))","v":"2.4"},{"$f":"IF($B6=\"\",\"\",IFERROR(form!J6,0))","v":"2.6"},{"$f":"IF($B6=\"\",\"\",IFERROR(form!K6,0))","v":"21"},{"$f":"IF($B6=\"\",\"\",IFERROR(form!L6,0))","v":"13"},{"$nulls":4},{"$f":"IF(form!D6=\"\",\"\",IF(B6=\"\",\"\",H6+I6+J6+K6+F6))","v":42.3},9.8644208037825063,9.8644208037825063]
[{"$f":"IF(form!D7=\"\",\"\",IF(B7=\"\",\"\",H7+I7+J7+K7+F7))","v":49.9},{"$f":"IF($E7=\"\",\"\",IFERROR(form!E7,0))","v":"I LOVE YOUR SMILE"},{"$f":"IF($E7=\"\",\"\",IFERROR(form!F7,0))","v":"421"},{"$f":"IFERROR(VLOOKUP(MID(D7,3,1),lookup_table,2,FALSE),\"\")","v":0},{"$f":"form!C7","v":5},12,null,{"$f":"IF($B7=\"\",\"\",IFERROR(form!H7,0))","v":"1.8"},{"$f":"IF($B7=\"\",\"\",IFERROR(form!I7,0))","v":"1.7"},{"$f":"IF($B7=\"\",\"\",IFERROR(form!J7,0))","v":"4.4"},{"$f":"IF($B7=\"\",\"\",IFERROR(form!K7,0))","v":"30"},{"$f":"IF($B7=\"\",\"\",IFERROR(form!L7,0))","v":"14"},{"$nulls":4},{"$f":"IF(form!D7=\"\",\"\",IF(B7=\"\",\"\",H7+I7+J7+K7+F7))","v":49.9},8.3620240480961918,8.3620240480961918]
[{"$f":"IF(form!D8=\"\",\"\",IF(B8=\"\",\"\",H8+I8+J8+K8+F8))","v":18.899999999999999},{"$f":"IF($E8=\"\",\"\",IFERROR(form!E8,0))","v":"YONGA LASS"},{"$f":"IF($E8=\"\",\"\",IFERROR(form!F8,0))","v":0},{"$f":"IFERROR(VLOOKUP(MID(D8,3,1),lookup_table,2,FALSE),\"\")","v":0},{"$f":"form!C8","v":6},10,null,{"$f":"IF($B8=\"\",\"\",IFERROR(form!H8,0))","v":"2.3"},{"$f":"IF($B8=\"\",\"\",IFERROR(form!I8,0))","v":"2.1"},{"$f":"IF($B8=\"\",\"\",IFERROR(form!J8,0))","v":"4.5"},{"$f":"IF($B8=\"\",\"\",IFERROR(form!K8,0))","v":0},{"$f":"IF($B8=\"\",\"\",IFERROR(form!L8,0))","v":"14"},{"$nulls":4},{"$f":"IF(form!D8=\"\",\"\",IF(B8=\"\",\"\",H8+I8+J8+K8+F8))","v":18.899999999999999},22.077513227513229,22.077513227513229]
[{"$f":"IF(form!D9=\"\",\"\",IF(B9=\"\",\"\",H9+I9+J9+K9+F9))","v":43.6},{"$f":"IF($E9=\"\",\"\",IFERROR(form!E9,0))","v":"ADELANTE"},{"$f":"IF($E9=\"\",\"\",IFERROR(form!F9,0))","v":"513"},{"$f":"IFERROR(VLOOKUP(MID(D9,3,1),lookup_table,2,FALSE),\"\")","v":0},{"$f":"form!C9","v":7},8,null,{"$f":"IF($B9=\"\",\"\",IFERROR(form!H9,0))","v":"2.2"},{"$f":"IF($B9=\"\",\"\",IFERROR(form!I9,0))","v":"3.5"},{"$f":"IF($B9=\"\",\"\",IFERROR(form!J9,0))","v":"2.4"},{"$f":"IF($B9=\"\",\"\",IFERROR(form!K9,0))","v":"27.5"},{"$f":"IF($B9=\"\",\"\",IFERROR(form!L9,0))","v":"13"},{"$nulls":4},{"$f":"IF(form!D9=\"\",\"\",IF(B9=\"\",\"\",H9+I9+J9+K9+F9))","v":43.6},9.5702981651376149,9.5702981651376149]
[{"$f":"IF(form!D10=\"\",\"\",IF(B10=\"\",\"\",H10+I10+J10+K10+F10))","v":35.700000000000003},{"$f":"IF($E10=\"\",\"\",IFERROR(form!E10,0))","v":"DEVIL GIRL"},{"$f":"IF($E10=\"\",\"\",IFERROR(form!F10,0))","v":"177"},{"$f":"IFERROR(VLOOKUP(MID(D10,3,1),lookup_table,2,FALSE),\"\")","v":0},{"$f":"form!C10","v":8},6,null,{"$f":"IF($B10=\"\",\"\",IFERROR(form!H10,0))","v":"3.4"},{"$f":"IF($B10=\"\",\"\",IFERROR(form!I10,0))","v":"2.6"},{"$f":"IF($B10=\"\",\"\",IFERROR(form!J10,0))","v":"2.2"},{"$f":"IF($B10=\"\",\"\",IFERROR(form!K10,0))","v":"21.5"},{"$f":"IF($B10=\"\",\"\",IFERROR(form!L10,0))","v":"21"},{"$nulls":4},{"$f":"IF(form!D10=\"\",\"\",IF(B10=\"\",\"\",H10+I10+J10+K10+F10))","v":35.700000000000003},11.688095238095237,11.688095238095237]
[{"$f":"IF(form!D11=\"\",\"\",IF(B11=\"\",\"\",H11+I11+J11+K11+F11))","v":38.6},{"$f":"IF($E11=\"\",\"\",IFERROR(form!E11,0))","v":"FLOPPY"},null,{"$f":"IFERROR(VLOOKUP(MID(D11,3,1),lookup_table,2,FALSE),\"\")","v":0},{"$f":"form!C11","v":9},0,null,{"$f":"IF($B11=\"\",\"\",IFERROR(form!H11,0))","v":"3.4"},{"$f":"IF($B11=\"\",\"\",IFERROR(form!I11,0))","v":"3.9"},{"$f":"IF($B11=\"\",\"\",IFERROR(form!J11,0))","v":"1.3"},{"$f":"IF($B11=\"\",\"\",IFERROR(form!K11,0))","v":"30"},{"$f":"IF($B11=\"\",\"\",IFERROR(form!L11,0))","v":"7"},{"$nulls":4},{"$f":"IF(form!D11=\"\",\"\",IF(B11=\"\",\"\",H11+I11+J11+K11+F11))","v":38.6},10.809974093264248,10.809974093264248]
[{"$f":"IF(form!D12=\"\",\"\",IF(B12=\"\",\"\",H12+I12+J12+K12+F12))","v":27.9},{"$f":"IF($E12=\"\",\"\",IFERROR(form!E12,0))","v":"JOLLY ODD"},null,null,{"$f":"form!C12","v":10},{"$f":"IF(E12=1,20,0+IF(E12=2,18,0+IF(E12=3,16,0+IF(E12=4,14,0+IF(E12=5,12,0+IF(E12=6,10,0+IF(E12=7,8,0+IF(E12=8,6,0))))))))","v":0},null,{"$f":"IF($B12=\"\",\"\",IFERROR(form!H12,0))","v":"1.9"},{"$f":"IF($B12=\"\",\"\",IFERROR(form!I12,0))","v":"2.2"},{"$f":"IF($B12=\"\",\"\",IFERROR(form!J12,0))","v":"1.3"},{"$f":"IF($B12=\"\",\"\",IFERROR(form!K12,0))","v":"22.5"},{"$f":"IF($B12=\"\",\"\",IFERROR(form!L12,0))","v":"13"},{"$nulls":4},{"$f":"IF(form!D12=\"\",\"\",IF(B12=\"\",\"\",H12+I12+J12+K12+F12))","v":27.9},14.955734767025092,14.955734767025088]
[{"$f":"IF(form!D13=\"\",\"\",IF(B13=\"\",\"\",H13+I13+J13+K13+F13))","v":34.700000000000003},{"$f":"IF($E13=\"\",\"\",IFERROR(form!E13,0))","v":"working"},null,null,{"$f":"form!C13","v":11},0,null,{"$f":"IF($B13=\"\",\"\",IFERROR(form!H13,0))","v":"2"},{"$f":"IF($B13=\"\",\"\",IFERROR(form!I13,0))","v":"2"},{"$f":"IF($B13=\"\",\"\",IFERROR(form!J13,0))","v":"2.2"},{"$f":"IF($B13=\"\",\"\",IFERROR(form!K13,0))","v":"28.5"},{"$f":"IF($B13=\"\",\"\",IFERROR(form!L13,0))","v":"34"},{"$nulls":4},{"$f":"IF(form!D13=\"\",\"\",IF(B13=\"\",\"\",H13+I13+J13+K13+F13))","v":34.700000000000003},12.024927953890488,12.024927953890488]
[{"$f":"IF(form!D14=\"\",\"\",IF(B14=\"\",\"\",H14+I14+J14+K14+F14))","v":43.3},{"$f":"IF($E14=\"\",\"\",IFERROR(form!E14,0))","v":"VISIONS OF GRACE"},null,null,{"$f":"form!C14","v":12},0,null,{"$f":"IF($B14=\"\",\"\",IFERROR(form!H14,0))","v":"2.3"},{"$f":"IF($B14=\"\",\"\",IFERROR(form!I14,0))","v":"4.8"},{"$f":"IF($B14=\"\",\"\",IFERROR(form!J14,0))","v":"2.7"},{"$f":"IF($B14=\"\",\"\",IFERROR(form!K14,0))","v":"33.5"},{"$f":"IF($B14=\"\",\"\",IFERROR(form!L14,0))","v":"14"},{"$nulls":4},{"$f":"IF(form!D14=\"\",\"\",IF(B14=\"\",\"\",H14+I14+J14+K14+F14))","v":43.3},9.6366050808314103,9.6366050808314085]
[]
[{"$f":"SUM(A3:A14)","v":514.5},{"$nulls":6},{"$f":"IF($B16=\"\",\"\",IFERROR(form!H14,0))","v":""},{"$f":"IF($B16=\"\",\"\",IFERROR(form!I14,0))","v":""},{"$f":"IF($B16=\"\",\"\",IFERROR(form!J14,0))","v":""},{"$f":"IF($B16=\"\",\"\",IFERROR(form!K14,0))","v":""},{"$nulls":6},{"$f":"IF(B16=\"\",\"\",Q28/Q16*85%)","v":""}]
[{"$nulls":8},{"$f":"IF(H17=\"\",\"\",0+SUBSTITUTE(H17,\"kg\",\"\"))","v":""},{"$nulls":7},{"$f":"SUM(Q3:Q14)","v":490.90000000000003}]
[{"$nulls":8},""]
[]
[{"$nulls":8},""]
[{"$nulls":8},""]
[{"$nulls":8},""]
[{"$nulls":8},""]
[{"$nulls":8},""]
[{"$nulls":8},""]
[{"$nulls":8},""]
[{"$nulls":8},""]
[{"$nulls":8},""]
[{"$nulls":8},""]
[{"$nulls":8},""]
[{"$nulls":8},""]
[{"$nulls":8},""]
[{"$nulls":8},""]
[{"$nulls":8},""]
[{"$nulls":8},""]
[{"$nulls":8},""]
[{"$nulls":8},""]
[{"$nulls":8},""]
[{"$nulls":8},""]
[{"$nulls":8},""]
[{"$nulls":8},""]
[{"$nulls":8},""]
[{"$nulls":8},""]
[{"$nulls":8},""]
[{"$nulls":8},""]
[{"$nulls":8},""]
[{"$nulls":8},""]
[{"$nulls":8},""]
[{"$nulls":8},""]
[{"$nulls":8},""]
[{"$nulls":8},""]
[{"$nulls":8},""]
[{"$nulls":8},""]
[{"$nulls":8},""]
[{"$nulls":8},""]
[{"$nulls":8},""]
[{"$nulls":8},""]
[{"$nulls":8},""]
[{"$nulls":8},""]
[{"$nulls":8},""]
[{"$nulls":8},""]
[{"$nulls":8},""]
[{"$nulls":8},""]
[{"$nulls":8},""]
[{"$nulls":8},""]
[{"$nulls":8},""]
[{"$nulls":8},""]
[{"$nulls":8},""]
[{"$nulls":8},""]
[{"$nulls":8},""]
[{"$nulls":8},""]
[{"$nulls":8},""]
[{"$nulls":8},""]
[{"$nulls":8},""]
[{"$nulls":8},""]
[{"$nulls":8},""]
[{"$nulls":8},""]
[{"$nulls":8},{"$f":"IF(H78=\"\",\"\",0+SUBSTITUTE(H78,\"kg\",\"\"))","v":""}]
[{"$nulls":8},""]
[{"$nulls":8},""]
[{"$nulls":8},""]
[{"$nulls":8},""]
[{"$nulls":8},""]
[{"$nulls":8},""]
[{"$nulls":8},""]
[{"$nulls":8},""]
[{"$nulls":8},""]
[{"$nulls":8},""]
[{"$nulls":8},""]

{"sheet":"RacePage","index":10,"n_rows":35,"n_cols":28,"rows_kept":35,"cut":false,"hidden":false,"merged":[[2,20,2,21],[17,22,17,23],[3,3,3,5],[7,22,7,23],[16,22,16,23]]}
[]
[]
[null,null,null,"Venue",{"$nulls":6},1,2,3,4,5,6,7,8,null,null,"Race Card"]
[null,null,null,"Albury",null,null,null,6,null,null,"1,2,3","6,4,7","1,7,2","5,2,7","7,4,9","10,3,1","2,1,9","13,3,7","6,7,8"]
[{"$nulls":10},{"$f":"IF(M5=\"\",\"\",IF(M5<10000,14,IF(M5<25000,12,IF(M5<40000,10,IF(M5<70000,6,0)))))","v":""},null,null,{"$f":"D4&\" \"&\"R\"&H4","v":"Albury R6"}]
[null,null,"No","Runner",null,"Form","con ","impact","fbook","class",null,null,"total",{"$nulls":4},"R/Price","PR PICE","L/Scr"]
[null,{"$f":"IF(R7=\"\",\"\",IF(OR(R7<$W$17,R7>$W$18),\"\",RANK(R7,R$7:R$19,1)+COUNTIF(R$7:R7,R7)-1))","v":2},{"$f":"form!D3","v":"1"},{"$f":"IF($C7=\"\",\"\",form!E3)","v":"VITAL GEM"},null,{"$f":"IF($C7=\"\",\"\",form!F3)","v":"233"},{"$f":"IF($C7=\"\",\"\",consensus!A3)","v":21.9},{"$f":"IF($C7=\"\",\"\",Impact!A3)","v":89.5},{"$f":"IF($C7=\"\",\"\",Formbook!A3)","v":58.3},{"$f":"IF($C7=\"\",\"\",BlackBook!A3)","v":81.900000000000006},null,null,{"$f":"IF(COUNT(G7,J7,H7)>0,SUM(G7,H7,I7,J7)/COUNT(G7,H7,I7,J7),\"\")","v":62.9},{"$nulls":4},{"$f":"IF($C7=\"\",\"\",Prices!F3)","v":6.7},{"$f":"IF($C7=\"\",\"\",form!M3)","v":26}]
[null,{"$f":"IF(R8=\"\",\"\",IF(OR(R8<$W$17,R8>$W$18),\"\",RANK(R8,R$7:R$19,1)+COUNTIF(R$7:R8,R8)-1))","v":6},{"$f":"form!D4","v":"2"},{"$f":"IF($C8=\"\",\"\",form!E4)","v":"ARNRAY"},null,{"$f":"IF($C8=\"\",\"\",form!F4)","v":"0x7"},{"$f":"IF($C8=\"\",\"\",consensus!A4)","v":22.3},{"$f":"IF($C8=\"\",\"\",Impact!A4)","v":74.5},{"$f":"IF($C8=\"\",\"\",Formbook!A4)","v":46.9},{"$f":"IF($C8=\"\",\"\",BlackBook!A4)","v":46.9},null,null,{"$f":"IF(COUNT(G8,J8,H8)>0,SUM(G8,H8,I8,J8)/COUNT(G8,H8,I8,J8),\"\")","v":47.65},{"$nulls":4},{"$f":"IF($C8=\"\",\"\",Prices!F4)","v":11.8},{"$f":"IF($C8=\"\",\"\",form!M4)","v":51},null,"Rating System",null,"Impact"]
[null,{"$f":"IF(R9=\"\",\"\",IF(OR(R9<$W$17,R9>$W$18),\"\",RANK(R9,R$7:R$19,1)+COUNTIF(R$7:R9,R9)-1))","v":3},{"$f":"form!D5","v":"3"},{"$f":"IF($C9=\"\",\"\",form!E5)","v":"SUPER SALSA"},null,{"$f":"IF($C9=\"\",\"\",form!F5)","v":"641"},{"$f":"IF($C9=\"\",\"\",consensus!A5)","v":20.100000000000001},{"$f":"IF($C9=\"\",\"\",Impact!A5)","v":86},{"$f":"IF($C9=\"\",\"\",Formbook!A5)","v":50.8},{"$f":"IF($C9=\"\",\"\",BlackBook!A5)","v":50.8},null,null,51.924999999999997,{"$nulls":4},{"$f":"IF($C9=\"\",\"\",Prices!F5)","v":7.5},{"$f":"IF($C9=\"\",\"\",form!M5)","v":13}]
[null,{"$f":"IF(R10=\"\",\"\",IF(OR(R10<$W$17,R10>$W$18),\"\",RANK(R10,R$7:R$19,1)+COUNTIF(R$7:R10,R10)-1))","v":11},{"$f":"form!D6","v":"4"},{"$f":"IF($C10=\"\",\"\",form!E6)","v":"LATHAMS WISH"},null,{"$f":"IF($C10=\"\",\"\",form!F6)","v":"x60"},{"$f":"IF($C10=\"\",\"\",consensus!A6)","v":19.600000000000001},{"$f":"IF($C10=\"\",\"\",Impact!A6)","v":71.5},{"$f":"IF($C10=\"\",\"\",Formbook!A6)","v":42.3},{"$f":"IF($C10=\"\",\"\",BlackBook!A6)","v":42.3},null,null,43.924999999999997,{"$nulls":4},{"$f":"IF($C10=\"\",\"\",Prices!F6)","v":13.8},{"$f":"IF($C10=\"\",\"\",form!M6)","v":9.5},null,"No Of Selections",null,2,null,null,"Saved"]
[null,{"$f":"IF(R11=\"\",\"\",IF(OR(R11<$W$17,R11>$W$18),\"\",RANK(R11,R$7:R$19,1)+COUNTIF(R$7:R11,R11)-1))","v":4},{"$f":"form!D7","v":"5"},{"$f":"IF($C11=\"\",\"\",form!E7)","v":"I LOVE YOUR SMILE"},null,{"$f":"IF($C11=\"\",\"\",form!F7)","v":"421"},{"$f":"IF($C11=\"\",\"\",consensus!A7)","v":20.399999999999999},{"$f":"IF($C11=\"\",\"\",Impact!A7)","v":81.5},{"$f":"IF($C11=\"\",\"\",Formbook!A7)","v":49.9},{"$f":"IF($C11=\"\",\"\",BlackBook!A7)","v":49.9},null,null,50.425000000000004,{"$nulls":4},{"$f":"IF($C11=\"\",\"\",Prices!F7)","v":8.6999999999999993},{"$f":"IF($C11=\"\",\"\",form!M7)","v":20}]
[null,{"$f":"IF(R12=\"\",\"\",IF(OR(R12<$W$17,R12>$W$18),\"\",RANK(R12,R$7:R$19,1)+COUNTIF(R$7:R12,R12)-1))","v":""},{"$f":"form!D8","v":"6"},{"$f":"IF($C12=\"\",\"\",form!E8)","v":"YONGA LASS"},null,{"$f":"IF($C12=\"\",\"\",form!F8)","v":0},{"$f":"IF($C12=\"\",\"\",consensus!A8)","v":19.5},{"$f":"IF($C12=\"\",\"\",Impact!A8)","v":54.5},{"$f":"IF($C12=\"\",\"\",Formbook!A8)","v":18.899999999999999},{"$f":"IF($C12=\"\",\"\",BlackBook!A8)","v":18.899999999999999},null,null,27.950000000000003,{"$nulls":4},{"$f":"IF($C12=\"\",\"\",Prices!F8)","v":-17},{"$f":"IF($C12=\"\",\"\",form!M8)","v":6.5},null,"No","Runner",null,3]
[null,{"$f":"IF(R13=\"\",\"\",IF(OR(R13<$W$17,R13>$W$18),\"\",RANK(R13,R$7:R$19,1)+COUNTIF(R$7:R13,R13)-1))","v":5},{"$f":"form!D9","v":"7"},{"$f":"IF($C13=\"\",\"\",form!E9)","v":"ADELANTE"},null,{"$f":"IF($C13=\"\",\"\",form!F9)","v":"513"},{"$f":"IF($C13=\"\",\"\",consensus!A9)","v":12.4},{"$f":"IF($C13=\"\",\"\",Impact!A9)","v":76},{"$f":"IF($C13=\"\",\"\",Formbook!A9)","v":43.6},{"$f":"IF($C13=\"\",\"\",BlackBook!A9)","v":43.6},null,null,43.9,{"$nulls":4},{"$f":"IF($C13=\"\",\"\",Prices!F9)","v":10.9},{"$f":"IF($C13=\"\",\"\",form!M9)","v":15},null,{"$f":"IFERROR(VLOOKUP(AB14,$B$7:$R$19,2,0),\"\")","v":"1"},{"$f":"IFERROR(VLOOKUP(AB14,$B$7:$R$19,3,0),\"\")","v":"VITAL GEM"},{"$nulls":5},1]
[null,{"$f":"IF(R14=\"\",\"\",IF(OR(R14<$W$17,R14>$W$18),\"\",RANK(R14,R$7:R$19,1)+COUNTIF(R$7:R14,R14)-1))","v":12},{"$f":"form!D10","v":"8"},{"$f":"IF($C14=\"\",\"\",form!E10)","v":"DEVIL GIRL"},null,{"$f":"IF($C14=\"\",\"\",form!F10)","v":"177"},{"$f":"IF($C14=\"\",\"\",consensus!A10)","v":11.2},{"$f":"IF($C14=\"\",\"\",Impact!A10)","v":68.5},{"$f":"IF($C14=\"\",\"\",Formbook!A10)","v":35.700000000000003},{"$f":"IF($C14=\"\",\"\",BlackBook!A10)","v":35.700000000000003},null,null,37.775000000000006,{"$nulls":4},{"$f":"IF($C14=\"\",\"\",Prices!F10)","v":16.8},{"$f":"IF($C14=\"\",\"\",form!M10)","v":71},null,"3","SUPER SALSA",{"$nulls":5},2]
[null,{"$f":"IF(R15=\"\",\"\",IF(OR(R15<$W$17,R15>$W$18),\"\",RANK(R15,R$7:R$19,1)+COUNTIF(R$7:R15,R15)-1))","v":7},{"$f":"form!D11","v":"9"},{"$f":"IF($C15=\"\",\"\",form!E11)","v":"FLOPPY"},null,{"$f":"IF($C15=\"\",\"\",form!F11)","v":"354"},{"$f":"IF($C15=\"\",\"\",consensus!A11)","v":9.3000000000000007},{"$f":"IF($C15=\"\",\"\",Impact!A11)","v":73},{"$f":"IF($C15=\"\",\"\",Formbook!A11)","v":38.6},{"$f":"IF($C15=\"\",\"\",BlackBook!A11)","v":38.6},null,null,39.875,{"$nulls":4},{"$f":"IF($C15=\"\",\"\",Prices!F11)","v":12.7},{"$f":"IF($C15=\"\",\"\",form!M11)","v":7.5},null,"5","I LOVE YOUR SMILE",{"$nulls":5},3]
[null,{"$f":"IF(R16=\"\",\"\",IF(OR(R16<$W$17,R16>$W$18),\"\",RANK(R16,R$7:R$19,1)+COUNTIF(R$7:R16,R16)-1))","v":8},{"$f":"form!D12","v":"10"},{"$f":"IF($C16=\"\",\"\",form!E12)","v":"JOLLY ODD"},null,{"$f":"IF($C16=\"\",\"\",form!F12)","v":"814"},{"$f":"IF($C16=\"\",\"\",consensus!A12)","v":8.3000000000000007},{"$f":"IF($C16=\"\",\"\",Impact!A12)","v":49.5},{"$f":"IF($C16=\"\",\"\",Formbook!A12)","v":27.9},{"$f":"IF($C16=\"\",\"\",BlackBook!A12)","v":27.9},null,null,28.4,{"$nulls":4},{"$f":"IF($C16=\"\",\"\",Prices!F12)","v":12.7},{"$f":"IF($C16=\"\",\"\",form!M12)","v":41},null,"7","ADELANTE",{"$nulls":5},4]
[null,{"$f":"IF(R17=\"\",\"\",IF(OR(R17<$W$17,R17>$W$18),\"\",RANK(R17,R$7:R$19,1)+COUNTIF(R$7:R17,R17)-1))","v":9},{"$f":"form!D13","v":"11"},{"$f":"IF($C17=\"\",\"\",form!E13)","v":"working"},null,{"$f":"IF($C17=\"\",\"\",form!F13)","v":"235"},{"$f":"IF($C17=\"\",\"\",consensus!A13)","v":8.1999999999999993},{"$f":"IF($C17=\"\",\"\",Impact!A13)","v":59.5},{"$f":"IF($C17=\"\",\"\",Formbook!A13)","v":34.700000000000003},{"$f":"IF($C17=\"\",\"\",BlackBook!A13)","v":34.700000000000003},null,null,34.275000000000006,{"$nulls":4},{"$f":"IF($C17=\"\",\"\",Prices!F13)","v":12.7},{"$f":"IF($C17=\"\",\"\",form!M13)","v":31},{"$nulls":8},5]
[null,{"$f":"IF(R18=\"\",\"\",IF(OR(R18<$W$17,R18>$W$18),\"\",RANK(R18,R$7:R$19,1)+COUNTIF(R$7:R18,R18)-1))","v":10},{"$f":"form!D14","v":"12"},{"$f":"IF($C18=\"\",\"\",form!E14)","v":"VISIONS OF GRACE"},null,{"$f":"IF($C18=\"\",\"\",form!F14)","v":"782"},{"$f":"IF($C18=\"\",\"\",consensus!A14)","v":""},{"$f":"IF($C18=\"\",\"\",Impact!A14)","v":82.5},{"$f":"IF($C18=\"\",\"\",Formbook!A14)","v":43.3},{"$f":"IF($C18=\"\",\"\",BlackBook!A14)","v":43.3},null,null,56.366666666666667,null,{"$f":"IF(M7=\"\", \"\", RANK(M7,$M$7:$M$19)-MIN($M$7:$M$19)+1)","v":-25.950000000000003},null,null,{"$f":"IF($C18=\"\",\"\",Prices!F14)","v":12.7},{"$f":"IF($C18=\"\",\"\",form!M14)","v":3.7},null,"Max Rated Price",null,100,{"$nulls":4},6]
[null,{"$f":"IF(R19=\"\",\"\",IF(OR(R19<$W$17,R19>$W$18),\"\",RANK(R19,R$7:R$19,1)+COUNTIF(R$7:R19,R19)-1))","v":""},{"$f":"form!D15","v":""},{"$f":"IF($C19=\"\",\"\",form!E15)","v":""},null,{"$f":"IF($C19=\"\",\"\",form!F15)","v":""},{"$f":"IF($C19=\"\",\"\",consensus!A15)","v":""},{"$f":"IF($C19=\"\",\"\",Impact!A15)","v":""},{"$f":"IF($C19=\"\",\"\",form!K15)","v":""},{"$f":"IF($C19=\"\",\"\",BlackBook!A15)","v":""},null,{"$f":"IF($C19=\"\",\"\",form!N15)","v":""},"",null,null,{"$f":"IF(C19=\"\",\"\",#REF!/Q19*85%)","v":""},null,{"$f":"IF($C19=\"\",\"\",Prices!F15)","v":""},{"$f":"IF($C19=\"\",\"\",form!M15)","v":""},{"$nulls":8},7]
[{"$nulls":7},{"$f":"IF($C20=\"\",\"\",Impact!A16)","v":""},null,{"$f":"IF($C20=\"\",\"\",BlackBook!A16)","v":""},null,null,{"$f":"IF(COUNT(G20,J20,H20)>0,SUM(G20,H20,I20,J20)/COUNT(G20,H20,I20,J20),\"\")","v":""},{"$nulls":4},{"$f":"IF($C20=\"\",\"\",Prices!F16)","v":""},{"$f":"IF($C20=\"\",\"\",form!M16)","v":""},{"$nulls":8},8]
[]
[null,null,null,{"$f":"D4","v":"Albury"},{"$nulls":5},{"$f":"H4","v":6},null,{"$f":"#REF!","v":{"$error":"#REF!"}},null,null,{"$f":"#REF!&\"M\"","v":{"$error":"#REF!"}},{"$nulls":4},{"$f":"D4&\"         \"&\"Race\"&\" \"&H4","v":"Albury         Race 6"},null,{"$f":"#REF!","v":{"$error":"#REF!"}}]
[null,null,"No","Runner",null,null,null,"Cond","Form","Weight","Trainer",null,null,"Jockey",null,null,"R/Price",null,null,{"$f":"#REF!","v":{"$error":"#REF!"}},null,null,null,{"$f":"#REF!&\"M\"","v":{"$error":"#REF!"}}]
[null,null,{"$f":"IF($Q24=\"\",\"\",C7)","v":"1"},"VITAL GEM",{"$nulls":4},{"$f":"IF($Q24=\"\",\"\",F7)","v":"233"},{"$f":"IF($Q24=\"\",\"\",I7)","v":58.3},{"$f":"IF($Q24=\"\",\"\",G7)","v":21.9},null,null,{"$f":"IF($Q24=\"\",\"\",H7)","v":89.5},null,null,{"$f":"R7","v":6.7},null,null,"No","Runner",null,null,"R/Price"]
[null,null,"2","ARNRAY",{"$nulls":4},"0x7",46.9,22.3,null,null,74.5,null,null,11.8,null,null,{"$f":"#REF!","v":{"$error":"#REF!"}},{"$f":"#REF!","v":{"$error":"#REF!"}},null,null,{"$f":"Y13","v":0},{"$f":"IF(ISNA(VLOOKUP(U25,$D$7:$R$19,15,0)),\"\",VLOOKUP(U25,$D$7:$R$19,6,0))","v":{"$error":"#REF!"}}]
[null,null,"3","SUPER SALSA",{"$nulls":4},"641",50.8,20.100000000000001,null,null,86,null,null,7.5,null,null,{"$f":"U13","v":"1"},{"$f":"V13","v":"VITAL GEM"},null,null,{"$f":"Y14","v":0},{"$f":"IF(ISNA(VLOOKUP(U26,$D$7:$R$19,15,0)),\"\",VLOOKUP(U26,$D$7:$R$19,6,0))","v":58.3},{"$f":"IF(T25=\"\",\"\",$W$8)","v":{"$error":"#REF!"}},{"$f":"IF(T25=\"\",\"\",$N$5)","v":{"$error":"#REF!"}}]
[null,null,"4","LATHAMS WISH",{"$nulls":4},"x60",42.3,19.600000000000001,null,null,71.5,null,null,13.8,null,null,{"$f":"U14","v":"3"},{"$f":"V14","v":"SUPER SALSA"},null,null,{"$f":"Y15","v":0},{"$f":"IF(ISNA(VLOOKUP(U27,$D$7:$R$19,15,0)),\"\",VLOOKUP(U27,$D$7:$R$19,6,0))","v":50.8},{"$f":"IF(T26=\"\",\"\",$W$8)","v":"Impact"},"Albury R6"]
[null,null,"5","I LOVE YOUR SMILE",{"$nulls":4},"421",49.9,20.399999999999999,null,null,81.5,null,null,8.6999999999999993,{"$nulls":8},{"$f":"IF(T27=\"\",\"\",$W$8)","v":"Impact"},"Albury R6"]
[null,null,"6","YONGA LASS",{"$nulls":4},0,18.899999999999999,19.5,null,null,54.5,null,null,-17]
[null,null,"7","ADELANTE",{"$nulls":4},"513",43.6,12.4,null,null,76,null,null,10.9]
[null,null,"8","DEVIL GIRL",{"$nulls":4},"177",35.700000000000003,11.2,null,null,68.5,null,null,16.8]
[null,null,"9","FLOPPY",{"$nulls":4},"354",38.6,9.3000000000000007,null,null,73,null,null,12.7]
[null,null,"10","JOLLY ODD",{"$nulls":4},"814",27.9,8.3000000000000007,null,null,49.5,null,null,12.7]
[null,null,"11","working",{"$nulls":4},"235",34.700000000000003,8.1999999999999993,null,null,59.5,null,null,12.7]
[null,null,"12","VISIONS OF GRACE",{"$nulls":4},"782",43.3,"",null,null,82.5,null,null,12.7]

{"sheet":"form","index":11,"n_rows":26,"n_cols":20,"rows_kept":26,"cut":false,"hidden":false,"merged":[]}
[{"$f":"IF(RacePage!D4=\"\",\"Master\",RacePage!D4)","v":"Albury"},null,null,3,4,5,null,6,7,8,9,10,11,12,13,16,17,18,19,20]
[{"$f":"RacePage!H4","v":6},"Ratings Systems",null,null,"Name","Last 3",null,"TR","JK","API","LST","DLR","price","AFS","BAR",null,null,null,"Prize/M"]
["Albury","Consensus",1,{"$f":"IFERROR(IF(OR($A$2=0,D$1=\"\"),\"\",VLOOKUP($A$1&$A$2&$C3,INDIRECT($A$1&\"!$Y$1:$AN$200\"),D$1,FALSE)),\"\")","v":"1"},{"$f":"IFERROR(VLOOKUP(CONCATENATE($A$1,$A$2,$C3),INDIRECT($A$1&\"!$Y$1:$AN$200\"),E$1,FALSE),\"\")","v":"VITAL GEM"},{"$f":"IFERROR(VLOOKUP(CONCATENATE($A$1,$A$2,$C3),INDIRECT($A$1&\"!$Y$1:$AN$200\"),F$1,FALSE),\"\")","v":"233"},{"$f":"IF(MID(F3,3,1)=\"1\", 10*2, IF(MID(F3,3,1)=\"2\", 9*2, IF(MID(F3,3,1)=\"3\", 8*2, IF(MID(F3,3,1)=\"4\", 7*2, \"\"))))","v":16},{"$f":"IFERROR(VLOOKUP(CONCATENATE($A$1,$A$2,$C3),INDIRECT($A$1&\"!$Y$1:$AN$200\"),H$1,FALSE),\"\")","v":"2.5"},{"$f":"IFERROR(VLOOKUP(CONCATENATE($A$1,$A$2,$C3),INDIRECT($A$1&\"!$Y$1:$AN$200\"),I$1,FALSE),\"\")","v":"3.4"},"1.9","30.5","14",26,17.3,90.5,{"$f":"IFERROR(VLOOKUP(CONCATENATE($A$1,$A$2,$C3),INDIRECT($A$1&\"!$Y$1:$AN$200\"),P$1,FALSE),\"\")","v":0},{"$f":"IFERROR(  IF(OR($A$2=0,Q$1=\"\"),\"\",VLOOKUP($A$1&$A$2&$C3,INDIRECT($A$1&\"!$Y$1:$AN$200\"),Q$1,FALSE)),\"\")","v":""},"","",{"$f":"IFERROR(IF(OR($A$2=0,T$1=\"\"),\"\",VLOOKUP($A$1&$A$2&$C3, INDIRECT($A$1&\"!$y$1:$an$200\"), T$1, FALSE)),\"\")","v":""}]
[null,"Impact",2,{"$f":"IFERROR(IF(OR($A$2=0,D$1=\"\"),\"\",VLOOKUP($A$1&$A$2&$C4,INDIRECT($A$1&\"!$Y$1:$AN$200\"),D$1,FALSE)),\"\")","v":"2"},{"$f":"IFERROR(VLOOKUP(CONCATENATE($A$1,$A$2,$C4),INDIRECT($A$1&\"!$Y$1:$AN$200\"),E$1,FALSE),\"\")","v":"ARNRAY"},{"$f":"IFERROR(VLOOKUP(CONCATENATE($A$1,$A$2,$C4),INDIRECT($A$1&\"!$Y$1:$AN$200\"),F$1,FALSE),\"\")","v":"0x7"},{"$f":"IF(MID(F4,3,1)=\"1\", 10*2, IF(MID(F4,3,1)=\"2\", 9*2, IF(MID(F4,3,1)=\"3\", 8*2, IF(MID(F4,3,1)=\"4\", 7*2, \"\"))))","v":""},{"$f":"IFERROR(VLOOKUP(CONCATENATE($A$1,$A$2,$C4),INDIRECT($A$1&\"!$Y$1:$AN$200\"),H$1,FALSE),\"\")","v":"1.9"},"1.7","3.3","22","14",51,16.600000000000001,78.5,{"$f":"IFERROR(VLOOKUP(CONCATENATE($A$1,$A$2,$C4),INDIRECT($A$1&\"!$Y$1:$AN$200\"),AM$1,FALSE),\"\")","v":""},"","","",""]
[null,"FormBook",3,"3","SUPER SALSA","641",20,"4.4","2.3","2.1","26","10",13,16.2,107,0,"","","",""]
[null,"Class",4,"4","LATHAMS WISH","x60","","2.3","2.4","2.6","21","13",9.5,17.600000000000001,108,0,"","","",""]
[null,"Tops",5,"5","I LOVE YOUR SMILE","421",20,"1.8","1.7","4.4","30","14",20,17.100000000000001,93.5,0,"","","",""]
[null,"Nines",6,"6","YONGA LASS",0,"","2.3","2.1","4.5",0,"14",6.5,0,122,0,"","","",""]
[null,"BlackBook",7,"7","ADELANTE","513",16,"2.2","3.5","2.4","27.5","13",15,0,102,0,"","","",""]
[null,null,8,"8","DEVIL GIRL","177","","3.4","2.6","2.2","21.5","21",71,16.600000000000001,72.5,0,"","","",""]
[null,null,9,"9","FLOPPY","354",14,"3.4","3.9","1.3","30","7",7.5,16.899999999999999,119.5,0,"","","",""]
[null,null,10,"10","JOLLY ODD","814",14,"1.9","2.2","1.3","22.5","13",41,17.100000000000001,79,0,"","","",""]
[null,null,11,{"$f":"IFERROR(IF(OR($A$2=0,D$1=\"\"),\"\",VLOOKUP($A$1&$A$2&$C13, INDIRECT($A$1&\"!$y$1:$an$200\"), D$1, FALSE)),\"\")","v":"11"},"working","235","","2","2","2.2","28.5","34",31,17.3,88.5,0,"","","",""]
[null,null,12,"12","VISIONS OF GRACE","782",18,"2.3","4.8","2.7","33.5","14",3.7,17,183.5,0,"","","",""]
[null,null,13,"","","",null,"","","","","","","","","","","","",""]
[null,null,14,{"$f":"IF($A$2=0,\"\",IF(D$1=\"\",\"\",IF(ISNA(VLOOKUP($A$1&$A$2&$C16,INDIRECT($A$1&\"!$y$1:$z$200\"),D$1,0)),\"\",VLOOKUP($A$1&$A$2&$C16,INDIRECT($A$1&\"!$y$1:$an$200\"),D$1,0))))","v":""},"",{"$f":"IF($A$2=0,\"\",IF(F$1=\"\",\"\",IF(ISNA(VLOOKUP($A$1&$A$2&$C16,INDIRECT($A$1&\"!$y$1:$z$200\"),F$1,0)),\"\",VLOOKUP($A$1&$A$2&$C16,INDIRECT($A$1&\"!$y$1:$an$200\"),F$1,0))))","v":""},null,"","","",{"$f":"IF($A$2=0,\"\",IF(K$1=\"\",\"\",IF(ISNA(VLOOKUP($A$1&$A$2&$C16,INDIRECT($A$1&\"!$y$1:$z$200\"),K$1,0)),\"\",VLOOKUP($A$1&$A$2&$C16,INDIRECT($A$1&\"!$y$1:$an$200\"),K$1,0))))","v":""},"","","","","","","",""]
[null,null,15,"","","",null,{"$f":"IF($A$2=0,\"\",IF(H$1=\"\",\"\",IF(ISNA(VLOOKUP($A$1&$A$2&$C17,INDIRECT($A$1&\"!$y$1:$z$200\"),H$1,0)),\"\",VLOOKUP($A$1&$A$2&$C17,INDIRECT($A$1&\"!$y$1:$an$200\"),H$1,0))))","v":""},"","","","","","","","","","",""]
[null,null,16,"","","",null,"","","","","","","","","",{"$f":"IF($O18=\"\",\"\",IF(Q$1=\"\",\"\",IF(ISNA(VLOOKUP($A$1&$A$2&$C18,INDIRECT($A$1&\"!$Y$1:$GY$4000\"),Q$1,0)),\"\",VLOOKUP($A$1&$A$2&$C18,INDIRECT($A$1&\"!$Y$1:$GY$4000\"),Q$1,0))))","v":""},"",{"$f":"IF($O18=\"\",\"\",IF(#REF!=\"\",\"\",IF(ISNA(VLOOKUP($A$1&$A$2&$C18,INDIRECT($A$1&\"!$Y$1:$GY$4000\"),#REF!,0)),\"\",VLOOKUP($A$1&$A$2&$C18,INDIRECT($A$1&\"!$Y$1:$GY$4000\"),#REF!,0))))","v":""}]
[null,null,17,"","","",null,"","","","","","","","","","","",""]
[null,null,18,{"$f":"IF($A$2=0,\"\",IF(D$1=\"\",\"\",IF(ISNA(VLOOKUP($A$1&$A$2&$C20,INDIRECT($A$1&\"!$y$1:$GX$4000\"),D$1,0)),\"\",VLOOKUP($A$1&$A$2&$C20,INDIRECT($A$1&\"!$y$1:$GX$4000\"),D$1,0))))","v":""},"",{"$f":"IF(F$1=\"\",\"\",IF(ISNA(VLOOKUP($A$1&$A$2&$C20,INDIRECT($A$1&\"!$Y$1:$GY$4000\"),F$1,0)),\"\",VLOOKUP($A$1&$A$2&$C20,INDIRECT($A$1&\"!$Y$1:$GY$4000\"),F$1,0)))","v":""},null,"",null,{"$f":"IF(J$1=\"\",\"\",IF(ISNA(VLOOKUP($A$1&$A$2&$C20,INDIRECT($A$1&\"!$Y$1:$GY$4000\"),J$1,0)),\"\",VLOOKUP($A$1&$A$2&$C20,INDIRECT($A$1&\"!$Y$1:$GY$4000\"),J$1,0)))","v":""},"","","",""]
[null,null,19,"",{"$f":"IF(E$1=\"\",\"\",SUBSTITUTE(IF(ISNA(VLOOKUP($A$1&$A$2&$C21,INDIRECT($A$1&\"!$Y$1:$GY$4000\"),E$1,0)),\"\",VLOOKUP($A$1&$A$2&$C21,INDIRECT($A$1&\"!$Y$1:$GY$4000\"),E$1,0)),CHAR(146),\"\"))","v":""},"",null,"",null,"","","","",""]
[null,null,20,"","","",null,"",null,"","","","",""]
[null,null,21,"","","",null,"",null,{"$f":"IF(J$1=\"\",\"\",IF(ISNA(VLOOKUP($A$1&$A$2&$C23,INDIRECT($A$1&\"!$Y$1:$GY$4000\"),J$1,0)),\"\",VLOOKUP($A$1&$A$2&$C23,INDIRECT($A$1&\"!$Y$1:$GY$4000\"),J$1,0)))","v":""},"","","",""]
[null,null,22,"","","",null,"",null,"","","","",""]
[null,null,24,"","","",null,"",null,"","","","",""]
[{"$nulls":8},{"$f":"IF($A$2=0,\"\",IF(I$1=\"\",\"\",IF(ISNA(VLOOKUP($A$1&$A$2&$C26,INDIRECT($A$1&\"!$y$1:$z$200\"),I$1,0)),\"\",VLOOKUP($A$1&$A$2&$C26,INDIRECT($A$1&\"!$y$1:$an$200\"),I$1,0))))","v":""}]

{"sheet":"Prices","index":12,"n_rows":28,"n_cols":8,"rows_kept":28,"cut":false,"hidden":false,"merged":[]}
[{"$f":"RacePage!W8","v":"Impact"}]
["Rating",null,null,null,"Rated %","Rated Price"]
[{"$f":"INDIRECT($A$1&\"!a3\")","v":89.5},{"$f":"IF(A3=\"\",\"\",A3-C$3)","v":35},{"$f":"MIN($A$3:$A$16)","v":54.5},{"$f":"IF(A3=\"\",\"\",IF(A3=0,0,B3+((B3*B3*C$8)/(C$6-C$7))))","v":34.806477093206951},{"$f":"IF(A3=\"\",\"\",IF(B3=0,C$4*100,(D3/C$9)*100))","v":12.61747072086124},{"$f":"IF(E3=\"\",\"\",IF(E3=0,0,ROUND(85/E3,1)))","v":6.7},null,1]
[{"$f":"INDIRECT($A$1&\"!a4\")","v":74.5},{"$f":"IF(A4=\"\",\"\",A4-C$3)","v":20},-0.05,{"$f":"IF(A4=\"\",\"\",IF(A4=0,0,B4+((B4*B4*C$8)/(C$6-C$7))))","v":19.936808846761455},{"$f":"IF(A4=\"\",\"\",IF(B4=0,C$4*100,(D4/C$9)*100))","v":7.2271635310232094},{"$f":"IF(E4=\"\",\"\",IF(E4=0,0,ROUND(85/E4,1)))","v":11.8},null,2]
[{"$f":"INDIRECT($A$1&\"!a5\")","v":86},31.5,{"$f":"A28","v":0},31.343246445497631,11.362037395045284,7.5,null,3]
[{"$f":"INDIRECT($A$1&\"!a6\")","v":71.5},17,{"$f":"(C5-C3)*1.1","v":-59.95},16.954344391785149,6.1460096459028657,13.8,null,4]
[{"$f":"INDIRECT($A$1&\"!a7\")","v":81.5},27,{"$f":"MAX(B3:B26)","v":35},26.884834123222749,9.7458472018467557,8.6999999999999993,null,5]
[{"$f":"INDIRECT($A$1&\"!a8\")","v":54.5},0,1.4999999999999999E-2,0,-5,-17,null,6]
[{"$f":"INDIRECT($A$1&\"!a9\")","v":76},21.5,{"$f":"SUM(D3:D26)/((100-C4)/100)","v":275.85938468364554},21.426974723538706,7.7673539176892872,10.9,null,7]
[{"$f":"INDIRECT($A$1&\"!a10\")","v":68.5},{"$f":"IF(A10=\"\",\"\",A10-C$3)","v":14},{"$f":"SUM(D4:D27)/((100-C5)/100)","v":241.19083728278036},{"$f":"IF(A10=\"\",\"\",IF(A10=0,0,B10+((B10*B10*C$8)/(C$6-C$7))))","v":13.969036334913111},{"$f":"IF(A10=\"\",\"\",IF(B10=0,C$4*100,(D10/C$9)*100))","v":5.0638249450649457},16.8,null,8]
[{"$f":"INDIRECT($A$1&\"!a11\")","v":73},18.5,138.32699495843636,18.445932069510267,6.6867154404277347,12.7,null,9]
[{"$f":"INDIRECT($A$1&\"!a11\")","v":73},18.5,292.17043383157124,18.445932069510267,6.6867154404277347,12.7,null,10]
[73,18.5,172.98238495647962,18.445932069510267,6.6867154404277347,12.7,null,11]
[73,18.5,-83.061591360780909,18.445932069510267,6.6867154404277347,12.7,null,12]
[73,18.5,-103.45685760256363,18.445932069510267,6.6867154404277347,12.7,null,13]
[73,18.5,-325.21367481887199,18.445932069510267,6.6867154404277347,12.7,null,14]
[{"$nulls":5},""]
{"$rows_empty":10}
[{"$f":"INDIRECT(A1&\"!a28\")","v":0}]

{"sheet":"albury","index":13,"n_rows":129,"n_cols":39,"rows_kept":129,"cut":false,"hidden":false,"merged":[]}
[null,"Venue",null,"albury",{"$nulls":7},4,0,{"$f":"IF(F1=\"\",\"\",(IF(ISNUMBER(0+A1),0+A1,0+LEFT(A1,FIND(\"e\",A1)-1))))","v":""},null,{"$f":"IF(A1=\"\",\"\",IF(O1=\"\",TRIM(CLEAN(SUBSTITUTE(IFERROR(REPLACETEXTS(IFERROR(LEFT(A1,FIND(\"(\",A1)-1),A1),$AL$1:$AL$14,$AM$1:$AM$14),\"\"),CHAR(160),\"\"))),\"\"))","v":""},{"$f":"IF(A1=\"\",\"\",IF(O1=\"\",TRIM(CLEAN(SUBSTITUTE(REPLACETEXTS(IFERROR(LEFT(A1,FIND(\"(\",A1)-1),A1),$AL$1:$AL$14,$AM$1:$AM$14),CHAR(160),\"\"))),\"\"))","v":""},{"$f":"TRIM(CLEAN(SUBSTITUTE(SUBSTITUTE(IFERROR(IF(AND(ISNUMBER(0+LEFT(Q1,1)),LEN(LEFT(Q1,FIND(\"-\",Q1)-1))<20),LEFT(Q1,FIND(\"-\",Q1)-1),\"\"),IFERROR(LEFT(Q1,FIND(\"*\",Q1)-1),Q1)),CHAR(160),\"*\"),\"(\",\"\")))","v":""},{"$f":"IF(Q1=\"\",\"\",B1&\" \"&#REF!)","v":""},null,{"$f":"TRIM(CLEAN(IF(COUNTA(#REF!)=0,\"END\",IF(P1=\"\",\"\",IF(ISNUMBER(0+SUBSTITUTE(P1,\"of\",\"\")),S1,IF(ISNA(VLOOKUP(R1,$Z$1:$AB$129,1,0)),\"\",VLOOKUP(R1,$Z$1:$AB$129,1,0)))))))","v":""},null,null,{"$f":"IF(W1=\"\",\"\",MATCH(\"?*\",INDEX(W:W,1+MATCH(V1,W:W,0)):#REF!,0))","v":""}]
[null,"race 1",{"$nulls":9},{"$f":"IFERROR(IF(AND(LEFT(A2,FIND(\" \",A2)-1)=\"Race\",LEFT(A3,FIND(\" \",A3)-1)=\"OF\"),\"Race\",\"\"),\"\")","v":""},1,{"$f":"IF(F2=\"\",\"\",(IF(ISNUMBER(0+A2),0+A2,0+LEFT(A2,FIND(\"e\",A2)-1))))","v":""},null,{"$f":"IF(A2=\"\",\"\",IF(O2=\"\",TRIM(CLEAN(SUBSTITUTE(IFERROR(REPLACETEXTS(IFERROR(LEFT(A2,FIND(\"(\",A2)-1),A2),$AL$1:$AL$14,$AM$1:$AM$14),\"\"),CHAR(160),\"\"))),\"\"))","v":""},{"$f":"IF(A2=\"\",\"\",IF(O2=\"\",TRIM(CLEAN(SUBSTITUTE(REPLACETEXTS(IFERROR(LEFT(A2,FIND(\"(\",A2)-1),A2),$AL$1:$AL$14,$AM$1:$AM$14),CHAR(160),\"\"))),\"\"))","v":""},{"$f":"TRIM(CLEAN(SUBSTITUTE(SUBSTITUTE(IFERROR(IF(AND(ISNUMBER(0+LEFT(Q2,1)),LEN(LEFT(Q2,FIND(\"-\",Q2)-1))<20),LEFT(Q2,FIND(\"-\",Q2)-1),\"\"),IFERROR(LEFT(Q2,FIND(\"*\",Q2)-1),Q2)),CHAR(160),\"*\"),\"(\",\"\")))","v":""},{"$f":"IF(Q2=\"\",\"\",B2&\" \"&B3)","v":""},{"$f":"IF(U2=\"\",\"\",1+COUNT($T$1:T1))","v":""},{"$f":"TRIM(CLEAN(IF(COUNTA(A3:A11)=0,\"END\",IF(P2=\"\",\"\",IF(ISNUMBER(0+SUBSTITUTE(P2,\"of\",\"\")),S2,IF(ISNA(VLOOKUP(R2,$Z$1:$AB$129,1,0)),\"\",VLOOKUP(R2,$Z$1:$AB$129,1,0)))))))","v":""},null,null,{"$f":"IF(W2=\"\",\"\",MATCH(\"?*\",INDEX(W:W,1+MATCH(V2,W:W,0)):#REF!,0))","v":""},{"$f":"IF(Z2=\"\",\"\",$D$1&M2&AA2)","v":""},{"$f":"IF(N2=\"\",\"\",N2&O2)","v":""},{"$f":"IF(N2=\"\",\"\",SUBSTITUTE(N2,CHAR(160),\"\"))","v":""},{"$f":"IF(N2=\"\",\"\",O2)","v":""},{"$f":"IF($AB2=\"\",\"\",SUBSTITUTE(B2,CHAR(160),\"\"))","v":""},{"$f":"IF($AB2=\"\",\"\",SUBSTITUTE(D2,CHAR(160),\"\"))","v":""},"","","","","",{"$f":"IF($B2=\"\",\"\",SUBSTITUTE(J2,CHAR(160),\"\"))","v":""},{"$f":"IF(ISNA(VLOOKUP(Z2,$W$1:$X$129,2,0)),\"\",VLOOKUP(Z2,$W$1:$X$129,2,0))","v":""}]
["Tab","Form L3","Horse","TRat","JRat","API","LSRat","DLR","PR","AFS","BP",{"$f":"IFERROR(IF(AND(LEFT(A3,FIND(\" \",A3)-1)=\"Race\",LEFT(A4,FIND(\" \",A4)-1)=\"OF\"),\"Race\",\"\"),\"\")","v":""},{"$f":"IF(L3<>\"\",M2+1,M2)","v":1},{"$nulls":13},{"$f":"IF($B3=\"\",\"\",A3)","v":"Tab"},{"$f":"IF($A3=\"\",\"\",C3)","v":"Horse"},{"$f":"IF($A3=\"\",\"\",B3)","v":"Form L3"},{"$f":"IF($A3=\"\",\"\",D3)","v":"TRat"},"JRat","API","LSRat","DLR","PR","AFS","BP"]
[1,122,"MANAVENDRA",4.0999999999999996,2.2999999999999998,5.3,34.5,7,2.8,17.100000000000001,252.5,null,1,{"$f":"IF(F4=\"\",\"\",(IF(ISNUMBER(0+A4),0+A4,0+LEFT(A4,FIND(\"e\",A4)-1))))","v":1},{"$nulls":10},{"$f":"IF(Z4=\"\",\"\",$D$1&M4&AA4)","v":"albury11"},{"$f":"IF(N4=\"\",\"\",N4&O4)","v":"1"},{"$f":"IF(B4=\"\",\"\",A4)","v":1},{"$f":"IF(A4=\"\",\"\",C4)","v":"MANAVENDRA"},{"$f":"IF(A4=\"\",\"\",B4)","v":122},{"$f":"IF(A4=\"\",\"\",D4)","v":4.0999999999999996},{"$f":"IF(A4=\"\",\"\",E4)","v":2.2999999999999998},{"$f":"IF(A4=\"\",\"\",F4)","v":5.3},{"$f":"IF(B4=\"\",\"\",G4)","v":34.5},{"$f":"IF(A4=\"\",\"\",H4)","v":7},{"$f":"IF(A4=\"\",\"\",I4)","v":2.8},{"$f":"IF(A4=\"\",\"\",J4)","v":17.100000000000001},{"$f":"IF(B4=\"\",\"\",K4)","v":252.5}]
[2,211,"WARRALEA DIAMOND",4.4000000000000004,2.2999999999999998,3.5,34,10,4.2,16.5,201,null,1,2,{"$nulls":10},"albury12","2",2,"WARRALEA DIAMOND",211,4.4000000000000004,2.2999999999999998,3.5,34,10,4.2,16.5,201]
[3,261,"MANITOBA",3,3.6,2.1,29.5,13,7,17.3,157,null,1,3,{"$nulls":10},"albury13","3",3,"MANITOBA",261,3,3.6,2.1,29.5,13,7,17.3,157]
[4,"x53","SIROTA",2.1,3.5,1,29.5,14,13,17,110,null,1,4,{"$nulls":10},"albury14","4",4,"SIROTA","x53",2.1,3.5,1,29.5,14,13,17,110]
[5,431,"ANTIQUE MISS",3.7,4.8,4.3,32.5,24,5,17,181,null,1,5,{"$nulls":10},"albury15","5",5,"ANTIQUE MISS",431,3.7,4.8,4.3,32.5,24,5,17,181]
[6,562,"PRIDE OF TUSCANY",4.4000000000000004,2.2000000000000002,0.9,27.5,10,8.5,15.9,148.5,null,1,6,{"$nulls":10},"albury16","6",6,"PRIDE OF TUSCANY",562,4.4000000000000004,2.2000000000000002,0.9,27.5,10,8.5,15.9,148.5]
[{"$nulls":12},1,"",{"$nulls":10},"","","","","","","","","","","","",""]
[{"$nulls":12},1,"",{"$nulls":10},"","","","","","","","","","","","",""]
[{"$nulls":12},1,"",{"$nulls":10},"","","","","","","","","","","","",""]
[{"$nulls":12},1,"",{"$nulls":10},"","","","","","","","","","","","",""]
[{"$nulls":12},1,"",{"$nulls":10},"","","","","","","","","","","","","",null,55]
[{"$nulls":12},1,"",{"$nulls":10},"","","","","","","","","","","","",""]
[null,"race 2",{"$nulls":5},{"$f":"SUM(H4:H15)","v":78},{"$nulls":4},2,"",null,{"$f":"IF(A16=\"\",\"\",IF(O16=\"\",TRIM(CLEAN(SUBSTITUTE(IFERROR(REPLACETEXTS(IFERROR(LEFT(A16,FIND(\"(\",A16)-1),A16),$AL$1:$AL$14,$AM$1:$AM$14),\"\"),CHAR(160),\"\"))),\"\"))","v":""},{"$f":"IF(A16=\"\",\"\",IF(O16=\"\",TRIM(CLEAN(SUBSTITUTE(REPLACETEXTS(IFERROR(LEFT(A16,FIND(\"(\",A16)-1),A16),$AL$1:$AL$14,$AM$1:$AM$14),CHAR(160),\"\"))),\"\"))","v":""},{"$f":"TRIM(CLEAN(SUBSTITUTE(SUBSTITUTE(IFERROR(IF(AND(ISNUMBER(0+LEFT(Q16,1)),LEN(LEFT(Q16,FIND(\"-\",Q16)-1))<20),LEFT(Q16,FIND(\"-\",Q16)-1),\"\"),IFERROR(LEFT(Q16,FIND(\"*\",Q16)-1),Q16)),CHAR(160),\"*\"),\"(\",\"\")))","v":""},{"$f":"IF(Q16=\"\",\"\",B16&\" \"&B17)","v":""},{"$f":"IF(U16=\"\",\"\",1+COUNT($T$1:T14))","v":""},{"$f":"TRIM(CLEAN(IF(COUNTA(A17:A21)=0,\"END\",IF(P16=\"\",\"\",IF(ISNUMBER(0+SUBSTITUTE(P16,\"of\",\"\")),S16,IF(ISNA(VLOOKUP(R16,$Z$1:$AB$129,1,0)),\"\",VLOOKUP(R16,$Z$1:$AB$129,1,0)))))))","v":""},{"$f":"IF(ISNA(VLOOKUP(1+COUNTA($V$1:V14),$T$1:$U$129,2,0)),\"\",VLOOKUP(1+COUNTA($V$1:V14),$T$1:$U$129,2,0))","v":""},{"$f":"IF(ISNA(VLOOKUP(V16,$Z$1:$AJ$129,1,0)),IF(V16=\"END\",\"END\",\"\"),VLOOKUP(V16,$Z$1:$AJ$129,1,0))","v":""},{"$f":"IF(W16=\"\",\"\",MATCH(\"?*\",INDEX(W:W,1+MATCH(V16,W:W,0)):#REF!,0))","v":""},"","",{"$f":"IF(N16=\"\",\"\",SUBSTITUTE(N16,CHAR(160),\"\"))","v":""},{"$f":"IF(N16=\"\",\"\",O16)","v":""},{"$f":"IF($AB16=\"\",\"\",SUBSTITUTE(B16,CHAR(160),\"\"))","v":""},{"$f":"IF($AB16=\"\",\"\",SUBSTITUTE(D16,CHAR(160),\"\"))","v":""},"","","","","",{"$f":"IF($B16=\"\",\"\",SUBSTITUTE(J16,CHAR(160),\"\"))","v":""},{"$f":"IF(ISNA(VLOOKUP(Z16,$W$1:$X$129,2,0)),\"\",VLOOKUP(Z16,$W$1:$X$129,2,0))","v":""},"Rewards"]
["Tab","Form L3","Horse","TRat","JRat","API","LSRat","DLR","PR","AFS","BP",{"$f":"IFERROR(IF(AND(LEFT(A17,FIND(\" \",A17)-1)=\"Race\",LEFT(A18,FIND(\" \",A18)-1)=\"OF\"),\"Race\",\"\"),\"\")","v":""},2,{"$nulls":13},{"$f":"IF($B17=\"\",\"\",A17)","v":"Tab"},{"$f":"IF($A17=\"\",\"\",C17)","v":"Horse"},{"$f":"IF($A17=\"\",\"\",B17)","v":"Form L3"},{"$f":"IF($A17=\"\",\"\",D17)","v":"TRat"},"JRat","API","LSRat","DLR","PR","AFS","BP"]
[1,"9x6","SPECIAL STREET",1.8,2.1,1.5,14.5,13,3,17.100000000000001,150.5,null,2,{"$f":"IF(F18=\"\",\"\",(IF(ISNUMBER(0+A18),0+A18,0+LEFT(A18,FIND(\"e\",A18)-1))))","v":1},null,{"$f":"IF(A18=\"\",\"\",IF(O18=\"\",TRIM(CLEAN(SUBSTITUTE(IFERROR(REPLACETEXTS(IFERROR(LEFT(A18,FIND(\"(\",A18)-1),A18),$AL$1:$AL$14,$AM$1:$AM$14),\"\"),CHAR(160),\"\"))),\"\"))","v":"1"},{"$f":"IF(A18=\"\",\"\",IF(O18=\"\",TRIM(CLEAN(SUBSTITUTE(REPLACETEXTS(IFERROR(LEFT(A18,FIND(\"(\",A18)-1),A18),$AL$1:$AL$14,$AM$1:$AM$14),CHAR(160),\"\"))),\"\"))","v":"1"},{"$f":"TRIM(CLEAN(SUBSTITUTE(SUBSTITUTE(IFERROR(IF(AND(ISNUMBER(0+LEFT(Q18,1)),LEN(LEFT(Q18,FIND(\"-\",Q18)-1))<20),LEFT(Q18,FIND(\"-\",Q18)-1),\"\"),IFERROR(LEFT(Q18,FIND(\"*\",Q18)-1),Q18)),CHAR(160),\"*\"),\"(\",\"\")))","v":"1"},{"$f":"IF(Q18=\"\",\"\",B18&\" \"&#REF!)","v":{"$error":"#REF!"}},{"$nulls":4},{"$f":"IF(W18=\"\",\"\",MATCH(\"?*\",INDEX(W:W,1+MATCH(V18,W:W,0)):#REF!,0))","v":""},{"$f":"IF(Z18=\"\",\"\",$D$1&M18&AA18)","v":"albury21"},{"$f":"IF(N18=\"\",\"\",N18&O18)","v":"1"},{"$f":"IF(B18=\"\",\"\",A18)","v":1},{"$f":"IF(A18=\"\",\"\",C18)","v":"SPECIAL STREET"},{"$f":"IF(A18=\"\",\"\",B18)","v":"9x6"},{"$f":"IF(A18=\"\",\"\",D18)","v":1.8},{"$f":"IF(A18=\"\",\"\",E18)","v":2.1},{"$f":"IF(A18=\"\",\"\",F18)","v":1.5},{"$f":"IF(A18=\"\",\"\",G18)","v":14.5},{"$f":"IF(A18=\"\",\"\",H18)","v":13},{"$f":"IF(A18=\"\",\"\",I18)","v":3},{"$f":"IF(A18=\"\",\"\",J18)","v":17.100000000000001},{"$f":"IF(B18=\"\",\"\",K18)","v":150.5}]
[2,"3x","ZING TO WIN",4.9000000000000004,3.3,2,25,149,5,0,107.5,null,2,2,null,{"$f":"IF(A19=\"\",\"\",IF(O19=\"\",TRIM(CLEAN(SUBSTITUTE(IFERROR(REPLACETEXTS(IFERROR(LEFT(A19,FIND(\"(\",A19)-1),A19),$AL$1:$AL$14,$AM$1:$AM$14),\"\"),CHAR(160),\"\"))),\"\"))","v":"2"},{"$f":"IF(A19=\"\",\"\",IF(O19=\"\",TRIM(CLEAN(SUBSTITUTE(REPLACETEXTS(IFERROR(LEFT(A19,FIND(\"(\",A19)-1),A19),$AL$1:$AL$14,$AM$1:$AM$14),CHAR(160),\"\"))),\"\"))","v":"2"},{"$f":"TRIM(CLEAN(SUBSTITUTE(SUBSTITUTE(IFERROR(IF(AND(ISNUMBER(0+LEFT(Q19,1)),LEN(LEFT(Q19,FIND(\"-\",Q19)-1))<20),LEFT(Q19,FIND(\"-\",Q19)-1),\"\"),IFERROR(LEFT(Q19,FIND(\"*\",Q19)-1),Q19)),CHAR(160),\"*\"),\"(\",\"\")))","v":"2"},{"$f":"IF(Q19=\"\",\"\",B19&\" \"&#REF!)","v":{"$error":"#REF!"}},{"$nulls":4},{"$f":"IF(W19=\"\",\"\",MATCH(\"?*\",INDEX(W:W,1+MATCH(V19,W:W,0)):#REF!,0))","v":""},"albury22","2",{"$f":"IF(N19=\"\",\"\",SUBSTITUTE(N19,CHAR(160),\"\"))","v":"2"},{"$f":"IF(A19=\"\",\"\",C19)","v":"ZING TO WIN"},{"$f":"IF($AB19=\"\",\"\",SUBSTITUTE(B19,CHAR(160),\"\"))","v":"3x"},{"$f":"IF($AB19=\"\",\"\",SUBSTITUTE(D19,CHAR(160),\"\"))","v":"4.9"},{"$f":"IF($AB19=\"\",\"\",SUBSTITUTE(E19,CHAR(160),\"\"))","v":"3.3"},{"$f":"IF($AB19=\"\",\"\",SUBSTITUTE(F19,CHAR(160),\"\"))","v":"2"},{"$f":"IF($AB19=\"\",\"\",SUBSTITUTE(G19,CHAR(160),\"\"))","v":"25"},{"$f":"IF($AB19=\"\",\"\",SUBSTITUTE(H19,CHAR(160),\"\"))","v":"149"},5,0,107.5]
[3,"-","DREAMERS NEVER DIE",4.2,4.4000000000000004,0,0,0,11,0,81,null,2,3,null,{"$f":"IF(A20=\"\",\"\",IF(O20=\"\",TRIM(CLEAN(SUBSTITUTE(IFERROR(REPLACETEXTS(IFERROR(LEFT(A20,FIND(\"(\",A20)-1),A20),$AL$1:$AL$14,$AM$1:$AM$14),\"\"),CHAR(160),\"\"))),\"\"))","v":"3"},{"$f":"IF(A20=\"\",\"\",IF(O20=\"\",TRIM(CLEAN(SUBSTITUTE(REPLACETEXTS(IFERROR(LEFT(A20,FIND(\"(\",A20)-1),A20),$AL$1:$AL$14,$AM$1:$AM$14),CHAR(160),\"\"))),\"\"))","v":"3"},"3",{"$f":"IF(Q20=\"\",\"\",B20&\" \"&#REF!)","v":{"$error":"#REF!"}},{"$nulls":4},{"$f":"IF(W20=\"\",\"\",MATCH(\"?*\",INDEX(W:W,1+MATCH(V20,W:W,0)):#REF!,0))","v":""},"albury23","3","3","DREAMERS NEVER DIE","-","4.2","4.4","0","0","0",11,0,81]
[4,"-","HANCHI",3.7,3.3,0,0,0,20,0,61.5,null,2,4,null,{"$f":"IF(A21=\"\",\"\",IF(O21=\"\",TRIM(CLEAN(SUBSTITUTE(IFERROR(REPLACETEXTS(IFERROR(LEFT(A21,FIND(\"(\",A21)-1),A21),$AL$1:$AL$14,$AM$1:$AM$14),\"\"),CHAR(160),\"\"))),\"\"))","v":"4"},{"$f":"IF(A21=\"\",\"\",IF(O21=\"\",TRIM(CLEAN(SUBSTITUTE(REPLACETEXTS(IFERROR(LEFT(A21,FIND(\"(\",A21)-1),A21),$AL$1:$AL$14,$AM$1:$AM$14),CHAR(160),\"\"))),\"\"))","v":"4"},"4",{"$f":"IF(Q21=\"\",\"\",B21&\" \"&#REF!)","v":{"$error":"#REF!"}},{"$nulls":4},{"$f":"IF(W21=\"\",\"\",MATCH(\"?*\",INDEX(W:W,1+MATCH(V21,W:W,0)):#REF!,0))","v":""},"albury24","4","4","HANCHI","-","3.7","3.3","0","0","0",20,0,61.5]
[5,"-","KING OF FRANCE",4.9000000000000004,3.8,0,0,0,8,0,86,null,2,5,null,{"$f":"IF(A22=\"\",\"\",IF(O22=\"\",TRIM(CLEAN(SUBSTITUTE(IFERROR(REPLACETEXTS(IFERROR(LEFT(A22,FIND(\"(\",A22)-1),A22),$AL$1:$AL$14,$AM$1:$AM$14),\"\"),CHAR(160),\"\"))),\"\"))","v":"5"},{"$f":"IF(A22=\"\",\"\",IF(O22=\"\",TRIM(CLEAN(SUBSTITUTE(REPLACETEXTS(IFERROR(LEFT(A22,FIND(\"(\",A22)-1),A22),$AL$1:$AL$14,$AM$1:$AM$14),CHAR(160),\"\"))),\"\"))","v":"5"},"5",{"$f":"IF(Q22=\"\",\"\",B22&\" \"&#REF!)","v":{"$error":"#REF!"}},{"$nulls":4},{"$f":"IF(W22=\"\",\"\",MATCH(\"?*\",INDEX(W:W,1+MATCH(V22,W:W,0)):#REF!,0))","v":""},"albury25","5","5","KING OF FRANCE","-","4.9","3.8","0","0","0",8,0,86]
[6,"34x","STROMY'S SALUTE",2.2999999999999998,2.4,4.4000000000000004,22.5,102,9.5,17,81.5,null,2,6,null,{"$f":"IF(A23=\"\",\"\",IF(O23=\"\",TRIM(CLEAN(SUBSTITUTE(IFERROR(REPLACETEXTS(IFERROR(LEFT(A23,FIND(\"(\",A23)-1),A23),$AL$1:$AL$14,$AM$1:$AM$14),\"\"),CHAR(160),\"\"))),\"\"))","v":"6"},{"$f":"IF(A23=\"\",\"\",IF(O23=\"\",TRIM(CLEAN(SUBSTITUTE(REPLACETEXTS(IFERROR(LEFT(A23,FIND(\"(\",A23)-1),A23),$AL$1:$AL$14,$AM$1:$AM$14),CHAR(160),\"\"))),\"\"))","v":"6"},"6",{"$f":"IF(Q23=\"\",\"\",B23&\" \"&#REF!)","v":{"$error":"#REF!"}},{"$nulls":4},{"$f":"IF(W23=\"\",\"\",MATCH(\"?*\",INDEX(W:W,1+MATCH(V23,W:W,0)):#REF!,0))","v":""},"albury26","6","6","STROMY'S SALUTE","34x","2.3","2.4","4.4","22.5","102",9.5,17,81.5]
[7,"43x","GOOD VIBES",3.5,4,5.0999999999999996,24,200,6,17.2,100.5,null,2,7,null,{"$f":"IF(A24=\"\",\"\",IF(O24=\"\",TRIM(CLEAN(SUBSTITUTE(IFERROR(REPLACETEXTS(IFERROR(LEFT(A24,FIND(\"(\",A24)-1),A24),$AL$1:$AL$14,$AM$1:$AM$14),\"\"),CHAR(160),\"\"))),\"\"))","v":"7"},{"$f":"IF(A24=\"\",\"\",IF(O24=\"\",TRIM(CLEAN(SUBSTITUTE(REPLACETEXTS(IFERROR(LEFT(A24,FIND(\"(\",A24)-1),A24),$AL$1:$AL$14,$AM$1:$AM$14),CHAR(160),\"\"))),\"\"))","v":"7"},"7",{"$f":"IF(Q24=\"\",\"\",B24&\" \"&#REF!)","v":{"$error":"#REF!"}},{"$nulls":4},{"$f":"IF(W24=\"\",\"\",MATCH(\"?*\",INDEX(W:W,1+MATCH(V24,W:W,0)):#REF!,0))","v":""},"albury27","7","7","GOOD VIBES","43x","3.5","4","5.1","24","200",6,17.2,100.5]
[8,"-","SASSY ONASSIS",2.8,3,0,0,0,14,0,73.5,null,2,8,null,{"$f":"IF(A25=\"\",\"\",IF(O25=\"\",TRIM(CLEAN(SUBSTITUTE(IFERROR(REPLACETEXTS(IFERROR(LEFT(A25,FIND(\"(\",A25)-1),A25),$AL$1:$AL$14,$AM$1:$AM$14),\"\"),CHAR(160),\"\"))),\"\"))","v":"8"},{"$f":"IF(A25=\"\",\"\",IF(O25=\"\",TRIM(CLEAN(SUBSTITUTE(REPLACETEXTS(IFERROR(LEFT(A25,FIND(\"(\",A25)-1),A25),$AL$1:$AL$14,$AM$1:$AM$14),CHAR(160),\"\"))),\"\"))","v":"8"},"8",{"$f":"IF(Q25=\"\",\"\",B25&\" \"&#REF!)","v":{"$error":"#REF!"}},{"$nulls":4},{"$f":"IF(W25=\"\",\"\",MATCH(\"?*\",INDEX(W:W,1+MATCH(V25,W:W,0)):#REF!,0))","v":""},"albury28","8","8","SASSY ONASSIS",{"$f":"IF($AB25=\"\",\"\",SUBSTITUTE(B25,CHAR(160),\"\"))","v":"-"},{"$f":"IF($AB25=\"\",\"\",SUBSTITUTE(D25,CHAR(160),\"\"))","v":"2.8"},{"$f":"IF($AB25=\"\",\"\",SUBSTITUTE(E25,CHAR(160),\"\"))","v":"3"},{"$f":"IF($AB25=\"\",\"\",SUBSTITUTE(F25,CHAR(160),\"\"))","v":"0"},{"$f":"IF($AB25=\"\",\"\",SUBSTITUTE(G25,CHAR(160),\"\"))","v":"0"},{"$f":"IF($AB25=\"\",\"\",SUBSTITUTE(H25,CHAR(160),\"\"))","v":"0"},{"$f":"IF(A25=\"\",\"\",I25)","v":14},{"$f":"IF(A25=\"\",\"\",J25)","v":0},{"$f":"IF(B25=\"\",\"\",K25)","v":73.5}]
[{"$nulls":12},2,"",null,{"$f":"IF(A26=\"\",\"\",IF(O26=\"\",TRIM(CLEAN(SUBSTITUTE(IFERROR(REPLACETEXTS(IFERROR(LEFT(A26,FIND(\"(\",A26)-1),A26),$AL$1:$AL$14,$AM$1:$AM$14),\"\"),CHAR(160),\"\"))),\"\"))","v":""},{"$f":"IF(A26=\"\",\"\",IF(O26=\"\",TRIM(CLEAN(SUBSTITUTE(REPLACETEXTS(IFERROR(LEFT(A26,FIND(\"(\",A26)-1),A26),$AL$1:$AL$14,$AM$1:$AM$14),CHAR(160),\"\"))),\"\"))","v":""},"",{"$f":"IF(Q26=\"\",\"\",B26&\" \"&#REF!)","v":""},{"$nulls":4},{"$f":"IF(W26=\"\",\"\",MATCH(\"?*\",INDEX(W:W,1+MATCH(V26,W:W,0)):#REF!,0))","v":""},"","","",{"$f":"IF(N26=\"\",\"\",O26)","v":""},"","","","","","","","",""]
[{"$nulls":12},2,"",null,{"$f":"IF(A27=\"\",\"\",IF(O27=\"\",TRIM(CLEAN(SUBSTITUTE(IFERROR(REPLACETEXTS(IFERROR(LEFT(A27,FIND(\"(\",A27)-1),A27),$AL$1:$AL$14,$AM$1:$AM$14),\"\"),CHAR(160),\"\"))),\"\"))","v":""},{"$f":"IF(A27=\"\",\"\",IF(O27=\"\",TRIM(CLEAN(SUBSTITUTE(REPLACETEXTS(IFERROR(LEFT(A27,FIND(\"(\",A27)-1),A27),$AL$1:$AL$14,$AM$1:$AM$14),CHAR(160),\"\"))),\"\"))","v":""},"",{"$f":"IF(Q27=\"\",\"\",B27&\" \"&#REF!)","v":""},{"$nulls":4},{"$f":"IF(W27=\"\",\"\",MATCH(\"?*\",INDEX(W:W,1+MATCH(V27,W:W,0)):#REF!,0))","v":""},"","","",{"$f":"IF(N27=\"\",\"\",O27)","v":""},"","","","","","","","",""]
[{"$nulls":12},2,"",null,{"$f":"IF(A28=\"\",\"\",IF(O28=\"\",TRIM(CLEAN(SUBSTITUTE(IFERROR(REPLACETEXTS(IFERROR(LEFT(A28,FIND(\"(\",A28)-1),A28),$AL$1:$AL$14,$AM$1:$AM$14),\"\"),CHAR(160),\"\"))),\"\"))","v":""},{"$f":"IF(A28=\"\",\"\",IF(O28=\"\",TRIM(CLEAN(SUBSTITUTE(REPLACETEXTS(IFERROR(LEFT(A28,FIND(\"(\",A28)-1),A28),$AL$1:$AL$14,$AM$1:$AM$14),CHAR(160),\"\"))),\"\"))","v":""},"",{"$f":"IF(Q28=\"\",\"\",B28&\" \"&#REF!)","v":""},{"$nulls":4},{"$f":"IF(W28=\"\",\"\",MATCH(\"?*\",INDEX(W:W,1+MATCH(V28,W:W,0)):#REF!,0))","v":""},"","","",{"$f":"IF(N28=\"\",\"\",O28)","v":""},"","","","","","","","",""]
[{"$nulls":12},2,"",null,{"$f":"IF(A29=\"\",\"\",IF(O29=\"\",TRIM(CLEAN(SUBSTITUTE(IFERROR(REPLACETEXTS(IFERROR(LEFT(A29,FIND(\"(\",A29)-1),A29),$AL$1:$AL$14,$AM$1:$AM$14),\"\"),CHAR(160),\"\"))),\"\"))","v":""},{"$f":"IF(A29=\"\",\"\",IF(O29=\"\",TRIM(CLEAN(SUBSTITUTE(REPLACETEXTS(IFERROR(LEFT(A29,FIND(\"(\",A29)-1),A29),$AL$1:$AL$14,$AM$1:$AM$14),CHAR(160),\"\"))),\"\"))","v":""},"",{"$f":"IF(Q29=\"\",\"\",B29&\" \"&#REF!)","v":""},{"$f":"IF(U29=\"\",\"\",1+COUNT($T$1:T28))","v":""},{"$f":"TRIM(CLEAN(IF(COUNTA(A31:A31)=0,\"END\",IF(P29=\"\",\"\",IF(ISNUMBER(0+SUBSTITUTE(P29,\"of\",\"\")),S29,IF(ISNA(VLOOKUP(R29,$Z$1:$AB$129,1,0)),\"\",VLOOKUP(R29,$Z$1:$AB$129,1,0)))))))","v":""},null,null,{"$f":"IF(W29=\"\",\"\",MATCH(\"?*\",INDEX(W:W,1+MATCH(V29,W:W,0)):#REF!,0))","v":""},"","","",{"$f":"IF(N29=\"\",\"\",O29)","v":""},"","","","","","","","",""]
[null,"race 3",{"$nulls":10},3]
["Tab","Form L3","Horse","TRat","JRat","API","LSRat","DLR","PR","AFS","BP",{"$f":"IFERROR(IF(AND(LEFT(A31,FIND(\" \",A31)-1)=\"Race\",LEFT(#REF!,FIND(\" \",#REF!)-1)=\"OF\"),\"Race\",\"\"),\"\")","v":""},3,null,null,{"$f":"IF(A31=\"\",\"\",IF(O31=\"\",TRIM(CLEAN(SUBSTITUTE(IFERROR(REPLACETEXTS(IFERROR(LEFT(A31,FIND(\"(\",A31)-1),A31),$AL$1:$AL$14,$AM$1:$AM$14),\"\"),CHAR(160),\"\"))),\"\"))","v":"Tab"},{"$f":"IF(A31=\"\",\"\",IF(O31=\"\",TRIM(CLEAN(SUBSTITUTE(REPLACETEXTS(IFERROR(LEFT(A31,FIND(\"(\",A31)-1),A31),$AL$1:$AL$14,$AM$1:$AM$14),CHAR(160),\"\"))),\"\"))","v":"Tab"},"Tab",{"$f":"IF(Q31=\"\",\"\",B31&\" \"&#REF!)","v":{"$error":"#REF!"}},{"$f":"IF(U31=\"\",\"\",1+COUNT($T$1:T29))","v":""},{"$f":"TRIM(CLEAN(IF(COUNTA(A32:A32)=0,\"END\",IF(P31=\"\",\"\",IF(ISNUMBER(0+SUBSTITUTE(P31,\"of\",\"\")),S31,IF(ISNA(VLOOKUP(R31,$Z$1:$AB$129,1,0)),\"\",VLOOKUP(R31,$Z$1:$AB$129,1,0)))))))","v":""},null,null,null,{"$f":"IF(Z31=\"\",\"\",$D$1&M31&AA31)","v":""},{"$f":"IF(N31=\"\",\"\",N31&O31)","v":""},{"$f":"IF($B31=\"\",\"\",A31)","v":"Tab"},{"$f":"IF($A31=\"\",\"\",C31)","v":"Horse"},{"$f":"IF($A31=\"\",\"\",B31)","v":"Form L3"},{"$f":"IF($A31=\"\",\"\",D31)","v":"TRat"},"JRat","API","LSRat","DLR","PR","AFS","BP"]
[1,"67x","FIRST LAW",3.5,3.3,3.6,30,133,6,17.899999999999999,136,null,3,{"$f":"IF(F32=\"\",\"\",(IF(ISNUMBER(0+A32),0+A32,0+LEFT(A32,FIND(\"e\",A32)-1))))","v":1},{"$nulls":10},"albury31","1",{"$f":"IF(N32=\"\",\"\",SUBSTITUTE(N32,CHAR(160),\"\"))","v":"1"},{"$f":"IF(A32=\"\",\"\",C32)","v":"FIRST LAW"},{"$f":"IF($AB32=\"\",\"\",SUBSTITUTE(B32,CHAR(160),\"\"))","v":"67x"},{"$f":"IF($AB32=\"\",\"\",SUBSTITUTE(D32,CHAR(160),\"\"))","v":"3.5"},{"$f":"IF($AB32=\"\",\"\",SUBSTITUTE(E32,CHAR(160),\"\"))","v":"3.3"},{"$f":"IF($AB32=\"\",\"\",SUBSTITUTE(F32,CHAR(160),\"\"))","v":"3.6"},{"$f":"IF($AB32=\"\",\"\",SUBSTITUTE(G32,CHAR(160),\"\"))","v":"30"},{"$f":"IF($AB32=\"\",\"\",SUBSTITUTE(H32,CHAR(160),\"\"))","v":"133"},{"$f":"IF(A32=\"\",\"\",I32)","v":6},{"$f":"IF(A32=\"\",\"\",J32)","v":17.899999999999999},{"$f":"IF(B32=\"\",\"\",K32)","v":136},99]
[2,"30x","STORM LORD",1.9,2.6,6.8,30.5,108,21,18,75.5,null,3,2,{"$nulls":10},"albury32","2","2","STORM LORD","30x","1.9","2.6","6.8","30.5","108",{"$f":"IF(A33=\"\",\"\",H33)","v":108},18,75.5]
[3,"77x","IMPOSING BROOK",2.5,2.6,0.5,32.5,194,12,null,93,null,3,3,{"$nulls":10},"albury33","3","3","IMPOSING BROOK","77x","2.5","2.6","0.5","32.5","194",194,0,93]
[4,"2x3","ROCK THIS TOWN",1.9,2.7,4.7,32.5,7,3,17.899999999999999,204.5,null,3,4,{"$nulls":10},"albury34","4","4","ROCK THIS TOWN","2x3","1.9","2.7","4.7","32.5","7",7,17.899999999999999,204.5]
[5,417,"SNIPPENOVA",4.0999999999999996,2.4,5.4,28,18,3.7,17.600000000000001,200.5,null,3,5,{"$nulls":10},"albury35","5","5","SNIPPENOVA","417","4.1","2.4","5.4","28","18",18,17.600000000000001,200.5]
[6,"30x","SHAKE BABY SHAKE",1.8,1.8,2.2000000000000002,10,122,9.5,17.2,100,null,3,6,{"$nulls":10},"albury36","6","6","SHAKE BABY SHAKE","30x","1.8","1.8","2.2","10","122",122,17.2,100]
[7,"0x5","BACK IN BLUE",2,2.1,4.2,26,10,14,17.399999999999999,87.5,null,3,7,{"$nulls":10},"albury37","7","7","BACK IN BLUE","0x5","2","2.1","4.2","26","10",10,17.399999999999999,87.5]
[8,"76x","ZENAZE",1.9,2.1,1.1000000000000001,27.5,107,14,18.399999999999999,87.5,null,3,8,{"$nulls":10},"albury38","8","8","ZENAZE","76x","1.9","2.1","1.1","27.5","107",107,18.399999999999999,87.5]
[{"$nulls":12},3,"",{"$nulls":10},"","","","","","","","","","","","",""]
[{"$nulls":12},3,"",{"$nulls":10},"","","","","","","","","","",{"$f":"IF(A41=\"\",\"\",I41)","v":""},"",""]
[{"$nulls":12},3,"",{"$nulls":10},"","","","","","","","","","",{"$f":"IF(A42=\"\",\"\",I42)","v":""},"",""]
[{"$nulls":12},4,"",{"$nulls":10},"","","","","","","","","","",{"$f":"IF(A43=\"\",\"\",I43)","v":""},"",""]
[null,"race 4",{"$nulls":10},4]
["Tab","Form L3","Horse","TRat","JRat","API","LSRat","DLR","PR","AFS","BP",null,4,{"$nulls":13},{"$f":"IF($B45=\"\",\"\",A45)","v":"Tab"},{"$f":"IF($A45=\"\",\"\",C45)","v":"Horse"},{"$f":"IF($A45=\"\",\"\",B45)","v":"Form L3"},{"$f":"IF($A45=\"\",\"\",D45)","v":"TRat"},"JRat","API","LSRat","DLR","PR","AFS","BP"]
[1,"7x0","KEEP IT HUSH",2.2999999999999998,2.4,0.9,10,20,9,17.5,105,null,4,{"$f":"IF(F46=\"\",\"\",(IF(ISNUMBER(0+A46),0+A46,0+LEFT(A46,FIND(\"e\",A46)-1))))","v":1},{"$nulls":10},{"$f":"IF(Z46=\"\",\"\",$D$1&M46&AA46)","v":"albury41"},{"$f":"IF(N46=\"\",\"\",N46&O46)","v":"1"},{"$f":"IF(N46=\"\",\"\",SUBSTITUTE(N46,CHAR(160),\"\"))","v":"1"},{"$f":"IF(A46=\"\",\"\",C46)","v":"KEEP IT HUSH"},{"$f":"IF($AB46=\"\",\"\",SUBSTITUTE(B46,CHAR(160),\"\"))","v":"7x0"},{"$f":"IF($AB46=\"\",\"\",SUBSTITUTE(D46,CHAR(160),\"\"))","v":"2.3"},{"$f":"IF($AB46=\"\",\"\",SUBSTITUTE(E46,CHAR(160),\"\"))","v":"2.4"},{"$f":"IF($AB46=\"\",\"\",SUBSTITUTE(F46,CHAR(160),\"\"))","v":"0.9"},{"$f":"IF($AB46=\"\",\"\",SUBSTITUTE(G46,CHAR(160),\"\"))","v":"10"},{"$f":"IF($AB46=\"\",\"\",SUBSTITUTE(H46,CHAR(160),\"\"))","v":"20"},{"$f":"IF(A46=\"\",\"\",I46)","v":9},{"$f":"IF(A46=\"\",\"\",J46)","v":17.5},{"$f":"IF(B46=\"\",\"\",K46)","v":105}]
[2,"3x2","LOOK HERE PUNK",1.8,2.9,2.4,27,10,6.5,17.100000000000001,128,null,4,2,{"$nulls":10},"albury42","2","2","LOOK HERE PUNK","3x2","1.8","2.9","2.4","27","10",6.5,17.100000000000001,128]
[3,862,"BLACK FOR CASH",3.3,3.1,1,29.5,24,13,17.3,94.5,null,4,3,{"$nulls":10},"albury43","3","3","BLACK FOR CASH","862","3.3","3.1","1","29.5","24",13,17.3,94.5]
[4,347,"THE COLLECTOR",4,4.4000000000000004,0.9,19,14,3.3,17.3,187,null,4,4,{"$nulls":10},"albury44","4","4","THE COLLECTOR","347","4","4.4","0.9","19","14",3.3,17.3,187]
[5,"0x3","TIN CHOOKS",1.9,2.9,0.9,25.5,13,17,17,86,null,4,5,{"$nulls":10},"albury45","5","5","TIN CHOOKS","0x3","1.9","2.9","0.9","25.5","13",17,17,86]
[6,"-","GREAT DEMON",3.9,4,0,null,0,26,null,71.5,null,4,6,{"$nulls":10},"albury46","6","6","GREAT DEMON","-","3.9","4","0","","0",26,0,71.5]
[7,578,"DELTA ANNE",2,1.9,1.3,15,28,11,17.7,98.5,null,4,7,{"$nulls":10},"albury47","7","7","DELTA ANNE","578","2","1.9","1.3","15","28",11,17.7,98.5]
[8,"8x6","LITTLE PIPPA",2.4,2.1,0.4,23.5,24,41,17.2,63.5,null,4,8,{"$nulls":10},"albury48","8","8","LITTLE PIPPA","8x6","2.4","2.1","0.4","23.5","24",41,17.2,63.5]
[9,"2x5","FASHION STAKES",4,3.3,4.0999999999999996,23,28,4.8,17.5,151.5,null,4,9,{"$nulls":10},"albury49","9","9","FASHION STAKES","2x5","4","3.3","4.1","23","28",4.8,17.5,151.5]
[10,"8x6","SCOTTISH GEM",1.8,1.8,0.4,11,24,41,null,59.5,null,4,10,{"$nulls":10},"albury410","10","10","SCOTTISH GEM","8x6","1.8","1.8","0.4","11","24",41,0,59.5]
[11,"8x0","CHANTEL",4.0999999999999996,2.4,0.2,22.5,14,21,17.399999999999999,81,null,null,{"$f":"IF(F56=\"\",\"\",(IF(ISNUMBER(0+A56),0+A56,0+LEFT(A56,FIND(\"e\",A56)-1))))","v":11},{"$nulls":10},{"$f":"IF(Z56=\"\",\"\",$D$1&M56&AA56)","v":"albury11"},{"$f":"IF(N56=\"\",\"\",N56&O56)","v":"11"},{"$f":"IF(N56=\"\",\"\",SUBSTITUTE(N56,CHAR(160),\"\"))","v":"11"},{"$f":"IF(A56=\"\",\"\",C56)","v":"CHANTEL"},{"$f":"IF($AB56=\"\",\"\",SUBSTITUTE(B56,CHAR(160),\"\"))","v":"8x0"},{"$f":"IF($AB56=\"\",\"\",SUBSTITUTE(D56,CHAR(160),\"\"))","v":"4.1"},{"$f":"IF($AB56=\"\",\"\",SUBSTITUTE(E56,CHAR(160),\"\"))","v":"2.4"},{"$f":"IF($AB56=\"\",\"\",SUBSTITUTE(F56,CHAR(160),\"\"))","v":"0.2"},{"$f":"IF($AB56=\"\",\"\",SUBSTITUTE(G56,CHAR(160),\"\"))","v":"22.5"},{"$f":"IF($AB56=\"\",\"\",SUBSTITUTE(H56,CHAR(160),\"\"))","v":"14"},{"$f":"IF(A56=\"\",\"\",I56)","v":21},{"$f":"IF(A56=\"\",\"\",J56)","v":17.399999999999999},{"$f":"IF(B56=\"\",\"\",K56)","v":81}]
[{"$nulls":13},"",{"$nulls":10},"","","","","","","","","","","","",""]
[null,"race 5",{"$nulls":10},5]
["No","Last 3","Horse","Trainer rate","Jockey rate","api","est","Probable Weight","Penalty",null,null,null,5]
["Tab","Form L3","Horse","TRat","JRat","API","LSRat","DLR","PR","AFS","BP",{"$f":"IFERROR(IF(AND(LEFT(A60,FIND(\" \",A60)-1)=\"Race\",LEFT(#REF!,FIND(\" \",#REF!)-1)=\"OF\"),\"Race\",\"\"),\"\")","v":""},5,{"$nulls":11},{"$f":"IF(Z60=\"\",\"\",$D$1&M60&AA60)","v":""},{"$f":"IF(N60=\"\",\"\",N60&O60)","v":""},{"$f":"IF($B60=\"\",\"\",A60)","v":"Tab"},{"$f":"IF($A60=\"\",\"\",C60)","v":"Horse"},{"$f":"IF($A60=\"\",\"\",B60)","v":"Form L3"},{"$f":"IF($A60=\"\",\"\",D60)","v":"TRat"},"JRat","API","LSRat","DLR","PR","AFS","BP"]
[1,"78x","RARECHINO",2.2999999999999998,3,0.3,15,136,51,16.7,60.5,null,5,{"$f":"IF(F61=\"\",\"\",(IF(ISNUMBER(0+A61),0+A61,0+LEFT(A61,FIND(\"e\",A61)-1))))","v":1},{"$nulls":10},"albury51","1",{"$f":"IF(N61=\"\",\"\",SUBSTITUTE(N61,CHAR(160),\"\"))","v":"1"},{"$f":"IF(A61=\"\",\"\",C61)","v":"RARECHINO"},{"$f":"IF($AB61=\"\",\"\",SUBSTITUTE(B61,CHAR(160),\"\"))","v":"78x"},{"$f":"IF($AB61=\"\",\"\",SUBSTITUTE(D61,CHAR(160),\"\"))","v":"2.3"},{"$f":"IF($AB61=\"\",\"\",SUBSTITUTE(E61,CHAR(160),\"\"))","v":"3"},{"$f":"IF($AB61=\"\",\"\",SUBSTITUTE(F61,CHAR(160),\"\"))","v":"0.3"},{"$f":"IF($AB61=\"\",\"\",SUBSTITUTE(G61,CHAR(160),\"\"))","v":"15"},{"$f":"IF($AB61=\"\",\"\",SUBSTITUTE(H61,CHAR(160),\"\"))","v":"136"},{"$f":"IF(A61=\"\",\"\",I61)","v":51},{"$f":"IF(A61=\"\",\"\",J61)","v":16.7},{"$f":"IF(B61=\"\",\"\",K61)","v":60.5}]
[2,321,"uuu",2.2999999999999998,3,0.3,15,136,51,16.7,60.5,null,5,2,{"$nulls":10},"albury52","2","2",{"$f":"IF(A62=\"\",\"\",C62)","v":"uuu"},{"$f":"IF($AB62=\"\",\"\",SUBSTITUTE(B62,CHAR(160),\"\"))","v":"321"},{"$f":"IF($AB62=\"\",\"\",SUBSTITUTE(D62,CHAR(160),\"\"))","v":"2.3"},{"$f":"IF($AB62=\"\",\"\",SUBSTITUTE(E62,CHAR(160),\"\"))","v":"3"},{"$f":"IF($AB62=\"\",\"\",SUBSTITUTE(F62,CHAR(160),\"\"))","v":"0.3"},{"$f":"IF($AB62=\"\",\"\",SUBSTITUTE(G62,CHAR(160),\"\"))","v":"15"},{"$f":"IF($AB62=\"\",\"\",SUBSTITUTE(H62,CHAR(160),\"\"))","v":"136"},{"$f":"IF(A62=\"\",\"\",I62)","v":51},{"$f":"IF(A62=\"\",\"\",J62)","v":16.7},{"$f":"IF(B62=\"\",\"\",K62)","v":60.5}]
[3,"x32","RED REBEL",2.4,2,1.6,29,14,6,17.8,152.5,null,5,3,{"$nulls":10},"albury53","3","3","RED REBEL","x32","2.4","2","1.6","29","14",6,17.8,152.5]
[4,355,"GOOD SONG",4.2,2.1,0.8,22,10,4.5999999999999996,16.399999999999999,173,null,5,4,{"$nulls":10},"albury54","4","4","GOOD SONG","355","4.2","2.1","0.8","22","10",4.5999999999999996,16.399999999999999,173]
[5,"x84","SCENERY",4,3,0.6,28.5,14,18,17.899999999999999,87.5,null,5,5,{"$nulls":10},"albury55","5","5","SCENERY","x84","4","3","0.6","28.5","14",18,17.899999999999999,87.5]
[6,0,"SABBATICAL SILK",4.8,3.5,0.4,23,14,10,18,120,null,5,6,{"$nulls":10},"albury56","6","6","SABBATICAL SILK","0","4.8","3.5","0.4","23","14",10,18,120]
[7,"-","SHIVER ME GINGERS",3.8,4,0,0,0,31,null,65.5,null,5,7,{"$nulls":10},"albury57","7","7","SHIVER ME GINGERS","-","3.8","4","0","0","0",31,0,65.5]
[8,20,"BELLE NOIRE",1.3,4.2,0.8,26,6,18,17.3,88.5,null,5,8,{"$nulls":10},"albury58","8","8","BELLE NOIRE","20","1.3","4.2","0.8","26","6",18,17.3,88.5]
[9,8,"CHENARA",1.8,1.9,0.2,14,13,41,17,64.5,null,5,9,{"$nulls":10},"albury59","9","9","CHENARA","8","1.8","1.9","0.2","14","13",41,17,64.5]
[10,644,"BILL SELECTS",2.6,2.4,1.4,30,21,3.5,17.600000000000001,195,null,5,10,{"$nulls":10},"albury510","10","10","BILL SELECTS","644","2.6","2.4","1.4","30","21",3.5,17.600000000000001,195]
[11,644,"TRULY AWESOME",4,3.3,0.8,29,7,14,17.399999999999999,99.5,null,5,11,{"$nulls":10},"albury511","11","11","TRULY AWESOME","644","4","3.3","0.8","29","7",14,17.399999999999999,99.5]
[12,"6x9","BERGAMO",4,4.4000000000000004,0.4,24,14,8.5,17.5,122,null,5,12,{"$nulls":10},"albury512","12","12","BERGAMO","6x9","4","4.4","0.4","24","14",8.5,17.5,122]
[null,"race 6",{"$nulls":10},6]
["Tab","Form L3","Horse","TRat","JRat","API","LSRat","DLR","PR","AFS","BP",null,6,{"$nulls":13},{"$f":"IF($B74=\"\",\"\",A74)","v":"Tab"},{"$f":"IF($A74=\"\",\"\",C74)","v":"Horse"},{"$f":"IF($A74=\"\",\"\",B74)","v":"Form L3"},{"$f":"IF($A74=\"\",\"\",D74)","v":"TRat"},"JRat","API","LSRat","DLR","PR","AFS","BP"]
[1,233,"VITAL GEM",2.5,3.4,1.9,30.5,14,26,17.3,90.5,null,6,{"$f":"IF(F75=\"\",\"\",(IF(ISNUMBER(0+A75),0+A75,0+LEFT(A75,FIND(\"e\",A75)-1))))","v":1},{"$nulls":10},{"$f":"IF(Z75=\"\",\"\",$D$1&M75&AA75)","v":"albury61"},{"$f":"IF(N75=\"\",\"\",N75&O75)","v":"1"},{"$f":"IF(N75=\"\",\"\",SUBSTITUTE(N75,CHAR(160),\"\"))","v":"1"},{"$f":"IF(A75=\"\",\"\",C75)","v":"VITAL GEM"},{"$f":"IF($AB75=\"\",\"\",SUBSTITUTE(B75,CHAR(160),\"\"))","v":"233"},{"$f":"IF($AB75=\"\",\"\",SUBSTITUTE(D75,CHAR(160),\"\"))","v":"2.5"},{"$f":"IF($AB75=\"\",\"\",SUBSTITUTE(E75,CHAR(160),\"\"))","v":"3.4"},{"$f":"IF($AB75=\"\",\"\",SUBSTITUTE(F75,CHAR(160),\"\"))","v":"1.9"},{"$f":"IF($AB75=\"\",\"\",SUBSTITUTE(G75,CHAR(160),\"\"))","v":"30.5"},{"$f":"IF($AB75=\"\",\"\",SUBSTITUTE(H75,CHAR(160),\"\"))","v":"14"},{"$f":"IF(A75=\"\",\"\",I75)","v":26},{"$f":"IF(A75=\"\",\"\",J75)","v":17.3},{"$f":"IF(B75=\"\",\"\",K75)","v":90.5}]
[2,"0x7","ARNRAY",1.9,1.7,3.3,22,14,51,16.600000000000001,78.5,null,6,2,{"$nulls":10},"albury62","2","2","ARNRAY","0x7","1.9","1.7","3.3","22","14",51,16.600000000000001,78.5]
[3,641,"SUPER SALSA",4.4000000000000004,2.2999999999999998,2.1,26,10,13,16.2,107,null,6,3,{"$nulls":10},"albury63","3","3","SUPER SALSA","641","4.4","2.3","2.1","26","10",13,16.2,107]
[4,"x60","LATHAMS WISH",2.2999999999999998,2.4,2.6,21,13,9.5,17.600000000000001,108,null,6,4,{"$nulls":10},"albury64","4","4","LATHAMS WISH","x60","2.3","2.4","2.6","21","13",9.5,17.600000000000001,108]
[5,421,"I LOVE YOUR SMILE",1.8,1.7,4.4000000000000004,30,14,20,17.100000000000001,93.5,null,6,5,{"$nulls":10},"albury65","5","5","I LOVE YOUR SMILE","421","1.8","1.7","4.4","30","14",20,17.100000000000001,93.5]
[6,218,"YONGA LASS",2.2999999999999998,2.1,4.5,30,14,6.5,null,122,null,6,6,{"$nulls":10},"albury66","6","6","YONGA LASS","218","2.3","2.1","4.5","30","14",6.5,0,122]
[7,513,"ADELANTE",2.2000000000000002,3.5,2.4,27.5,13,15,null,102,null,6,7,{"$nulls":10},"albury67","7","7","ADELANTE","513","2.2","3.5","2.4","27.5","13",15,0,102]
[8,177,"DEVIL GIRL",3.4,2.6,2.2000000000000002,21.5,21,71,16.600000000000001,72.5,null,6,8,{"$nulls":10},"albury68","8","8","DEVIL GIRL","177","3.4","2.6","2.2","21.5","21",71,16.600000000000001,72.5]
[9,354,"FLOPPY",3.4,3.9,1.3,30,7,7.5,16.899999999999999,119.5,null,6,9,{"$nulls":10},"albury69","9","9","FLOPPY","354","3.4","3.9","1.3","30","7",7.5,16.899999999999999,119.5]
[10,814,"JOLLY ODD",1.9,2.2000000000000002,1.3,22.5,13,41,17.100000000000001,79,null,6,10,{"$nulls":10},"albury610","10","10","JOLLY ODD","814","1.9","2.2","1.3","22.5","13",41,17.100000000000001,79]
[11,235,"SILVER BUGG",2,2,2.2000000000000002,28.5,34,31,17.3,88.5,null,6,11,{"$nulls":10},"albury611","11","11","SILVER BUGG","235","2","2","2.2","28.5","34",31,17.3,88.5]
[12,782,"VISIONS OF GRACE",2.2999999999999998,4.8,2.7,33.5,14,3.7,17,183.5,null,6,12,{"$nulls":10},"albury612","12","12","VISIONS OF GRACE","782","2.3","4.8","2.7","33.5","14",3.7,17,183.5]
[null,"race 7",{"$nulls":10},7]
["Tab","Form L3","Horse","TRat","JRat","EST","API","DLR","WGT","PR","AGT",null,7,{"$nulls":13},{"$f":"IF($B88=\"\",\"\",A88)","v":"Tab"},{"$f":"IF($A88=\"\",\"\",C88)","v":"Horse"},{"$f":"IF($A88=\"\",\"\",B88)","v":"Form L3"},{"$f":"IF($A88=\"\",\"\",D88)","v":"TRat"},"JRat","EST","API","DLR","WGT","PR","AGT"]
[1,"18x","SURVEILLANCE",1.3,2.4,7.9,32,168,51,17.100000000000001,65.5,null,7,{"$f":"IF(F89=\"\",\"\",(IF(ISNUMBER(0+A89),0+A89,0+LEFT(A89,FIND(\"e\",A89)-1))))","v":1},{"$nulls":10},{"$f":"IF(Z89=\"\",\"\",$D$1&M89&AA89)","v":"albury71"},{"$f":"IF(N89=\"\",\"\",N89&O89)","v":"1"},{"$f":"IF(N89=\"\",\"\",SUBSTITUTE(N89,CHAR(160),\"\"))","v":"1"},{"$f":"IF(A89=\"\",\"\",C89)","v":"SURVEILLANCE"},{"$f":"IF($AB89=\"\",\"\",SUBSTITUTE(B89,CHAR(160),\"\"))","v":"18x"},{"$f":"IF($AB89=\"\",\"\",SUBSTITUTE(D89,CHAR(160),\"\"))","v":"1.3"},{"$f":"IF($AB89=\"\",\"\",SUBSTITUTE(E89,CHAR(160),\"\"))","v":"2.4"},{"$f":"IF($AB89=\"\",\"\",SUBSTITUTE(F89,CHAR(160),\"\"))","v":"7.9"},{"$f":"IF($AB89=\"\",\"\",SUBSTITUTE(G89,CHAR(160),\"\"))","v":"32"},{"$f":"IF($AB89=\"\",\"\",SUBSTITUTE(H89,CHAR(160),\"\"))","v":"168"},{"$f":"IF(A89=\"\",\"\",I89)","v":51},{"$f":"IF(A89=\"\",\"\",J89)","v":17.100000000000001},{"$f":"IF(B89=\"\",\"\",K89)","v":65.5}]
[2,"89x","DOWNFORCE",4,2.5,2.8,33,95,15,17.8,97.5,null,7,2,{"$nulls":10},"albury72","2","2","DOWNFORCE","89x","4","2.5","2.8","33","95",15,17.8,97.5]
[3,"0x6","CHEERFUL MOMENT",4.0999999999999996,3,4.7,34.5,14,21,17.399999999999999,87,null,7,3,{"$nulls":10},"albury73","3","3","CHEERFUL MOMENT","0x6","4.1","3","4.7","34.5","14",21,17.399999999999999,87]
[4,417,"THE GREAT ONE",4.2,1.9,1.8,28.5,19,5,17.600000000000001,158.5,null,7,4,{"$nulls":10},"albury74","4","4","THE GREAT ONE","417","4.2","1.9","1.8","28.5","19",5,17.600000000000001,158.5]
[5,"13x","KAZKAZI",1.9,3.5,2.2999999999999998,39.5,193,31,17.5,76.5,null,7,5,{"$nulls":10},"albury75","5","5","KAZKAZI","13x","1.9","3.5","2.3","39.5","193",31,17.5,76.5]
[6,414,"SESSWA",4.8,2.7,7.1,38,25,3.5,17.5,203.5,null,7,6,{"$nulls":10},"albury76","6","6","SESSWA","414","4.8","2.7","7.1","38","25",3.5,17.5,203.5]
[7,"4x1","WITHOUT REG",2.7,3.9,3.8,37,14,8.5,17.8,128.5,null,7,7,{"$nulls":10},"albury77","7","7","WITHOUT REG","4x1","2.7","3.9","3.8","37","14",8.5,17.8,128.5]
[8,"50x","AVALON BAY",1.9,4.2,0.7,34,123,31,17.600000000000001,76,null,7,8,{"$nulls":10},"albury78","8","8","AVALON BAY","50x","1.9","4.2","0.7","34","123",31,17.600000000000001,76]
[9,556,"AMBERGATE ROSE",1.6,4.4000000000000004,3.2,35.5,21,7,17.600000000000001,130.5,null,7,9,{"$nulls":10},"albury79","9","9","AMBERGATE ROSE","556","1.6","4.4","3.2","35.5","21",7,17.600000000000001,130.5]
[10,123,"DANUBE RIVER",2.2999999999999998,2.2000000000000002,5.5,39,14,11,17.600000000000001,116.5,null,7,10,{"$nulls":10},"albury710","10","10","DANUBE RIVER","123","2.3","2.2","5.5","39","14",11,17.600000000000001,116.5]
[11,"61x","AMJAAD",2,1.9,7.8,39.5,195,91,17.2,55.5,null,7,11,{"$nulls":10},"albury711","11","11","AMJAAD","61x","2","1.9","7.8","39.5","195",91,17.2,55.5]
[12,543,"NORMA STARS",1.9,2.4,1.2,34,28,61,17.5,63.5,null,7,12,{"$nulls":10},"albury712","12","12","NORMA STARS","543","1.9","2.4","1.2","34","28",61,17.5,63.5]
[null,"race 8",{"$nulls":10},8]
["Tab","Form L3","Horse","TRat","JRat","API","LSRat","DLR","PR","AFS","BP",{"$f":"IFERROR(IF(AND(LEFT(A102,FIND(\" \",A102)-1)=\"Race\",LEFT(#REF!,FIND(\" \",#REF!)-1)=\"OF\"),\"Race\",\"\"),\"\")","v":""},8,{"$nulls":11},{"$f":"IF(Z102=\"\",\"\",$D$1&M102&AA102)","v":""},{"$f":"IF(N102=\"\",\"\",N102&O102)","v":""},{"$f":"IF($B102=\"\",\"\",A102)","v":"Tab"},{"$f":"IF($A102=\"\",\"\",C102)","v":"Horse"},{"$f":"IF($A102=\"\",\"\",B102)","v":"Form L3"},{"$f":"IF($A102=\"\",\"\",D102)","v":"TRat"},"JRat","API","LSRat","DLR","PR","AFS","BP"]
[1,"15x","PREPARE FOR CHANGE",2.2999999999999998,3.1,2.8,33,171,41,17.7,75.5,null,8,{"$f":"IF(F103=\"\",\"\",(IF(ISNUMBER(0+A103),0+A103,0+LEFT(A103,FIND(\"e\",A103)-1))))","v":1},{"$nulls":10},"albury81","1",{"$f":"IF(N103=\"\",\"\",SUBSTITUTE(N103,CHAR(160),\"\"))","v":"1"},{"$f":"IF(A103=\"\",\"\",C103)","v":"PREPARE FOR CHANGE"},{"$f":"IF($AB103=\"\",\"\",SUBSTITUTE(B103,CHAR(160),\"\"))","v":"15x"},{"$f":"IF($AB103=\"\",\"\",SUBSTITUTE(D103,CHAR(160),\"\"))","v":"2.3"},{"$f":"IF($AB103=\"\",\"\",SUBSTITUTE(E103,CHAR(160),\"\"))","v":"3.1"},{"$f":"IF($AB103=\"\",\"\",SUBSTITUTE(F103,CHAR(160),\"\"))","v":"2.8"},{"$f":"IF($AB103=\"\",\"\",SUBSTITUTE(G103,CHAR(160),\"\"))","v":"33"},{"$f":"IF($AB103=\"\",\"\",SUBSTITUTE(H103,CHAR(160),\"\"))","v":"171"},{"$f":"IF(A103=\"\",\"\",I103)","v":41},{"$f":"IF(A103=\"\",\"\",J103)","v":17.7},{"$f":"IF(ISNA(VLOOKUP(Z103,$W$1:$X$129,2,0)),\"\",VLOOKUP(Z103,$W$1:$X$129,2,0))","v":""}]
[2,"79x","BLEECKER STREET",3.4,3.3,3.1,32.5,88,13,17.7,106,null,8,2,{"$nulls":10},"albury82","2","2","BLEECKER STREET","79x","3.4","3.3","3.1","32.5","88",13,17.7,""]
[3,"53x","BUCKLAND",1.6,4,3,31.5,291,81,null,61.5,null,8,3,{"$nulls":10},"albury83","3","3","BUCKLAND","53x","1.6","4","3","31.5","291",81,0,""]
[4,"x42","FEDERATION ROCKS",4.0999999999999996,2.4,4.5,31,7,15,17.399999999999999,100,null,8,4,{"$nulls":10},"albury84","4","4","FEDERATION ROCKS","x42","4.1","2.4","4.5","31","7",15,17.399999999999999,""]
[5,"x3x","ALMIGHTY MISS",4,4.4000000000000004,4.7,30.5,174,19,17.5,96,null,8,5,{"$nulls":10},"albury85","5","5","ALMIGHTY MISS","x3x","4","4.4","4.7","30.5","174",19,17.5,""]
[6,"12x","DIRTY CHAI",4.8,2.1,8.6999999999999993,34.5,147,21,17.5,92,null,8,6,{"$nulls":10},"albury86","6","6","DIRTY CHAI","12x","4.8","2.1","8.7","34.5","147",21,17.5,""]
[7,"50x","GRATIAS DEO",2.2999999999999998,3,3.1,21,149,7,17.7,124.5,null,8,7,{"$nulls":10},"albury87","7","7","GRATIAS DEO","50x","2.3","3","3.1","21","149",7,17.7,""]
[8,"14x","SCENIC ECLIPSE",2.2999999999999998,2.9,5.0999999999999996,28,161,4.4000000000000004,17.100000000000001,148,null,8,8,{"$nulls":10},"albury88","8","8","SCENIC ECLIPSE","14x","2.3","2.9","5.1","28","161",4.4000000000000004,17.100000000000001,""]
[9,{"$nulls":11},8,"",{"$nulls":10},"","","",0,"","","","","","",0,0,""]
[10,"05x","BELLE JOURNEE",2,3.5,3.1,19,105,61,17.7,72,null,8,10,{"$nulls":10},"albury810","10","10","BELLE JOURNEE","05x","2","3.5","3.1","19","105",61,17.7,""]
[11,"3x8","MENINA",2.2999999999999998,2.4,1.3,23.5,21,81,17.5,64,null,8,11,{"$nulls":10},"albury811","11","11","MENINA","3x8","2.3","2.4","1.3","23.5","21",81,17.5,""]
[12,"0x8","ANYOLDTIME",3.5,1.9,2,30.5,11,51,17.8,74,null,8,12,{"$nulls":10},"albury812","12","12","ANYOLDTIME","0x8","3.5","1.9","2","30.5","11",51,17.8,""]
[null,"race 9",{"$nulls":10},9]
["Tab","Form L3","Horse","TRat","JRat","API","LSRat","DLR","PR","AFS","BP",null,9,{"$nulls":13},{"$f":"IF($B116=\"\",\"\",A116)","v":"Tab"},{"$f":"IF($A116=\"\",\"\",C116)","v":"Horse"},{"$f":"IF($A116=\"\",\"\",B116)","v":"Form L3"},{"$f":"IF($A116=\"\",\"\",D116)","v":"TRat"},"JRat","API","LSRat","DLR","PR","AFS","BP"]
[{"$nulls":12},9,{"$f":"IF(F117=\"\",\"\",(IF(ISNUMBER(0+A117),0+A117,0+LEFT(A117,FIND(\"e\",A117)-1))))","v":""},{"$nulls":10},{"$f":"IF(Z117=\"\",\"\",$D$1&M117&AA117)","v":""},{"$f":"IF(N117=\"\",\"\",N117&O117)","v":""},{"$f":"IF(N117=\"\",\"\",SUBSTITUTE(N117,CHAR(160),\"\"))","v":""},{"$f":"IF(N117=\"\",\"\",O117)","v":""},{"$f":"IF($AB117=\"\",\"\",SUBSTITUTE(B117,CHAR(160),\"\"))","v":""},{"$f":"IF($AB117=\"\",\"\",SUBSTITUTE(D117,CHAR(160),\"\"))","v":""},{"$f":"IF($AB117=\"\",\"\",SUBSTITUTE(E117,CHAR(160),\"\"))","v":""},{"$f":"IF($AB117=\"\",\"\",SUBSTITUTE(F117,CHAR(160),\"\"))","v":""},{"$f":"IF($AB117=\"\",\"\",SUBSTITUTE(G117,CHAR(160),\"\"))","v":""},{"$f":"IF($AB117=\"\",\"\",SUBSTITUTE(H117,CHAR(160),\"\"))","v":""},{"$f":"IF(A117=\"\",\"\",I117)","v":""},{"$f":"IF(A117=\"\",\"\",J117)","v":""},{"$f":"IF(ISNA(VLOOKUP(Z117,$W$1:$X$129,2,0)),\"\",VLOOKUP(Z117,$W$1:$X$129,2,0))","v":""}]
[{"$nulls":12},9,"",{"$nulls":10},"","","","","","","","","","","","",""]
[{"$nulls":12},9,"",{"$nulls":10},"","","","","","","","","","","","",""]
[{"$nulls":12},9,"",{"$nulls":10},"","","","","","","","","","","","",""]
[{"$nulls":12},9,"",{"$nulls":10},"","","","","","","","","","","","",""]
[{"$nulls":12},9,"",{"$nulls":10},"","","","","","","","","","","","",""]
[{"$nulls":12},9,"",{"$nulls":10},"","","","","","","","","","","","",""]
[{"$nulls":12},9,"",{"$nulls":10},"","","","","","","","","","","","",""]
[{"$nulls":12},9,"",{"$nulls":10},"","","","","","","","","","","","",""]
[{"$nulls":12},9,"",{"$nulls":10},"","","","","","","","","","","","",""]
[{"$nulls":12},9,"",{"$nulls":10},"","","","","","","","","","","","",""]
[{"$nulls":12},9,"",{"$nulls":10},"","","","","","","","","","","","",""]
[{"$nulls":12},9,"",{"$nulls":10},"","","","","","","","","","","","",""]

{"sheet":"test","index":14,"n_rows":71,"n_cols":99,"rows_kept":71,"cut":false,"hidden":false,"merged":[]}
["Runner","Tab No","pts",null,"Bar","pts",null,"Box","pts",null,"HCP","pts",null,"Weight","pts",null,"Conditions",{"$nulls":5},"Condition","R/Figure",null,"Condition","R/Figure",null,"Condition","R/Figure",null,"Condition","R/Figure",null,"W/P",null,"Win%","R/Figure",null,"Place%","R/Figure",null,"Prize/M","A/P/Money",null,"R/Figure",null,null,"L/S","FP","LB","LB","R/Figure","D/S","D/S","D/S","R/Figure",null,"2ND L/S","FP","LB","LB","R/Figure","D/S","D/S","D/S","R/Figure",null,"3RD L/S","FP","LB","LB","R/Figure","D/S","D/S","D/S","R/Figure",null,"Sky Rating","R/Figure",null,"Unitab Rating","R/Figure",null,null,"Rating",{"$f":"MIN(CH2:CH17)","v":{"$error":"#VALUE!"}},{"$f":"(C19+F19+I19+L19+O19+X19+AA19+AD19+AG19+AL19+AO19+AT19+BA19+BE19+BK19+BO19+BU19+BY19+CB19+CE19)*1.1","v":260.26},{"$f":"1-SUM(CK2:CK16)","v":{"$error":"#VALUE!"}},{"$f":"MAX(CI2:CI17)","v":{"$error":"#VALUE!"}},{"$f":"SUM(CM2:CM17)/CK1","v":{"$error":"#VALUE!"}},0.5,{"$f":"SUM(CO2:CO17)","v":{"$error":"#VALUE!"}}]
[{"$f":"IF(B2=\"\",\"\",RacePage!D7)","v":"VITAL GEM"},1,{"$f":"IF($B2=\"\",\"\",IF(ISNA(VLOOKUP(B2,B$14:C$35,2,FALSE)),0,VLOOKUP(B2,B$14:C$35,2,FALSE)))","v":20},null,1,{"$f":"IF($B2=\"\",\"\",IF(ISNA(VLOOKUP(E2,E$21:F$35,2,FALSE)),0,VLOOKUP(E2,E$21:F$35,2,FALSE)))*2","v":21.6},null,1,{"$f":"IF($B2=\"\",\"\",IF(ISNA(VLOOKUP(E2,E$21:F$35,2,FALSE)),0,VLOOKUP(E2,E$21:F$35,2,FALSE)))*2","v":21.6},null,4,{"$f":"IF($B2=\"\",\"\",IF(ISNA(VLOOKUP(K2,K$21:L$45,2,FALSE)),0,VLOOKUP(K2,K$21:L$45,2,FALSE)))","v":0},null,59,{"$f":"IF($B2=\"\",\"\",IF(ISNA(VLOOKUP(N2,N$21:O$71,2,FALSE)),0,VLOOKUP(N2,N$21:O$71,2,FALSE)))","v":2},null,"DW","D","W",null,null,null,{"$f":"IF(R2=\"\",\"\",R2)","v":"D"},{"$f":"IF($B2=\"\",\"\",IF(ISNA(INDEX($X$21:$X$28,MATCH(TRUE,EXACT(W2,$W$21:$W$28),0))),0,INDEX($X$21:$X$28,MATCH(TRUE,EXACT(W2,$W$21:$W$28),0))))","v":5},null,{"$f":"IF(S2=\"\",\"\",S2)","v":"W"},{"$f":"IF($B2=\"\",\"\",IF(ISNA(INDEX($X$21:$X$28,MATCH(TRUE,EXACT(Z2,$W$21:$W$28),0))),0,INDEX($X$21:$X$28,MATCH(TRUE,EXACT(Z2,$W$21:$W$28),0))))","v":0},null,{"$f":"IF(T2=\"\",\"\",T2)","v":""},{"$f":"IF($B2=\"\",\"\",IF(ISNA(INDEX($X$21:$X$28,MATCH(TRUE,EXACT(AC2,$W$21:$W$28),0))),0,INDEX($X$21:$X$28,MATCH(TRUE,EXACT(AC2,$W$21:$W$28),0))))","v":5},null,{"$f":"IF(U2=\"\",\"\",U2)","v":""},{"$f":"IF($B2=\"\",\"\",IF(ISNA(INDEX($X$21:$X$28,MATCH(TRUE,EXACT(AF2,$W$21:$W$28),0))),0,INDEX($X$21:$X$28,MATCH(TRUE,EXACT(AF2,$W$21:$W$28),0))))","v":5},null,"0 Starts 0w 0p",{"$f":"IF($B2=\"\",\"\",RIGHT(AI2,LEN(AI2)-FIND(\"(\",AI2,1)))","v":{"$error":"#VALUE!"}},{"$f":"IF($B2=\"\",\"\",LEFT(AJ2,FIND(\"%\",AJ2)-1))","v":{"$error":"#VALUE!"}},{"$f":"IF($B2=\"\",\"\",IF(ISERROR(AK2),0,IF(ISNA(VLOOKUP(AK2,AK$21:AL$45,2,1)),0,VLOOKUP(AK2,AK$21:AL$45,2,1))))","v":0},null,{"$f":"IF(ISERROR(MID(LEFT(AJ2,FIND(\"p\",AJ2)-2),FIND(\"w\",AJ2)+2,10)),\"\",0+CLEAN(TRIM(MID(LEFT(AJ2,FIND(\"p\",AJ2)-2),FIND(\"w\",AJ2)+2,10))))","v":""},{"$f":"IF($B2=\"\",\"\",IF(ISNA(VLOOKUP(AN2,AN$21:AO$45,2,1)),0,VLOOKUP(AN2,AN$21:AO$45,2,1)))","v":0},null,"1 Starts 1w 0p",{"$f":"IF($B2=\"\",\"\",IF(0+LEFT(AI2,FIND(\" \",AI2)-1)=0,0,AQ2/LEFT(AI2,FIND(\" \",AI2)-1)))","v":0},{"$f":"IF($B2=\"\",\"\",(RANK(AR2,AR$2:AR$15,0)+COUNTIF(AR$2:AR2,AR2)-1))","v":{"$error":"#VALUE!"}},{"$f":"IF($B2=\"\",\"\",IF(ISNA(VLOOKUP(AS2,AS$21:AT$45,2,1)),0,VLOOKUP(AS2,AS$21:AT$45,2,1)))","v":{"$error":"#VALUE!"}},null,"","1/7",{"$f":"IF($B2=\"\",\"\",LEFT(AW2,FIND(\"/\",AW2)-1))","v":"1"},"28.11.13",{"$f":"IF($B2=\"\",\"\",0+LEFT(AY2,LEN(AY2)-1))","v":{"$error":"#VALUE!"}},{"$error":"#VALUE!"},"3Y-CL1",{"$f":"IF($B2=\"\",\"\",SUBSTITUTE(BB2,\".\",\"/\"))","v":"3Y-CL1"},{"$error":"#VALUE!"},{"$f":"IF($B2=\"\",\"\",IF(ISERROR(AX2),0,IF(ISNA(VLOOKUP(BD2,BD$21:BE$45,2,1)),0,VLOOKUP(BD2,BD$21:BE$45,2,1))))","v":{"$error":"#VALUE!"}},null,"1/9",{"$f":"IF($B2=\"\",\"\",LEFT(BG2,FIND(\"/\",BG2)-1))","v":"1"},"16.11.13",{"$f":"IF($B2=\"\",\"\",0+LEFT(BI2,LEN(BI2)-1))","v":{"$error":"#VALUE!"}},{"$error":"#VALUE!"},"MAIDEN",{"$f":"IF($B2=\"\",\"\",SUBSTITUTE(BL2,\".\",\"/\"))","v":"MAIDEN"},{"$error":"#VALUE!"},{"$f":"IF($B2=\"\",\"\",IF(ISERROR(BH2),0,IF(ISNA(VLOOKUP(BN2,BN$21:BO$45,2,1)),0,VLOOKUP(BN2,BN$21:BO$45,2,1))))","v":{"$error":"#VALUE!"}},null,"3/9",{"$f":"IF($B2=\"\",\"\",LEFT(BQ2,FIND(\"/\",BQ2)-1))","v":"3"},"31.10.13",{"$f":"IF($B2=\"\",\"\",0+LEFT(BS2,LEN(BS2)-1))","v":{"$error":"#VALUE!"}},{"$error":"#VALUE!"},"MAIDEN",{"$f":"IF($B2=\"\",\"\",SUBSTITUTE(BV2,\".\",\"/\"))","v":"MAIDEN"},{"$error":"#VALUE!"},{"$f":"IF($B2=\"\",\"\",IF(ISERROR(BR2),0,IF(ISNA(VLOOKUP(BX2,BX$21:BY$45,2,1)),0,VLOOKUP(BX2,BX$21:BY$45,2,1))))","v":{"$error":"#VALUE!"}},null,100,{"$f":"IF($B2=\"\",\"\",IF(CA2<75,0,IF(ISNA(VLOOKUP(CA2,CA$21:CB$45,2,0)),0,VLOOKUP(CA2,CA$21:CB$45,2,0))))","v":20},null,98,{"$f":"IF($B2=\"\",\"\",IF(CD2<75,0,IF(ISNA(VLOOKUP(CD2,CD$21:CE$45,2,0)),0,VLOOKUP(CD2,CD$21:CE$45,2,0))))","v":18},null,null,{"$f":"IF(B2=\"\",\"\",C2+F2+I2+L2+O2+X2+AA2+AD2+AG2+AL2+AO2+AT2+BA2+BE2+BK2+BO2+BU2+BY2+CB2+CE2)","v":{"$error":"#VALUE!"}},{"$f":"IF(CH2=\"\",\"\",IF(CH2=$CI$1,0,CH2-$CI$1))","v":{"$error":"#VALUE!"}},{"$f":"IF(CI2=\"\",\"\",IF(CI2=0,0,CI2+((CI2*CI2*$CN$1)/($CJ$1-$CL$1))))","v":{"$error":"#VALUE!"}},{"$f":"IF(CI2=\"\",\"\",IF( CI2=0,0.02,\"\"))","v":{"$error":"#VALUE!"}},{"$f":"IF($CJ2=\"\",\"\",(RANK(CJ2,CJ$2:CJ$16,0)+COUNTIF(CJ$2:CJ2,CJ2)-1))","v":{"$error":"#VALUE!"}},{"$f":"IF(CL2=\"\",\"\",IF(CL2<24,CJ2,\"\"))","v":{"$error":"#VALUE!"}},{"$f":"IF(CM2=\"\",\"\",CM2/$CM$1)","v":{"$error":"#VALUE!"}},{"$f":"IF(CJ2=0,CK2,IF(AND(CJ2=\"\",CM2=\"\"),\"\",IF(CN2=\"\",CJ2/$EI$1,CN2)))","v":{"$error":"#VALUE!"}},{"$error":"#VALUE!"},{"$f":"IF(B2=\"\",\"\",B2)","v":1},{"$f":"IF($CP2=\"\",\"\",(RANK(CP2,CP$2:CP$16,1)+COUNTIF(CP$2:CP2,CP2)-1))","v":{"$error":"#VALUE!"}},{"$f":"IF($CR2=\"\",\"\",CP2)","v":{"$error":"#VALUE!"}},{"$f":"IF($CR2=\"\",\"\",CJ2)","v":{"$error":"#VALUE!"}},{"$f":"IF($CR2=\"\",\"\",B2&\" \"&A2)","v":{"$error":"#VALUE!"}}]
[{"$f":"IF(B3=\"\",\"\",RacePage!D8)","v":"ARNRAY"},2,{"$f":"IF($B3=\"\",\"\",IF(ISNA(VLOOKUP(B3,B$14:C$35,2,FALSE)),0,VLOOKUP(B3,B$14:C$35,2,FALSE)))","v":19},null,2,{"$f":"IF($B3=\"\",\"\",IF(ISNA(VLOOKUP(E3,E$21:F$35,2,FALSE)),0,VLOOKUP(E3,E$21:F$35,2,FALSE)))*2","v":23.2},null,2,{"$f":"IF($B3=\"\",\"\",IF(ISNA(VLOOKUP(H3,H$21:I$35,2,FALSE)),0,VLOOKUP(H3,H$21:I$35,2,FALSE)))","v":8},null,3,0,null,58,3,null,"tcDW","t","c","D","W",null,{"$f":"IF(R3=\"\",\"\",R3)","v":"t"},{"$f":"IF($B3=\"\",\"\",IF(ISNA(INDEX($X$21:$X$28,MATCH(TRUE,EXACT(W3,$W$21:$W$28),0))),0,INDEX($X$21:$X$28,MATCH(TRUE,EXACT(W3,$W$21:$W$28),0))))","v":3},null,{"$f":"IF(S3=\"\",\"\",S3)","v":"c"},{"$f":"IF($B3=\"\",\"\",IF(ISNA(INDEX($X$21:$X$28,MATCH(TRUE,EXACT(Z3,$W$21:$W$28),0))),0,INDEX($X$21:$X$28,MATCH(TRUE,EXACT(Z3,$W$21:$W$28),0))))","v":3},null,"D",{"$f":"IF($B3=\"\",\"\",IF(ISNA(INDEX($X$21:$X$28,MATCH(TRUE,EXACT(AC3,$W$21:$W$28),0))),0,INDEX($X$21:$X$28,MATCH(TRUE,EXACT(AC3,$W$21:$W$28),0))))","v":5},null,{"$f":"IF(U3=\"\",\"\",U3)","v":"W"},{"$f":"IF($B3=\"\",\"\",IF(ISNA(INDEX($X$21:$X$28,MATCH(TRUE,EXACT(AF3,$W$21:$W$28),0))),0,INDEX($X$21:$X$28,MATCH(TRUE,EXACT(AF3,$W$21:$W$28),0))))","v":0},null,"1 Starts 0w 1p",{"$f":"IF($B3=\"\",\"\",RIGHT(AI3,LEN(AI3)-FIND(\"(\",AI3,1)))","v":{"$error":"#VALUE!"}},{"$f":"IF($B3=\"\",\"\",LEFT(AJ3,FIND(\"%\",AJ3)-1))","v":{"$error":"#VALUE!"}},0,null,{"$f":"IF(ISERROR(MID(LEFT(AJ3,FIND(\"p\",AJ3)-2),FIND(\"w\",AJ3)+2,10)),\"\",0+CLEAN(TRIM(MID(LEFT(AJ3,FIND(\"p\",AJ3)-2),FIND(\"w\",AJ3)+2,10))))","v":""},0,null,"6 Starts 1w 1p",{"$f":"IF($B3=\"\",\"\",IF(0+LEFT(AI3,FIND(\" \",AI3)-1)=0,0,AQ3/LEFT(AI3,FIND(\" \",AI3)-1)))","v":{"$error":"#VALUE!"}},{"$f":"IF($B3=\"\",\"\",(RANK(AR3,AR$2:AR$15,0)+COUNTIF(AR$2:AR3,AR3)-1))","v":{"$error":"#VALUE!"}},{"$error":"#VALUE!"},null,"","6/6",{"$f":"IF($B3=\"\",\"\",LEFT(AW3,FIND(\"/\",AW3)-1))","v":"6"},"30.11.13",{"$f":"IF($B3=\"\",\"\",0+LEFT(AY3,LEN(AY3)-1))","v":{"$error":"#VALUE!"}},{"$error":"#VALUE!"},"3YO-74",{"$f":"IF($B3=\"\",\"\",SUBSTITUTE(BB3,\".\",\"/\"))","v":"3YO-74"},{"$error":"#VALUE!"},{"$error":"#VALUE!"},null,"5/5",{"$f":"IF($B3=\"\",\"\",LEFT(BG3,FIND(\"/\",BG3)-1))","v":"5"},"16.11.13",{"$f":"IF($B3=\"\",\"\",0+LEFT(BI3,LEN(BI3)-1))","v":{"$error":"#VALUE!"}},{"$error":"#VALUE!"},"3YB-73",{"$f":"IF($B3=\"\",\"\",SUBSTITUTE(BL3,\".\",\"/\"))","v":"3YB-73"},{"$error":"#VALUE!"},{"$error":"#VALUE!"},null,"2/5",{"$f":"IF($B3=\"\",\"\",LEFT(BQ3,FIND(\"/\",BQ3)-1))","v":"2"},"30.10.13",{"$f":"IF($B3=\"\",\"\",0+LEFT(BS3,LEN(BS3)-1))","v":{"$error":"#VALUE!"}},{"$error":"#VALUE!"},"3Y-0MW",{"$f":"IF($B3=\"\",\"\",SUBSTITUTE(BV3,\".\",\"/\"))","v":"3Y-0MW"},{"$error":"#VALUE!"},{"$error":"#VALUE!"},null,90,10,null,100,20,null,null,{"$f":"IF(B3=\"\",\"\",C3+F3+I3+L3+O3+X3+AA3+AD3+AG3+AL3+AO3+AT3+BA3+BE3+BK3+BO3+BU3+BY3+CB3+CE3)","v":{"$error":"#VALUE!"}},{"$f":"IF(CH3=\"\",\"\",IF(CH3=$CI$1,0,CH3-$CI$1))","v":{"$error":"#VALUE!"}},{"$f":"IF(CI3=\"\",\"\",IF(CI3=0,0,CI3+((CI3*CI3*$CN$1)/($CJ$1-$CL$1))))","v":{"$error":"#VALUE!"}},{"$f":"IF(CI3=\"\",\"\",IF( CI3=0,0.02,\"\"))","v":{"$error":"#VALUE!"}},{"$f":"IF($CJ3=\"\",\"\",(RANK(CJ3,CJ$2:CJ$16,0)+COUNTIF(CJ$2:CJ3,CJ3)-1))","v":{"$error":"#VALUE!"}},{"$f":"IF(CL3=\"\",\"\",IF(CL3<24,CJ3,\"\"))","v":{"$error":"#VALUE!"}},{"$f":"IF(CM3=\"\",\"\",CM3/$CM$1)","v":{"$error":"#VALUE!"}},{"$f":"IF(CJ3=0,CK3,IF(AND(CJ3=\"\",CM3=\"\"),\"\",IF(CN3=\"\",CJ3/$EI$1,CN3)))","v":{"$error":"#VALUE!"}},{"$error":"#VALUE!"},{"$f":"IF(B3=\"\",\"\",B3)","v":2},{"$f":"IF($CP3=\"\",\"\",(RANK(CP3,CP$2:CP$16,1)+COUNTIF(CP$2:CP3,CP3)-1))","v":{"$error":"#VALUE!"}},{"$f":"IF($CR3=\"\",\"\",CP3)","v":{"$error":"#VALUE!"}},{"$f":"IF($CR3=\"\",\"\",CJ3)","v":{"$error":"#VALUE!"}},{"$f":"IF($CR3=\"\",\"\",B3&\" \"&A3)","v":{"$error":"#VALUE!"}}]
[{"$f":"IF(B4=\"\",\"\",RacePage!D9)","v":"SUPER SALSA"},3,18,null,3,21.6,null,6,0,null,6,0,null,57,3,null,"D","D",{"$nulls":4},"D",{"$f":"IF($B4=\"\",\"\",IF(ISNA(INDEX($X$21:$X$28,MATCH(TRUE,EXACT(W4,$W$21:$W$28),0))),0,INDEX($X$21:$X$28,MATCH(TRUE,EXACT(W4,$W$21:$W$28),0))))","v":5},null,"",{"$f":"IF($B4=\"\",\"\",IF(ISNA(INDEX($X$21:$X$28,MATCH(TRUE,EXACT(Z4,$W$21:$W$28),0))),0,INDEX($X$21:$X$28,MATCH(TRUE,EXACT(Z4,$W$21:$W$28),0))))","v":5},null,"",{"$f":"IF($B4=\"\",\"\",IF(ISNA(INDEX($X$21:$X$28,MATCH(TRUE,EXACT(AC4,$W$21:$W$28),0))),0,INDEX($X$21:$X$28,MATCH(TRUE,EXACT(AC4,$W$21:$W$28),0))))","v":5},null,"",{"$f":"IF($B4=\"\",\"\",IF(ISNA(INDEX($X$21:$X$28,MATCH(TRUE,EXACT(AF4,$W$21:$W$28),0))),0,INDEX($X$21:$X$28,MATCH(TRUE,EXACT(AF4,$W$21:$W$28),0))))","v":5},null,"0 Starts 0w 0p",{"$error":"#VALUE!"},{"$error":"#VALUE!"},0,null,"",0,null,"0 Starts 0w 0p",0,{"$f":"IF($B4=\"\",\"\",(RANK(AR4,AR$2:AR$15,0)+COUNTIF(AR$2:AR4,AR4)-1))","v":{"$error":"#VALUE!"}},{"$error":"#VALUE!"},null,"","1/11","1","30.11.13",{"$error":"#VALUE!"},{"$error":"#VALUE!"},"MAIDEN","MAIDEN",{"$error":"#VALUE!"},{"$error":"#VALUE!"},null,"In Stronger Class FS( ). Warrants some respect on last start win in much weaker company. Last run was 1st 2.3L, Fast 'N' Fortunate at Hawkesbury (Maiden) 1300m. This race suitable.",{"$error":"#VALUE!"},{"$error":"#REF!"},{"$error":"#REF!"},0,{"$error":"#REF!"},{"$error":"#REF!"},{"$error":"#REF!"},0,null,"Expand 4",{"$error":"#VALUE!"},{"$error":"#REF!"},{"$error":"#REF!"},0,{"$error":"#REF!"},{"$error":"#REF!"},{"$error":"#REF!"},0,null,97,17,null,97,17,null,null,{"$error":"#VALUE!"},{"$error":"#VALUE!"},{"$error":"#VALUE!"},{"$error":"#VALUE!"},{"$f":"IF($CJ4=\"\",\"\",(RANK(CJ4,CJ$2:CJ$16,0)+COUNTIF(CJ$2:CJ4,CJ4)-1))","v":{"$error":"#VALUE!"}},{"$error":"#VALUE!"},{"$error":"#VALUE!"},{"$error":"#VALUE!"},{"$error":"#VALUE!"},3,{"$f":"IF($CP4=\"\",\"\",(RANK(CP4,CP$2:CP$16,1)+COUNTIF(CP$2:CP4,CP4)-1))","v":{"$error":"#VALUE!"}},{"$error":"#VALUE!"},{"$error":"#VALUE!"},{"$error":"#VALUE!"}]
[{"$f":"IF(B5=\"\",\"\",RacePage!D10)","v":"LATHAMS WISH"},4,17,null,4,21,null,5,2,null,5,0,null,56.5,3,null,"DW","D","W",null,null,null,"D",{"$f":"IF($B5=\"\",\"\",IF(ISNA(INDEX($X$21:$X$28,MATCH(TRUE,EXACT(W5,$W$21:$W$28),0))),0,INDEX($X$21:$X$28,MATCH(TRUE,EXACT(W5,$W$21:$W$28),0))))","v":5},null,"W",{"$f":"IF($B5=\"\",\"\",IF(ISNA(INDEX($X$21:$X$28,MATCH(TRUE,EXACT(Z5,$W$21:$W$28),0))),0,INDEX($X$21:$X$28,MATCH(TRUE,EXACT(Z5,$W$21:$W$28),0))))","v":0},null,"",{"$f":"IF($B5=\"\",\"\",IF(ISNA(INDEX($X$21:$X$28,MATCH(TRUE,EXACT(AC5,$W$21:$W$28),0))),0,INDEX($X$21:$X$28,MATCH(TRUE,EXACT(AC5,$W$21:$W$28),0))))","v":5},null,"",{"$f":"IF($B5=\"\",\"\",IF(ISNA(INDEX($X$21:$X$28,MATCH(TRUE,EXACT(AF5,$W$21:$W$28),0))),0,INDEX($X$21:$X$28,MATCH(TRUE,EXACT(AF5,$W$21:$W$28),0))))","v":5},null,"0 Starts 0w 0p",{"$error":"#VALUE!"},{"$error":"#VALUE!"},0,null,"",0,null,"0 Starts 0w 0p",0,{"$f":"IF($B5=\"\",\"\",(RANK(AR5,AR$2:AR$15,0)+COUNTIF(AR$2:AR5,AR5)-1))","v":{"$error":"#VALUE!"}},{"$error":"#VALUE!"},null,"","1/14","1","22.11.13",{"$error":"#VALUE!"},{"$error":"#VALUE!"},"3Y-MDN","3Y-MDN",{"$error":"#VALUE!"},{"$error":"#VALUE!"},null,"2/10","2","03.11.13",{"$error":"#VALUE!"},{"$error":"#VALUE!"},"3Y-MDN","3Y-MDN",{"$error":"#VALUE!"},{"$error":"#VALUE!"},null,"In Stronger Class FS(3.5). Fitter for recent racing and a winner in this distance range. Last run ran strongly 1st 1L, Vite Loni at Hawkesbury (3Y-Maiden) 1300m. Two runs back tightened when 2nd 3.5L, Shout To The Top at Goulburn (3Y-Maiden) 1200m. Good prospects.",{"$error":"#VALUE!"},{"$error":"#REF!"},{"$error":"#REF!"},0,{"$error":"#REF!"},{"$error":"#REF!"},{"$error":"#REF!"},0,null,89,9,null,98,18,null,null,{"$error":"#VALUE!"},{"$error":"#VALUE!"},{"$error":"#VALUE!"},{"$error":"#VALUE!"},{"$f":"IF($CJ5=\"\",\"\",(RANK(CJ5,CJ$2:CJ$16,0)+COUNTIF(CJ$2:CJ5,CJ5)-1))","v":{"$error":"#VALUE!"}},{"$error":"#VALUE!"},{"$error":"#VALUE!"},{"$error":"#VALUE!"},{"$error":"#VALUE!"},4,{"$f":"IF($CP5=\"\",\"\",(RANK(CP5,CP$2:CP$16,1)+COUNTIF(CP$2:CP5,CP5)-1))","v":{"$error":"#VALUE!"}},{"$error":"#VALUE!"},{"$error":"#VALUE!"},{"$error":"#VALUE!"}]
[{"$f":"IF(B6=\"\",\"\",RacePage!D11)","v":"I LOVE YOUR SMILE"},5,16,null,5,22.2,null,9,0,null,9,0,null,56,3,null,"",{"$nulls":5},"",{"$f":"IF($B6=\"\",\"\",IF(ISNA(INDEX($X$21:$X$28,MATCH(TRUE,EXACT(W6,$W$21:$W$28),0))),0,INDEX($X$21:$X$28,MATCH(TRUE,EXACT(W6,$W$21:$W$28),0))))","v":5},null,"",{"$f":"IF($B6=\"\",\"\",IF(ISNA(INDEX($X$21:$X$28,MATCH(TRUE,EXACT(Z6,$W$21:$W$28),0))),0,INDEX($X$21:$X$28,MATCH(TRUE,EXACT(Z6,$W$21:$W$28),0))))","v":5},null,"",{"$f":"IF($B6=\"\",\"\",IF(ISNA(INDEX($X$21:$X$28,MATCH(TRUE,EXACT(AC6,$W$21:$W$28),0))),0,INDEX($X$21:$X$28,MATCH(TRUE,EXACT(AC6,$W$21:$W$28),0))))","v":5},null,"",{"$f":"IF($B6=\"\",\"\",IF(ISNA(INDEX($X$21:$X$28,MATCH(TRUE,EXACT(AF6,$W$21:$W$28),0))),0,INDEX($X$21:$X$28,MATCH(TRUE,EXACT(AF6,$W$21:$W$28),0))))","v":5},null,"0 Starts 0w 0p",{"$error":"#VALUE!"},{"$error":"#VALUE!"},0,null,"",0,null,"1 Starts 0w 1p",0,{"$f":"IF($B6=\"\",\"\",(RANK(AR6,AR$2:AR$15,0)+COUNTIF(AR$2:AR6,AR6)-1))","v":{"$error":"#VALUE!"}},{"$error":"#VALUE!"},null,"","3/7","3","27.11.13",{"$error":"#VALUE!"},{"$error":"#VALUE!"},"3Y-MDN","3Y-MDN",{"$error":"#VALUE!"},{"$error":"#VALUE!"},null,"In Stronger Class FS(1.5). Last start checked early when 3rd 2.8L, Lofty Ambition at Canterbury (3Y-Maiden) 1250m. Place preferred.",{"$error":"#VALUE!"},{"$error":"#REF!"},{"$error":"#REF!"},0,{"$error":"#REF!"},{"$error":"#REF!"},{"$error":"#REF!"},0,null,"Expand 6",{"$error":"#VALUE!"},{"$error":"#REF!"},{"$error":"#REF!"},0,{"$error":"#REF!"},{"$error":"#REF!"},{"$error":"#REF!"},0,null,76,0,null,96,16,null,null,{"$error":"#VALUE!"},{"$error":"#VALUE!"},{"$error":"#VALUE!"},{"$error":"#VALUE!"},{"$f":"IF($CJ6=\"\",\"\",(RANK(CJ6,CJ$2:CJ$16,0)+COUNTIF(CJ$2:CJ6,CJ6)-1))","v":{"$error":"#VALUE!"}},{"$error":"#VALUE!"},{"$error":"#VALUE!"},{"$error":"#VALUE!"},{"$error":"#VALUE!"},5,{"$f":"IF($CP6=\"\",\"\",(RANK(CP6,CP$2:CP$16,1)+COUNTIF(CP$2:CP6,CP6)-1))","v":{"$error":"#VALUE!"}},{"$error":"#VALUE!"},{"$error":"#VALUE!"},{"$error":"#VALUE!"}]
[{"$f":"IF(B7=\"\",\"\",RacePage!D12)","v":"YONGA LASS"},6,15,null,6,21.2,null,8,0,null,8,0,null,54.5,2,null,"",{"$nulls":5},"",{"$f":"IF($B7=\"\",\"\",IF(ISNA(INDEX($X$21:$X$28,MATCH(TRUE,EXACT(W7,$W$21:$W$28),0))),0,INDEX($X$21:$X$28,MATCH(TRUE,EXACT(W7,$W$21:$W$28),0))))","v":5},null,"",{"$f":"IF($B7=\"\",\"\",IF(ISNA(INDEX($X$21:$X$28,MATCH(TRUE,EXACT(Z7,$W$21:$W$28),0))),0,INDEX($X$21:$X$28,MATCH(TRUE,EXACT(Z7,$W$21:$W$28),0))))","v":5},null,"",{"$f":"IF($B7=\"\",\"\",IF(ISNA(INDEX($X$21:$X$28,MATCH(TRUE,EXACT(AC7,$W$21:$W$28),0))),0,INDEX($X$21:$X$28,MATCH(TRUE,EXACT(AC7,$W$21:$W$28),0))))","v":5},null,"",{"$f":"IF($B7=\"\",\"\",IF(ISNA(INDEX($X$21:$X$28,MATCH(TRUE,EXACT(AF7,$W$21:$W$28),0))),0,INDEX($X$21:$X$28,MATCH(TRUE,EXACT(AF7,$W$21:$W$28),0))))","v":5},null,"1 Starts 0w 0p",{"$error":"#VALUE!"},{"$error":"#VALUE!"},0,null,"",0,null,"1 Starts 0w 1p",{"$error":"#VALUE!"},{"$f":"IF($B7=\"\",\"\",(RANK(AR7,AR$2:AR$15,0)+COUNTIF(AR$2:AR7,AR7)-1))","v":{"$error":"#VALUE!"}},{"$error":"#VALUE!"},null,"","3/10","3","28.11.13",{"$error":"#VALUE!"},{"$error":"#VALUE!"},"MAIDEN","MAIDEN",{"$error":"#VALUE!"},{"$error":"#VALUE!"},null,"3/5","3","15.11.13",{"$error":"#VALUE!"},{"$error":"#VALUE!"},"3YB-66","3YB-66",{"$error":"#VALUE!"},{"$error":"#VALUE!"},null,"9/11","9","05.11.13",{"$error":"#VALUE!"},{"$error":"#VALUE!"},"3Y-MDN","3Y-MDN",{"$error":"#VALUE!"},{"$error":"#VALUE!"},null,80,0,null,95,15,null,null,{"$error":"#VALUE!"},{"$error":"#VALUE!"},{"$error":"#VALUE!"},{"$error":"#VALUE!"},{"$f":"IF($CJ7=\"\",\"\",(RANK(CJ7,CJ$2:CJ$16,0)+COUNTIF(CJ$2:CJ7,CJ7)-1))","v":{"$error":"#VALUE!"}},{"$error":"#VALUE!"},{"$error":"#VALUE!"},{"$error":"#VALUE!"},{"$error":"#VALUE!"},6,{"$f":"IF($CP7=\"\",\"\",(RANK(CP7,CP$2:CP$16,1)+COUNTIF(CP$2:CP7,CP7)-1))","v":{"$error":"#VALUE!"}},{"$error":"#VALUE!"},{"$error":"#VALUE!"},{"$error":"#VALUE!"}]
[{"$f":"IF(B8=\"\",\"\",RacePage!D13)","v":"ADELANTE"},7,10,null,7,17.2,null,1,10,null,1,0,null,54.5,2,null,"DW","D","W",null,null,null,"D",{"$f":"IF($B8=\"\",\"\",IF(ISNA(INDEX($X$21:$X$28,MATCH(TRUE,EXACT(W8,$W$21:$W$28),0))),0,INDEX($X$21:$X$28,MATCH(TRUE,EXACT(W8,$W$21:$W$28),0))))","v":5},null,"W",{"$f":"IF($B8=\"\",\"\",IF(ISNA(INDEX($X$21:$X$28,MATCH(TRUE,EXACT(Z8,$W$21:$W$28),0))),0,INDEX($X$21:$X$28,MATCH(TRUE,EXACT(Z8,$W$21:$W$28),0))))","v":0},null,"",{"$f":"IF($B8=\"\",\"\",IF(ISNA(INDEX($X$21:$X$28,MATCH(TRUE,EXACT(AC8,$W$21:$W$28),0))),0,INDEX($X$21:$X$28,MATCH(TRUE,EXACT(AC8,$W$21:$W$28),0))))","v":5},null,"",{"$f":"IF($B8=\"\",\"\",IF(ISNA(INDEX($X$21:$X$28,MATCH(TRUE,EXACT(AF8,$W$21:$W$28),0))),0,INDEX($X$21:$X$28,MATCH(TRUE,EXACT(AF8,$W$21:$W$28),0))))","v":5},null,"0 Starts 0w 0p",{"$error":"#VALUE!"},{"$error":"#VALUE!"},0,null,"",0,null,"1 Starts 0w 1p",0,{"$f":"IF($B8=\"\",\"\",(RANK(AR8,AR$2:AR$15,0)+COUNTIF(AR$2:AR8,AR8)-1))","v":{"$error":"#VALUE!"}},{"$error":"#VALUE!"},null,"","3/7","3","28.11.13",{"$error":"#VALUE!"},{"$error":"#VALUE!"},"3Y-CL1","3Y-CL1",{"$error":"#VALUE!"},{"$error":"#VALUE!"},null,"1/8","1","16.11.13",{"$error":"#VALUE!"},{"$error":"#VALUE!"},"FM-MDN","FM-MDN",{"$error":"#VALUE!"},{"$error":"#VALUE!"},null,"6/10","6","03.11.13",{"$error":"#VALUE!"},{"$error":"#VALUE!"},"3Y-MDN","3Y-MDN",{"$error":"#VALUE!"},{"$error":"#VALUE!"},null,84,4,null,96,16,null,null,{"$error":"#VALUE!"},{"$error":"#VALUE!"},{"$error":"#VALUE!"},{"$error":"#VALUE!"},{"$f":"IF($CJ8=\"\",\"\",(RANK(CJ8,CJ$2:CJ$16,0)+COUNTIF(CJ$2:CJ8,CJ8)-1))","v":{"$error":"#VALUE!"}},{"$error":"#VALUE!"},{"$error":"#VALUE!"},{"$error":"#VALUE!"},{"$error":"#VALUE!"},7,{"$f":"IF($CP8=\"\",\"\",(RANK(CP8,CP$2:CP$16,1)+COUNTIF(CP$2:CP8,CP8)-1))","v":{"$error":"#VALUE!"}},{"$error":"#VALUE!"},{"$error":"#VALUE!"},{"$error":"#VALUE!"}]
[{"$f":"IF(B9=\"\",\"\",RacePage!D14)","v":"DEVIL GIRL"},8,9,null,8,18,null,7,0,null,7,0,null,54,2,null,"D","D",{"$nulls":4},"D",{"$f":"IF($B9=\"\",\"\",IF(ISNA(INDEX($X$21:$X$28,MATCH(TRUE,EXACT(W9,$W$21:$W$28),0))),0,INDEX($X$21:$X$28,MATCH(TRUE,EXACT(W9,$W$21:$W$28),0))))","v":5},null,"",{"$f":"IF($B9=\"\",\"\",IF(ISNA(INDEX($X$21:$X$28,MATCH(TRUE,EXACT(Z9,$W$21:$W$28),0))),0,INDEX($X$21:$X$28,MATCH(TRUE,EXACT(Z9,$W$21:$W$28),0))))","v":5},null,"",{"$f":"IF($B9=\"\",\"\",IF(ISNA(INDEX($X$21:$X$28,MATCH(TRUE,EXACT(AC9,$W$21:$W$28),0))),0,INDEX($X$21:$X$28,MATCH(TRUE,EXACT(AC9,$W$21:$W$28),0))))","v":5},null,"",{"$f":"IF($B9=\"\",\"\",IF(ISNA(INDEX($X$21:$X$28,MATCH(TRUE,EXACT(AF9,$W$21:$W$28),0))),0,INDEX($X$21:$X$28,MATCH(TRUE,EXACT(AF9,$W$21:$W$28),0))))","v":5},null,"0 Starts 0w 0p",{"$error":"#VALUE!"},{"$error":"#VALUE!"},0,null,"",0,null,"1 Starts 1w 0p",0,{"$f":"IF($B9=\"\",\"\",(RANK(AR9,AR$2:AR$15,0)+COUNTIF(AR$2:AR9,AR9)-1))","v":{"$error":"#VALUE!"}},{"$error":"#VALUE!"},null,"","9/9","9","23.11.13",{"$error":"#VALUE!"},{"$error":"#VALUE!"},"BM-60","BM-60",{"$error":"#VALUE!"},{"$error":"#VALUE!"},null,"1/14","1","27.09.13",{"$error":"#VALUE!"},{"$error":"#VALUE!"},"MAIDEN","MAIDEN",{"$error":"#VALUE!"},{"$error":"#VALUE!"},null,"8/11","8","03.09.13",{"$error":"#VALUE!"},{"$error":"#VALUE!"},"3Y-MDN","3Y-MDN",{"$error":"#VALUE!"},{"$error":"#VALUE!"},null,72,0,null,95,15,null,null,{"$error":"#VALUE!"},{"$error":"#VALUE!"},{"$error":"#VALUE!"},{"$error":"#VALUE!"},{"$f":"IF($CJ9=\"\",\"\",(RANK(CJ9,CJ$2:CJ$16,0)+COUNTIF(CJ$2:CJ9,CJ9)-1))","v":{"$error":"#VALUE!"}},{"$error":"#VALUE!"},{"$error":"#VALUE!"},{"$error":"#VALUE!"},{"$error":"#VALUE!"},8,{"$f":"IF($CP9=\"\",\"\",(RANK(CP9,CP$2:CP$16,1)+COUNTIF(CP$2:CP9,CP9)-1))","v":{"$error":"#VALUE!"}},{"$error":"#VALUE!"},{"$error":"#VALUE!"},{"$error":"#VALUE!"}]
[{"$f":"IF(B10=\"\",\"\",RacePage!D15)","v":"FLOPPY"},9,8,null,9,16.600000000000001,null,2,8,null,2,0,null,54,2,null,"",{"$nulls":5},"",{"$f":"IF($B10=\"\",\"\",IF(ISNA(INDEX($X$21:$X$28,MATCH(TRUE,EXACT(W10,$W$21:$W$28),0))),0,INDEX($X$21:$X$28,MATCH(TRUE,EXACT(W10,$W$21:$W$28),0))))","v":5},null,"",{"$f":"IF($B10=\"\",\"\",IF(ISNA(INDEX($X$21:$X$28,MATCH(TRUE,EXACT(Z10,$W$21:$W$28),0))),0,INDEX($X$21:$X$28,MATCH(TRUE,EXACT(Z10,$W$21:$W$28),0))))","v":5},null,"",{"$f":"IF($B10=\"\",\"\",IF(ISNA(INDEX($X$21:$X$28,MATCH(TRUE,EXACT(AC10,$W$21:$W$28),0))),0,INDEX($X$21:$X$28,MATCH(TRUE,EXACT(AC10,$W$21:$W$28),0))))","v":5},null,"",{"$f":"IF($B10=\"\",\"\",IF(ISNA(INDEX($X$21:$X$28,MATCH(TRUE,EXACT(AF10,$W$21:$W$28),0))),0,INDEX($X$21:$X$28,MATCH(TRUE,EXACT(AF10,$W$21:$W$28),0))))","v":5},null,"1 Starts 0w 0p",{"$error":"#VALUE!"},{"$error":"#VALUE!"},0,null,"",0,null,"0 Starts 0w 0p",{"$error":"#VALUE!"},{"$f":"IF($B10=\"\",\"\",(RANK(AR10,AR$2:AR$15,0)+COUNTIF(AR$2:AR10,AR10)-1))","v":{"$error":"#VALUE!"}},{"$error":"#VALUE!"},null,"","5/9","5","22.11.13",{"$error":"#VALUE!"},{"$error":"#VALUE!"},"MAIDEN","MAIDEN",{"$error":"#VALUE!"},{"$error":"#VALUE!"},null,"9/11","9","16.05.13",{"$error":"#VALUE!"},{"$error":"#VALUE!"},"2Y-MDN","2Y-MDN",{"$error":"#VALUE!"},{"$error":"#VALUE!"},null,"12/12","12","01.05.13",{"$error":"#VALUE!"},{"$error":"#VALUE!"},"2Y-MDN","2Y-MDN",{"$error":"#VALUE!"},{"$error":"#VALUE!"},null,66,0,null,93,13,null,null,{"$error":"#VALUE!"},{"$error":"#VALUE!"},{"$error":"#VALUE!"},{"$error":"#VALUE!"},{"$f":"IF($CJ10=\"\",\"\",(RANK(CJ10,CJ$2:CJ$16,0)+COUNTIF(CJ$2:CJ10,CJ10)-1))","v":{"$error":"#VALUE!"}},{"$error":"#VALUE!"},{"$error":"#VALUE!"},{"$error":"#VALUE!"},{"$error":"#VALUE!"},9,{"$f":"IF($CP10=\"\",\"\",(RANK(CP10,CP$2:CP$16,1)+COUNTIF(CP$2:CP10,CP10)-1))","v":{"$error":"#VALUE!"}},{"$error":"#VALUE!"},{"$error":"#VALUE!"},{"$error":"#VALUE!"}]
[{"$f":"IF(B11=\"\",\"\",RacePage!D16)","v":"JOLLY ODD"},10,{"$f":"IF($B11=\"\",\"\",IF(ISNA(VLOOKUP(B11,B$14:C$35,2,FALSE)),0,VLOOKUP(B11,B$14:C$35,2,FALSE)))","v":7},null,10,16.8,null,"",0,null,"",0,null,"",0,null,"",{"$nulls":5},"",{"$f":"IF($B11=\"\",\"\",IF(ISNA(INDEX($X$21:$X$28,MATCH(TRUE,EXACT(W11,$W$21:$W$28),0))),0,INDEX($X$21:$X$28,MATCH(TRUE,EXACT(W11,$W$21:$W$28),0))))","v":5},null,"",{"$f":"IF($B11=\"\",\"\",IF(ISNA(INDEX($X$21:$X$28,MATCH(TRUE,EXACT(Z11,$W$21:$W$28),0))),0,INDEX($X$21:$X$28,MATCH(TRUE,EXACT(Z11,$W$21:$W$28),0))))","v":5},null,"",{"$f":"IF($B11=\"\",\"\",IF(ISNA(INDEX($X$21:$X$28,MATCH(TRUE,EXACT(AC11,$W$21:$W$28),0))),0,INDEX($X$21:$X$28,MATCH(TRUE,EXACT(AC11,$W$21:$W$28),0))))","v":5},null,"",{"$f":"IF($B11=\"\",\"\",IF(ISNA(INDEX($X$21:$X$28,MATCH(TRUE,EXACT(AF11,$W$21:$W$28),0))),0,INDEX($X$21:$X$28,MATCH(TRUE,EXACT(AF11,$W$21:$W$28),0))))","v":5},null,"",{"$error":"#VALUE!"},{"$error":"#VALUE!"},0,null,"",0,null,"",{"$error":"#VALUE!"},{"$f":"IF($B11=\"\",\"\",(RANK(AR11,AR$2:AR$15,0)+COUNTIF(AR$2:AR11,AR11)-1))","v":{"$error":"#VALUE!"}},{"$error":"#VALUE!"},null,"","",{"$error":"#VALUE!"},"",{"$error":"#VALUE!"},"","","","",0,null,"",{"$error":"#VALUE!"},"",{"$error":"#VALUE!"},"","","","",0,null,"",{"$error":"#VALUE!"},"",{"$error":"#VALUE!"},"","","","",0,null,"",0,null,"",0,null,null,{"$error":"#VALUE!"},{"$error":"#VALUE!"},{"$error":"#VALUE!"},{"$error":"#VALUE!"},{"$f":"IF($CJ11=\"\",\"\",(RANK(CJ11,CJ$2:CJ$16,0)+COUNTIF(CJ$2:CJ11,CJ11)-1))","v":{"$error":"#VALUE!"}},{"$error":"#VALUE!"},{"$error":"#VALUE!"},{"$error":"#VALUE!"},"",10,{"$f":"IF($CP11=\"\",\"\",(RANK(CP11,CP$2:CP$16,1)+COUNTIF(CP$2:CP11,CP11)-1))","v":""},"","",""]
[{"$f":"IF(B12=\"\",\"\",RacePage!D17)","v":"working"},11,6,null,11,14.8,null,"",0,null,"",0,null,"",0,null,"",{"$nulls":5},"",{"$f":"IF($B12=\"\",\"\",IF(ISNA(INDEX($X$21:$X$28,MATCH(TRUE,EXACT(W12,$W$21:$W$28),0))),0,INDEX($X$21:$X$28,MATCH(TRUE,EXACT(W12,$W$21:$W$28),0))))","v":5},null,"",{"$f":"IF($B12=\"\",\"\",IF(ISNA(INDEX($X$21:$X$28,MATCH(TRUE,EXACT(Z12,$W$21:$W$28),0))),0,INDEX($X$21:$X$28,MATCH(TRUE,EXACT(Z12,$W$21:$W$28),0))))","v":5},null,"",{"$f":"IF($B12=\"\",\"\",IF(ISNA(INDEX($X$21:$X$28,MATCH(TRUE,EXACT(AC12,$W$21:$W$28),0))),0,INDEX($X$21:$X$28,MATCH(TRUE,EXACT(AC12,$W$21:$W$28),0))))","v":5},null,"",{"$f":"IF($B12=\"\",\"\",IF(ISNA(INDEX($X$21:$X$28,MATCH(TRUE,EXACT(AF12,$W$21:$W$28),0))),0,INDEX($X$21:$X$28,MATCH(TRUE,EXACT(AF12,$W$21:$W$28),0))))","v":5},null,"",{"$error":"#VALUE!"},{"$error":"#VALUE!"},0,null,"",0,null,"",{"$error":"#VALUE!"},{"$f":"IF($B12=\"\",\"\",(RANK(AR12,AR$2:AR$15,0)+COUNTIF(AR$2:AR12,AR12)-1))","v":{"$error":"#VALUE!"}},{"$error":"#VALUE!"},null,"","",{"$error":"#VALUE!"},"",{"$error":"#VALUE!"},"","","","",0,null,"",{"$error":"#VALUE!"},"",{"$error":"#VALUE!"},"","","","",0,null,"",{"$error":"#VALUE!"},"",{"$error":"#VALUE!"},"","","","",0,null,"",0,null,"",0,null,null,{"$error":"#VALUE!"},{"$error":"#VALUE!"},{"$error":"#VALUE!"},{"$error":"#VALUE!"},{"$f":"IF($CJ12=\"\",\"\",(RANK(CJ12,CJ$2:CJ$16,0)+COUNTIF(CJ$2:CJ12,CJ12)-1))","v":{"$error":"#VALUE!"}},{"$error":"#VALUE!"},{"$error":"#VALUE!"},{"$error":"#VALUE!"},"",11,{"$f":"IF($CP12=\"\",\"\",(RANK(CP12,CP$2:CP$16,1)+COUNTIF(CP$2:CP12,CP12)-1))","v":""},"","",""]
[{"$f":"IF(B13=\"\",\"\",RacePage!D18)","v":"VISIONS OF GRACE"},12,5,null,12,13.6,null,"",0,null,"",0,null,"",0,null,"",{"$nulls":5},"",{"$f":"IF($B13=\"\",\"\",IF(ISNA(INDEX($X$21:$X$28,MATCH(TRUE,EXACT(W13,$W$21:$W$28),0))),0,INDEX($X$21:$X$28,MATCH(TRUE,EXACT(W13,$W$21:$W$28),0))))","v":5},null,"",{"$f":"IF($B13=\"\",\"\",IF(ISNA(INDEX($X$21:$X$28,MATCH(TRUE,EXACT(Z13,$W$21:$W$28),0))),0,INDEX($X$21:$X$28,MATCH(TRUE,EXACT(Z13,$W$21:$W$28),0))))","v":5},null,"",{"$f":"IF($B13=\"\",\"\",IF(ISNA(INDEX($X$21:$X$28,MATCH(TRUE,EXACT(AC13,$W$21:$W$28),0))),0,INDEX($X$21:$X$28,MATCH(TRUE,EXACT(AC13,$W$21:$W$28),0))))","v":5},null,"",{"$f":"IF($B13=\"\",\"\",IF(ISNA(INDEX($X$21:$X$28,MATCH(TRUE,EXACT(AF13,$W$21:$W$28),0))),0,INDEX($X$21:$X$28,MATCH(TRUE,EXACT(AF13,$W$21:$W$28),0))))","v":5},null,"",{"$error":"#VALUE!"},{"$error":"#VALUE!"},0,null,"",0,null,"",{"$error":"#VALUE!"},{"$f":"IF($B13=\"\",\"\",(RANK(AR13,AR$2:AR$15,0)+COUNTIF(AR$2:AR13,AR13)-1))","v":{"$error":"#VALUE!"}},{"$error":"#VALUE!"},null,"","",{"$error":"#VALUE!"},"",{"$error":"#VALUE!"},"","","","",0,null,"",{"$error":"#VALUE!"},"",{"$error":"#VALUE!"},"","","","",0,null,"",{"$error":"#VALUE!"},"",{"$error":"#VALUE!"},"","","","",0,null,"",0,null,"",0,null,null,{"$error":"#VALUE!"},{"$error":"#VALUE!"},{"$error":"#VALUE!"},{"$error":"#VALUE!"},{"$f":"IF($CJ13=\"\",\"\",(RANK(CJ13,CJ$2:CJ$16,0)+COUNTIF(CJ$2:CJ13,CJ13)-1))","v":{"$error":"#VALUE!"}},{"$error":"#VALUE!"},{"$error":"#VALUE!"},{"$error":"#VALUE!"},"",12,{"$f":"IF($CP13=\"\",\"\",(RANK(CP13,CP$2:CP$16,1)+COUNTIF(CP$2:CP13,CP13)-1))","v":""},"","",""]
[{"$f":"IF(B14=\"\",\"\",RacePage!D19)","v":""},13,{"$f":"IF($B14=\"\",\"\",IF(ISNA(VLOOKUP(B14,B$14:C$35,2,FALSE)),0,VLOOKUP(B14,B$14:C$35,2,FALSE)))","v":""},null,13,11.8,null,"",0,null,"",0,null,"",0,null,"",{"$nulls":5},"",{"$f":"IF($B14=\"\",\"\",IF(ISNA(INDEX($X$21:$X$28,MATCH(TRUE,EXACT(W14,$W$21:$W$28),0))),0,INDEX($X$21:$X$28,MATCH(TRUE,EXACT(W14,$W$21:$W$28),0))))","v":5},null,"",{"$f":"IF($B14=\"\",\"\",IF(ISNA(INDEX($X$21:$X$28,MATCH(TRUE,EXACT(Z14,$W$21:$W$28),0))),0,INDEX($X$21:$X$28,MATCH(TRUE,EXACT(Z14,$W$21:$W$28),0))))","v":5},null,"",{"$f":"IF($B14=\"\",\"\",IF(ISNA(INDEX($X$21:$X$28,MATCH(TRUE,EXACT(AC14,$W$21:$W$28),0))),0,INDEX($X$21:$X$28,MATCH(TRUE,EXACT(AC14,$W$21:$W$28),0))))","v":5},null,"",{"$f":"IF($B14=\"\",\"\",IF(ISNA(INDEX($X$21:$X$28,MATCH(TRUE,EXACT(AF14,$W$21:$W$28),0))),0,INDEX($X$21:$X$28,MATCH(TRUE,EXACT(AF14,$W$21:$W$28),0))))","v":5},null,"",{"$error":"#VALUE!"},{"$error":"#VALUE!"},0,null,"",0,null,"",{"$error":"#VALUE!"},{"$f":"IF($B14=\"\",\"\",(RANK(AR14,AR$2:AR$15,0)+COUNTIF(AR$2:AR14,AR14)-1))","v":{"$error":"#VALUE!"}},{"$error":"#VALUE!"},null,"","",{"$error":"#VALUE!"},"",{"$error":"#VALUE!"},"","","","",0,null,"",{"$error":"#VALUE!"},"",{"$error":"#VALUE!"},"","","","",0,null,"",{"$error":"#VALUE!"},"",{"$error":"#VALUE!"},"","","","",0,null,"",0,null,"",0,null,null,"","","","",{"$f":"IF($CJ14=\"\",\"\",(RANK(CJ14,CJ$2:CJ$16,0)+COUNTIF(CJ$2:CJ14,CJ14)-1))","v":""},"","","","",13,{"$f":"IF($CP14=\"\",\"\",(RANK(CP14,CP$2:CP$16,1)+COUNTIF(CP$2:CP14,CP14)-1))","v":""},"","",""]
[{"$f":"IF(B15=\"\",\"\",RacePage!D20)","v":0},14,"",null,14,12,null,"",0,null,"",0,null,"",0,null,"",{"$nulls":5},"",{"$f":"IF($B15=\"\",\"\",IF(ISNA(INDEX($X$21:$X$28,MATCH(TRUE,EXACT(W15,$W$21:$W$28),0))),0,INDEX($X$21:$X$28,MATCH(TRUE,EXACT(W15,$W$21:$W$28),0))))","v":5},null,"",{"$f":"IF($B15=\"\",\"\",IF(ISNA(INDEX($X$21:$X$28,MATCH(TRUE,EXACT(Z15,$W$21:$W$28),0))),0,INDEX($X$21:$X$28,MATCH(TRUE,EXACT(Z15,$W$21:$W$28),0))))","v":5},null,"",{"$f":"IF($B15=\"\",\"\",IF(ISNA(INDEX($X$21:$X$28,MATCH(TRUE,EXACT(AC15,$W$21:$W$28),0))),0,INDEX($X$21:$X$28,MATCH(TRUE,EXACT(AC15,$W$21:$W$28),0))))","v":5},null,"",{"$f":"IF($B15=\"\",\"\",IF(ISNA(INDEX($X$21:$X$28,MATCH(TRUE,EXACT(AF15,$W$21:$W$28),0))),0,INDEX($X$21:$X$28,MATCH(TRUE,EXACT(AF15,$W$21:$W$28),0))))","v":5},null,"",{"$error":"#VALUE!"},{"$error":"#VALUE!"},0,null,"",0,null,"",{"$error":"#VALUE!"},{"$f":"IF($B15=\"\",\"\",(RANK(AR15,AR$2:AR$15,0)+COUNTIF(AR$2:AR15,AR15)-1))","v":{"$error":"#VALUE!"}},{"$error":"#VALUE!"},null,"","",{"$error":"#VALUE!"},"",{"$error":"#VALUE!"},"","","","",0,null,"",{"$error":"#VALUE!"},"",{"$error":"#VALUE!"},"","","","",0,null,"",{"$error":"#VALUE!"},"",{"$error":"#VALUE!"},"","","","",0,null,"",0,null,"",0,null,null,"","","","",{"$f":"IF($CJ15=\"\",\"\",(RANK(CJ15,CJ$2:CJ$16,0)+COUNTIF(CJ$2:CJ15,CJ15)-1))","v":""},"","","","",14,{"$f":"IF($CP15=\"\",\"\",(RANK(CP15,CP$2:CP$16,1)+COUNTIF(CP$2:CP15,CP15)-1))","v":""},"","",""]
[{"$f":"IF(B16=\"\",\"\",RacePage!D21)","v":0},15,null,null,15,11.2,{"$nulls":79},11.2,{"$error":"#VALUE!"},{"$error":"#VALUE!"},{"$error":"#VALUE!"},{"$f":"IF($CJ16=\"\",\"\",(RANK(CJ16,CJ$2:CJ$16,0)+COUNTIF(CJ$2:CJ16,CJ16)-1))","v":{"$error":"#VALUE!"}},{"$error":"#VALUE!"},{"$error":"#VALUE!"},{"$error":"#VALUE!"},"",15]
[{"$f":"IF(B17=\"\",\"\",RacePage!D22)","v":""}]
[{"$nulls":10},"Harness Form",{"$nulls":37},"Harness Form",{"$nulls":9},"Harness Form",{"$nulls":9},"Harness Form"]
[null,"Yes",{"$f":"IF(B19=\"No\",0,MAX(C21:C79))","v":20},null,"Yes",{"$f":"IF(E19=\"No\",0,MAX(F21:F68))","v":11.6},null,"Yes",{"$f":"IF(H19=\"No\",0,MAX(I21:I68))","v":10},null,"No",{"$f":"IF(K19=\"No\",0,MAX(L21:L90))","v":0},null,"Yes",{"$f":"IF(N19=\"No\",0,MAX(O21:O90))","v":3},{"$nulls":7},"Yes",{"$f":"IF(W19=\"No\",0,COUNT(V21:V24)*5)","v":0},{"$nulls":12},"Yes",{"$f":"IF(AK19=\"No\",0,MAX(AL21:AL90))","v":10},null,"Yes",{"$f":"IF(AN19=\"No\",0,MAX(AO21:AO90))","v":10},null,null,null,"Yes",{"$f":"IF(AS19=\"No\",0,MAX(AT21:AT90))","v":12},null,null,"Yes",{"$f":"IF(AW19=\"No\",0,MAX(AX21:AX90))","v":10},null,"Yes",{"$f":"IF(AZ19=\"No\",0,MAX(BA21:BA90))","v":20},null,null,"Yes",{"$f":"IF(BD19=\"No\",0,MAX(BE21:BE90))","v":20},null,"Yes",{"$f":"IF(BG19=\"No\",0,MAX(BH21:BH90))","v":10},null,"Yes",{"$f":"IF(BJ19=\"No\",0,MAX(BK21:BK90))","v":20},null,null,"Yes",{"$f":"IF(BN19=\"No\",0,MAX(BO21:BO90))","v":20},null,"Yes",{"$f":"IF(BQ19=\"No\",0,MAX(BR21:BR90))","v":10},null,"Yes",{"$f":"IF(BT19=\"No\",0,MAX(BU21:BU90))","v":20},null,null,"Yes",{"$f":"IF(BX19=\"No\",0,MAX(BY21:BY90))","v":20},null,"Yes",{"$f":"IF(CA19=\"No\",0,MAX(CB21:CB90))","v":20},null,"Yes",{"$f":"IF(CD19=\"No\",0,MAX(CE21:CE90))","v":20}]
[null,"Tab No","pts",null,"Barrier","pts",null,"Box","pts",null,"HCP","pts",null,"Weight","R/Figure",{"$nulls":7},"Condition","R/Figure",{"$nulls":12},"Win%","R/Figure",null,"Place%","R/Figure",null,null,null,"A/price","R/Figure",null,null,"LS MB","R/Figure",null,"LS LB","R/Figure",null,null,"LS DS","R/Figure",null,"LS MB","R/Figure",null,"2ND LB","R/Figure",null,null,"2ND DS","R/Figure",null,"LS MB","R/Figure",null,"3RD LB","R/Figure",null,null,"3RD DS","R/Figure",null,"Rating","R/Figure",null,"Rating","R/Figure"]
[null,{"$f":"IF($B$19=\"Yes\",1,\"\")","v":1},20,null,{"$f":"IF(E$19=\"Yes\",1,\"\")","v":1},10.8,null,1,10,{"$nulls":4},{"$f":"IF(N$19=\"Yes\",70,\"\")","v":70},0,{"$nulls":7},{"$f":"IF(W$19=\"Yes\",\"T\",\"\")","v":"T"},5,{"$nulls":12},{"$f":"IF(AK$19=\"Yes\",0,\"\")","v":0},0,null,{"$f":"IF(AN$19=\"Yes\",0,\"\")","v":0},0,null,null,null,{"$f":"IF(AS$19=\"Yes\",1,\"\")","v":1},12,null,null,{"$f":"IF(AW$19=\"Yes\",0,\"\")","v":0},10,null,{"$f":"IF(AZ$19=\"Yes\",0,\"\")","v":0},20,null,null,{"$f":"IF(BD$19=\"Yes\",7,\"\")","v":7},20,null,{"$f":"IF(BG$19=\"Yes\",0,\"\")","v":0},10,null,{"$f":"IF(BJ$19=\"Yes\",0,\"\")","v":0},20,null,null,{"$f":"IF(BN$19=\"Yes\",7,\"\")","v":7},20,null,{"$f":"IF(BQ$19=\"Yes\",0,\"\")","v":0},10,null,{"$f":"IF(BT$19=\"Yes\",0,\"\")","v":0},20,null,null,{"$f":"IF(BX$19=\"Yes\",7,\"\")","v":7},20,null,{"$f":"IF(CA$19=\"Yes\",100,\"\")","v":100},20,null,{"$f":"IF(CD$19=\"Yes\",100,\"\")","v":100},20]
[null,{"$f":"IF($B$19=\"Yes\",B21+1,\"\")","v":2},19,null,{"$f":"IF(E$19=\"Yes\",E21+1,\"\")","v":2},11.6,null,2,8,{"$nulls":4},{"$f":"IF(N$19=\"Yes\",N21-0.5,\"\")","v":69.5},0,{"$nulls":7},{"$f":"IF(W$19=\"Yes\",\"C\",\"\")","v":"C"},5,{"$nulls":12},{"$f":"IF(AK$19=\"Yes\",AK21+5,\"\")","v":5},0.5,null,{"$f":"IF(AN$19=\"Yes\",AN21+5,\"\")","v":5},0.5,null,null,null,{"$f":"IF(AS$19=\"Yes\",AS21+1,\"\")","v":2},10,null,null,{"$f":"IF(AW$19=\"Yes\",AW21+1,\"\")","v":1},9,null,{"$f":"IF(AZ$19=\"Yes\",AZ21+0.5,\"\")","v":0.5},19,null,null,{"$f":"IF(BD$19=\"Yes\",BD21+7,\"\")","v":14},18,null,{"$f":"IF(BG$19=\"Yes\",BG21+1,\"\")","v":1},9,null,{"$f":"IF(BJ$19=\"Yes\",BJ21+0.5,\"\")","v":0.5},19,null,null,{"$f":"IF(BN$19=\"Yes\",BN21+7,\"\")","v":14},18,null,{"$f":"IF(BQ$19=\"Yes\",BQ21+1,\"\")","v":1},9,null,{"$f":"IF(BT$19=\"Yes\",BT21+0.5,\"\")","v":0.5},19,null,null,{"$f":"IF(BX$19=\"Yes\",BX21+7,\"\")","v":14},18,null,{"$f":"IF(CA$19=\"Yes\",CA21-1,\"\")","v":99},19,null,{"$f":"IF(CD$19=\"Yes\",CD21-1,\"\")","v":99},19]
[null,{"$f":"IF($B$19=\"Yes\",B22+1,\"\")","v":3},18,null,{"$f":"IF(E$19=\"Yes\",E22+1,\"\")","v":3},10.8,null,3,6,{"$nulls":4},{"$f":"IF(N$19=\"Yes\",N22-0.5,\"\")","v":69},0,{"$nulls":7},{"$f":"IF(W$19=\"Yes\",\"D\",\"\")","v":"D"},5,{"$nulls":12},{"$f":"IF(AK$19=\"Yes\",AK22+5,\"\")","v":10},1,null,{"$f":"IF(AN$19=\"Yes\",AN22+5,\"\")","v":10},1,null,null,null,{"$f":"IF(AS$19=\"Yes\",AS22+1,\"\")","v":3},8,null,null,{"$f":"IF(AW$19=\"Yes\",AW22+1,\"\")","v":2},8,null,{"$f":"IF(AZ$19=\"Yes\",AZ22+0.5,\"\")","v":1},18,null,null,{"$f":"IF(BD$19=\"Yes\",BD22+7,\"\")","v":21},16,null,{"$f":"IF(BG$19=\"Yes\",BG22+1,\"\")","v":2},8,null,{"$f":"IF(BJ$19=\"Yes\",BJ22+0.5,\"\")","v":1},18,null,null,{"$f":"IF(BN$19=\"Yes\",BN22+7,\"\")","v":21},16,null,{"$f":"IF(BQ$19=\"Yes\",BQ22+1,\"\")","v":2},8,null,{"$f":"IF(BT$19=\"Yes\",BT22+0.5,\"\")","v":1},18,null,null,{"$f":"IF(BX$19=\"Yes\",BX22+7,\"\")","v":21},16,null,{"$f":"IF(CA$19=\"Yes\",CA22-1,\"\")","v":98},18,null,{"$f":"IF(CD$19=\"Yes\",CD22-1,\"\")","v":98},18]
[null,4,17,null,4,10.5,null,4,4,{"$nulls":4},68.5,0,{"$nulls":7},"",5,{"$nulls":12},15,1.5,null,15,1.5,null,null,null,4,6,null,null,3,7,null,1.5,17,null,null,28,14,null,3,7,null,1.5,17,null,null,28,14,null,3,7,null,1.5,17,null,null,28,14,null,97,17,null,97,17,null,{"$f":"MAX(CG26:CG95)","v":0}]
[null,5,16,null,5,11.1,null,5,2,{"$nulls":4},68,0,{"$nulls":7},{"$f":"IF(W$19=\"Yes\",\"t\",\"\")","v":"t"},3,{"$nulls":12},20,2,null,20,2,null,null,null,5,4,null,null,4,6,null,2,16,null,null,35,12,null,4,6,null,2,16,null,null,35,12,null,4,6,null,2,16,null,null,35,12,null,96,16,null,96,16]
[null,6,15,null,6,10.6,null,0,1,{"$nulls":4},67.5,0,{"$nulls":7},{"$f":"IF(W$19=\"Yes\",\"c\",\"\")","v":"c"},3,{"$nulls":12},25,2.5,null,25,2.5,null,null,null,6,2,null,null,5,5,null,2.5,15,null,null,42,10,null,5,5,null,2.5,15,null,null,42,10,null,5,5,null,2.5,15,null,null,42,10,null,95,15,null,95,15]
[null,7,10,null,7,8.6,null,"x ",0,{"$nulls":4},67,0,{"$nulls":7},{"$f":"IF(W$19=\"Yes\",\"d\",\"\")","v":"d"},3,{"$nulls":12},30,3,null,30,3,null,null,null,7,0,null,null,6,4,null,3,14,null,null,49,8,null,6,4,null,3,14,null,null,49,8,null,6,4,null,3,14,null,null,49,8,null,94,14,null,94,14]
[null,8,9,null,8,9,{"$nulls":7},66.5,0,{"$nulls":7},"",3,{"$nulls":12},35,3.5,null,35,3.5,null,null,null,8,0,null,null,7,3,null,3.5,13,null,null,56,6,null,7,3,null,3.5,13,null,null,56,6,null,7,3,null,3.5,13,null,null,56,6,null,93,13,null,93,13]
[null,9,8,null,9,8.3000000000000007,{"$nulls":7},66,0,{"$nulls":21},40,4,null,40,4,null,null,null,9,0,null,null,8,2,null,4,12,null,null,63,4,null,8,2,null,4,12,null,null,63,4,null,8,2,null,4,12,null,null,63,4,null,92,12,null,92,12]
[null,10,7,null,10,8.4,{"$nulls":7},65.5,0,{"$nulls":21},45,4.5,null,45,4.5,null,null,null,10,0,null,null,9,1,null,4.5,11,null,null,70,2,null,9,1,null,4.5,11,null,null,70,2,null,9,1,null,4.5,11,null,null,70,2,null,91,11,null,91,11]
[null,11,6,null,11,7.4,{"$nulls":7},65,0,{"$nulls":21},50,5,null,50,5,null,null,null,11,0,null,null,10,0,null,5,10,null,null,1000,0,null,10,0,null,5,10,null,null,1000,0,null,10,0,null,5,10,null,null,1000,0,null,90,10,null,90,10]
[null,12,5,null,12,6.8,{"$nulls":7},64.5,0,{"$nulls":21},55,5.5,null,55,5.5,null,null,null,12,0,null,null,11,0,null,5.5,9,{"$nulls":5},11,0,null,5.5,9,{"$nulls":5},11,0,null,5.5,9,{"$nulls":5},89,9,null,89,9]
[null,13,0,null,13,5.9,{"$nulls":7},64,0,{"$nulls":21},60,6,null,60,6,null,null,null,13,0,null,null,12,0,null,6,8,{"$nulls":5},12,0,null,6,8,{"$nulls":5},12,0,null,6,8,{"$nulls":5},88,8,null,88,8]
[null,14,0,null,14,6,{"$nulls":7},63.5,0,{"$nulls":21},65,6.5,null,65,6.5,null,null,null,14,0,null,null,13,0,null,6.5,7,{"$nulls":5},13,0,null,6.5,7,{"$nulls":5},13,0,null,6.5,7,{"$nulls":5},87,7,null,87,7]
[null,15,0,null,15,5.6,{"$nulls":7},63,0,{"$nulls":21},70,7,null,70,7,null,null,null,15,0,null,null,14,0,null,7,6,{"$nulls":5},14,0,null,7,6,{"$nulls":5},14,0,null,7,6,{"$nulls":5},86,6,null,86,6]
[{"$nulls":13},62.5,0,{"$nulls":21},75,7.5,null,75,7.5,null,null,null,16,0,null,null,15,0,null,7.5,5,{"$nulls":5},15,0,null,7.5,5,{"$nulls":5},15,0,null,7.5,5,{"$nulls":5},85,5,null,85,5]
[{"$nulls":13},62,0,{"$nulls":21},80,8,null,80,8,null,null,null,17,0,null,null,16,0,null,8,4,{"$nulls":5},16,0,null,8,4,{"$nulls":5},16,0,null,8,4,{"$nulls":5},84,4,null,84,4]
[{"$nulls":13},61.5,0,{"$nulls":21},85,8.5,null,85,8.5,null,null,null,18,0,null,null,17,0,null,8.5,3,{"$nulls":5},17,0,null,8.5,3,{"$nulls":5},17,0,null,8.5,3,{"$nulls":5},83,3,null,83,3]
[{"$nulls":13},61,0,{"$nulls":21},90,9,null,90,9,null,null,null,19,0,null,null,18,0,null,9,2,{"$nulls":5},18,0,null,9,2,{"$nulls":5},18,0,null,9,2,{"$nulls":5},82,2,null,82,2]
[{"$nulls":10},{"$f":"IF(#REF!=\"\",\"\",#REF!)","v":{"$error":"#REF!"}},null,null,60.5,0,{"$nulls":21},95,9.5,null,95,9.5,null,null,null,20,0,null,null,19,0,null,9.5,1,{"$nulls":5},19,0,null,9.5,1,{"$nulls":5},19,0,null,9.5,1,{"$nulls":5},81,1,null,81,1]
[{"$nulls":10},{"$f":"IF(#REF!=\"\",\"\",#REF!)","v":{"$error":"#REF!"}},null,null,60,0,{"$nulls":21},100,10,null,100,10,null,null,null,21,0,null,null,20,0,null,10,0,{"$nulls":5},20,0,null,10,0,{"$nulls":5},20,0,null,10,0,{"$nulls":5},80,0,null,80,0]
[{"$nulls":10},{"$f":"IF(#REF!=\"\",\"\",#REF!)","v":{"$error":"#REF!"}},null,null,59.5,2,{"$nulls":24},{"$f":"IF(#REF!=\"\",\"\",#REF!)","v":{"$error":"#REF!"}},{"$nulls":4},22,0,null,null,21,0,null,10.5,0,{"$nulls":5},21,0,null,10.5,0,{"$nulls":5},21,0,null,10.5,0,{"$nulls":5},79,0,null,79,0]
[{"$nulls":10},{"$f":"IF(#REF!=\"\",\"\",#REF!)","v":{"$error":"#REF!"}},null,null,59,2,{"$nulls":24},{"$f":"IF(#REF!=\"\",\"\",#REF!)","v":{"$error":"#REF!"}},{"$nulls":4},23,0,null,null,22,0,null,11,0,{"$nulls":5},22,0,null,11,0,{"$nulls":5},22,0,null,11,0,{"$nulls":5},78,0,null,78,0]
[{"$nulls":10},{"$f":"IF(#REF!=\"\",\"\",#REF!)","v":{"$error":"#REF!"}},null,null,58.5,2,{"$nulls":24},{"$f":"IF(#REF!=\"\",\"\",#REF!)","v":{"$error":"#REF!"}},{"$nulls":4},24,0,null,null,23,0,null,11.5,0,{"$nulls":5},23,0,null,11.5,0,{"$nulls":5},23,0,null,11.5,0,{"$nulls":5},77,0,null,77,0]
[{"$nulls":10},{"$f":"IF(K16=\"\",\"\",K16)","v":""},null,null,58,3,{"$nulls":24},{"$f":"IF(AN16=\"\",\"\",AN16)","v":""},{"$nulls":8},24,0,null,12,0,{"$nulls":5},24,0,null,12,0,{"$nulls":5},24,0,null,12,0,{"$nulls":5},76,0,null,76,0]
[{"$nulls":13},57.5,3,{"$nulls":33},25,0,{"$nulls":8},25,0,{"$nulls":8},25,0,{"$nulls":8},75,0,null,75,0]
[{"$nulls":13},57,3,{"$nulls":33},26,0,{"$nulls":8},26,0,{"$nulls":8},26,0]
[{"$nulls":13},56.5,3,{"$nulls":33},27,0,{"$nulls":8},27,0,{"$nulls":8},27,0]
[{"$nulls":13},56,3,{"$nulls":33},28,0,{"$nulls":8},28,0,{"$nulls":8},28,0]
[{"$nulls":13},55.5,2,{"$nulls":33},29,0,{"$nulls":8},29,0,{"$nulls":8},29,0]
[{"$nulls":13},55,2,{"$nulls":33},30,0,{"$nulls":8},30,0,{"$nulls":8},30,0]
[{"$nulls":13},54.5,2,{"$nulls":33},31,0,{"$nulls":8},31,0,{"$nulls":8},31,0]
[{"$nulls":13},54,2,{"$nulls":33},32,0,{"$nulls":8},32,0,{"$nulls":8},32,0]
[{"$nulls":13},53.5,2,{"$nulls":33},33,0,{"$nulls":8},33,0,{"$nulls":8},33,0]
[{"$nulls":13},53,2,{"$nulls":33},34,0,{"$nulls":8},34,0,{"$nulls":8},34,0]
[{"$nulls":13},52.5,1,{"$nulls":33},35,0,{"$nulls":8},35,0,{"$nulls":8},35,0]
[{"$nulls":13},52,1,{"$nulls":33},36,0,{"$nulls":8},36,0,{"$nulls":8},36,0]
[{"$nulls":13},51.5,1,{"$nulls":33},37,0,{"$nulls":8},37,0,{"$nulls":8},37,0]
[{"$nulls":13},51,1,{"$nulls":33},38,0,{"$nulls":8},38,0,{"$nulls":8},38,0]
[{"$nulls":13},50.5,1,{"$nulls":33},39,0,{"$nulls":8},39,0,{"$nulls":8},39,0]
[{"$nulls":13},50,1,{"$nulls":33},40,0,{"$nulls":8},40,0,{"$nulls":8},40,0]
[{"$nulls":13},49.5,1,{"$nulls":33},100,0,{"$nulls":8},100,0,{"$nulls":8},100,0]
[{"$nulls":13},49,1]
[{"$nulls":13},48.5,1]
[{"$nulls":13},48,1]
[{"$nulls":13},47.5,1]
[{"$nulls":13},47,1]
[{"$nulls":13},46.5,1]
[{"$nulls":13},46,1]
[{"$nulls":13},45.5,1]
[{"$nulls":13},45,1]

{"sheet":"form2","index":15,"n_rows":136,"n_cols":29,"rows_kept":136,"cut":false,"hidden":false,"merged":[]}
[1,"tab"]
["race","Tab","Form L3","Horse","TRat","JRat","API","LSRat","DLR","PR","AFS","BP",{"$nulls":4},"tab t","DLR T","TR","JK","api","LSRat",null,"rating","Price",null,"RATING","PRICE"]
[1,1,"x76","ANCIENT GUIDANCE",1.9,2.6,2,33,14,10,17.2,8,{"$nulls":4},{"$f":"IF(B3=1,20,0+IF(B3=2,19,0+IF(B3=3,18,0+IF(B3=4,17,0+IF(B3=5,16,0+IF(B3=6,15,0+IF(B3=7,14,0+IF(B3=8,14,0))))))))","v":20},{"$f":"IF(AND(I3>=1,I3<=15),20,IF(AND(I3>=16,I3<=28),15,0))","v":20},{"$f":"IFERROR(IF(RANK(E3,$E$3:$E$14)<13,RANK(E3,$E$3:$E$14),\"\"),\"\")","v":8},{"$f":"IFERROR(IF(RANK(F3,$F$3:$F$14)<13,RANK(F3,$F$3:$F$14),\"\"),\"\")","v":7},{"$f":"IFERROR(IF(RANK(G3,$G$3:$G$14)<13,RANK(G3,$G$3:$G$14),\"\"),\"\")","v":4},{"$f":"IFERROR(IF(RANK(H3,$H$3:$H$14)<13,RANK(H3,$H$3:$H$14),\"\"),\"\")","v":1},null,{"$f":"IF(B3=\"\",\"\",100+R3+Q3)-(S3+T3+U3+V3)","v":120},{"$f":"IF(B3=\"\",\"\",$X$15/X3*85%)","v":{"$error":"#VALUE!"}},null,{"$f":"IF(B3=\"\",\"\",+E3*5+F3*5+G3+H3*5+R3+Q3)","v":229.5},{"$f":"IF(B3=\"\",\"\",$AA$15/AA3*85%)","v":5.2062962962962951},{"$f":"IFERROR(IF(RANK(H3,$H$3:$H$14)<4,RANK(H3,$H$3:$H$14),\"\"),\"\")","v":1}]
[1,2,58,"AUTUMN REBEL",3.3,3,2.2999999999999998,31.5,14,5.5,17.2,9,{"$nulls":4},19,20,5,6,3,3,null,122,{"$error":"#VALUE!"},{"$f":"IFERROR(IF(RANK(X4,$X$3:$X$14)<4,RANK(X4,$X$3:$X$14),\"\"),\"\")","v":""},230.3,5.1882110290924865,3]
[1,3,3,"DIALLING",3.3,3.2,2,27,10,8,null,2,{"$nulls":4},18,20,5,4,4,5,null,120,{"$error":"#VALUE!"},"",207.5,5.7582891566265051,""]
[1,4,9,"WANT TO DANCE",4.2,2.4,0.4,13.5,10,12,null,5,{"$nulls":4},17,20,2,8,6,6,null,115,{"$error":"#VALUE!"},"",137.9,8.6645757795503986,""]
[1,5,"-","MINING LEGEND",4.2,4,0,0,0,26,null,4,{"$nulls":4},16,0,2,3,7,7,null,97,{"$error":"#VALUE!"},"",57,20.962192982456138,""]
[1,6,"-","PIN DEEP",2.9,3.2,0,0,0,18,null,1,{"$nulls":4},15,0,7,4,7,7,null,90,{"$error":"#VALUE!"},"",45.5,26.260329670329668,""]
[1,7,503,"ECSTASY OF GOLD",1.8,1.6,3.2,29.5,9,15,17.100000000000001,3,{"$nulls":4},14,20,9,9,2,4,null,110,{"$error":"#VALUE!"},"",201.7,5.9238720872583039,""]
[1,8,1,"PETULA",4.0999999999999996,4.3,12.3,32.5,10,2.9,null,7,{"$nulls":4},14,20,4,1,1,2,null,126,{"$error":"#VALUE!"},"",250.8,4.7641347687400311,2]
[1,9,"-","BLAZING EMERALD",4.9000000000000004,4.2,0,0,0,6.5,null,6,{"$nulls":4},0,0,1,2,7,7,null,83,{"$error":"#VALUE!"},"",45.5,26.260329670329668,""]
[1,{"$nulls":15},0,0,"","",7,7,null,{"$error":"#VALUE!"},"","","","",""]
[1,{"$nulls":15},0,0,"","",7,7,null,{"$error":"#VALUE!"},"","","","",""]
[1,{"$nulls":15},0,0,"","",7,7,null,{"$error":"#VALUE!"},"","","","",""]
[1,{"$nulls":20},7,null,{"$f":"SUM(X3:X14)","v":{"$error":"#VALUE!"}},null,null,{"$f":"SUM(AA3:AA14)","v":1405.6999999999998},null,"X"]
[1,"tab"]
["race","Tab","Form L3","Horse","TRat","JRat","API","LSRat","DLR","PR","AFS","BP",{"$nulls":4},"tab t","DLR T","TR","JK","api","LSRat",null,"rating","Price",null,"RATING","PRICE"]
[2,1,427,"GLASGOW GIRL",2.5,2.6,5.4,34.5,14,3.8,17.5,7,{"$nulls":4},{"$f":"IF(B18=1,20,0+IF(B18=2,19,0+IF(B18=3,18,0+IF(B18=4,17,0+IF(B18=5,16,0+IF(B18=6,15,0+IF(B18=7,14,0+IF(B18=8,14,0))))))))","v":20},{"$f":"IF(AND(I18>=1,I18<=15),20,IF(AND(I18>=16,I18<=28),15,0))","v":20},{"$f":"IFERROR(IF(RANK(E18,$E$18:$E$29)<13,RANK(E18,$E$18:$E$29),\"\"),\"\")","v":7},{"$f":"IFERROR(IF(RANK(F18,$F$18:$F$29)<13,RANK(F18,$F$18:$F$29),\"\"),\"\")","v":6},{"$f":"IFERROR(IF(RANK(G18,$G18:$G$29)<13,RANK(G18,$G$18:$G$29),\"\"),\"\")","v":3},{"$f":"IFERROR(IF(RANK(H18,$H18:$H$29)<13,RANK(H18,$H$18:$H$29),\"\"),\"\")","v":7},null,{"$f":"IF(B18=\"\",\"\",+R18+Q18)","v":40},{"$f":"IF(B3=\"\",\"\",$X$30/X18*85%)","v":5.1849999999999996},null,{"$f":"IF(B18=\"\",\"\",+E18*5+F18*5+G18+H18*5+R18+Q18)","v":243.4},{"$f":"IF(B18=\"\",\"\",$AA$15/AA18*85%)","v":4.9089769926047646}]
[2,2,"x73","MORDOR",1.9,2.5,5.8,36.5,21,10,17.2,1,{"$nulls":4},19,15,10,7,{"$f":"IFERROR(IF(RANK(G19,$G19:$G$29)<13,RANK(G19,$G$18:$G$29),\"\"),\"\")","v":1},{"$f":"IFERROR(IF(RANK(H19,$H19:$H$29)<13,RANK(H19,$H$18:$H$29),\"\"),\"\")","v":3},null,34,6.1,null,244.3,4.890892345476872]
[2,3,135,"LUCKY LANDING",3.6,3.2,3.6,35.5,21,4.5999999999999996,17.899999999999999,8,{"$nulls":4},18,15,3,3,{"$f":"IFERROR(IF(RANK(G20,$G20:$G$29)<13,RANK(G20,$G$18:$G$29),\"\"),\"\")","v":6},{"$f":"IFERROR(IF(RANK(H20,$H20:$H$29)<13,RANK(H20,$H$18:$H$29),\"\"),\"\")","v":4},null,33,6.2848484848484842,null,248.1,4.8159814590890768]
[2,4,215,"ULTIMATE COMMAND",3.8,3,3.7,35,14,10,16.8,3,{"$nulls":4},17,20,1,4,{"$f":"IFERROR(IF(RANK(G21,$G21:$G$29)<13,RANK(G21,$G$18:$G$29),\"\"),\"\")","v":5},{"$f":"IFERROR(IF(RANK(H21,$H21:$H$29)<13,RANK(H21,$H$18:$H$29),\"\"),\"\")","v":5},null,37,5.6054054054054054,null,249.7,4.7851221465758904]
[2,5,"6x1","VALENCY",2.1,1.6,5.8,37.5,14,6.5,17.600000000000001,11,{"$nulls":4},16,20,9,10,{"$f":"IFERROR(IF(RANK(G22,$G22:$G$29)<13,RANK(G22,$G$18:$G$29),\"\"),\"\")","v":1},{"$f":"IFERROR(IF(RANK(H22,$H22:$H$29)<13,RANK(H22,$H$18:$H$29),\"\"),\"\")","v":2},null,36,5.7611111111111111,null,247.8,4.8218119451170285]
[2,6,424,"YOYO'S",3.3,2.5,1.6,35,14,8.5,18.2,9,{"$nulls":4},15,20,5,7,{"$f":"IFERROR(IF(RANK(G23,$G23:$G$29)<13,RANK(G23,$G$18:$G$29),\"\"),\"\")","v":9},{"$f":"IFERROR(IF(RANK(H23,$H23:$H$29)<13,RANK(H23,$H$18:$H$29),\"\"),\"\")","v":5},null,35,5.9257142857142853,null,240.6,4.966105569409808]
[2,7,"11x","PLAYZ WITH FIRE",2.2999999999999998,4.2,0,43.5,501,10,null,4,{"$nulls":4},14,0,8,1,{"$f":"IFERROR(IF(RANK(G24,$G24:$G$29)<13,RANK(G24,$G$18:$G$29),\"\"),\"\")","v":10},{"$f":"IFERROR(IF(RANK(H24,$H24:$H$29)<13,RANK(H24,$H$18:$H$29),\"\"),\"\")","v":1},null,14,14.814285714285713,null,264,4.5259280303030298]
[2,{"$nulls":15},0,0,"","",{"$f":"IFERROR(IF(RANK(G25,$G25:$G$29)<13,RANK(G25,$G$18:$G$29),\"\"),\"\")","v":""},{"$f":"IFERROR(IF(RANK(H25,$H25:$H$29)<13,RANK(H25,$H$18:$H$29),\"\"),\"\")","v":""},null,"",{"$error":"#VALUE!"},null,"",""]
[2,9,"34x","BASIL'S DREAM",3.6,3.8,5,34.5,185,20,17.8,5,{"$nulls":4},0,0,3,2,{"$f":"IFERROR(IF(RANK(G26,$G26:$G$29)<13,RANK(G26,$G$18:$G$29),\"\"),\"\")","v":4},{"$f":"IFERROR(IF(RANK(H26,$H26:$H$29)<13,RANK(H26,$H$18:$H$29),\"\"),\"\")","v":7},null,0,{"$error":"#DIV/0!"},null,214.5,5.5703729603729597]
[2,10,"70x","ANYOLDTIME",3.3,1.9,2.2000000000000002,31.5,140,51,17.8,10,{"$nulls":4},0,0,5,9,{"$f":"IFERROR(IF(RANK(G27,$G27:$G$29)<13,RANK(G27,$G$18:$G$29),\"\"),\"\")","v":7},{"$f":"IFERROR(IF(RANK(H27,$H27:$H$29)<13,RANK(H27,$H$18:$H$29),\"\"),\"\")","v":9},null,0,"",null,185.7,6.4342757135164232]
[2,11,903,"DOMINEER",3.8,2.9,2,30.5,18,26,17.7,6,{"$nulls":4},0,15,1,5,{"$f":"IFERROR(IF(RANK(G28,$G28:$G$29)<13,RANK(G28,$G$18:$G$29),\"\"),\"\")","v":8},{"$f":"IFERROR(IF(RANK(H28,$H28:$H$29)<13,RANK(H28,$H$18:$H$29),\"\"),\"\")","v":10},null,15,"",null,203,5.8859359605911319]
[2,{"$nulls":15},0,0,"","",{"$f":"IFERROR(IF(RANK(G29,$G29:$G$29)<13,RANK(G29,$G$18:$G$29),\"\"),\"\")","v":""},{"$f":"IFERROR(IF(RANK(H29,$H29:$H$29)<13,RANK(H29,$H$18:$H$29),\"\"),\"\")","v":""},null,"","",null,"",""]
[2,{"$nulls":20},{"$f":"IFERROR(IF(RANK(H30,$E$3:$E$14)<13,RANK(H30,$E$3:$E$14),\"\"),\"\")","v":""},null,{"$f":"SUM(X18:X29)","v":244},null,null,{"$f":"SUM(AA18:AA29)","v":2341.1}]
[null,"tab"]
["race","Tab","Form L3","Horse","TRat","JRat","API","LSRat","DLR","PR","AFS","BP",{"$nulls":4},"tab t","DLR T","TR","JK","api","LSRat",null,"rating","Price",null,"RATING","PRICE"]
[3,1,111,"CATCH THESE HANDS",4.0999999999999996,4.2,14.3,39,21,4.2,17.600000000000001,4,{"$nulls":4},{"$f":"IF(B33=1,20,0+IF(B33=2,19,0+IF(B33=3,18,0+IF(B33=4,17,0+IF(B33=5,16,0+IF(B33=6,15,0+IF(B33=7,14,0+IF(B33=8,14,0))))))))","v":20},{"$f":"IF(AND(I33>=1,I33<=15),20,IF(AND(I33>=16,I33<=28),15,0))","v":15},{"$f":"IFERROR(IF(RANK(E33,$E$33:$E$44)<13,RANK(E33,$E$33:$E$44),\"\"),\"\")","v":1},{"$f":"IFERROR(IF(RANK(F33,$F$33:$F$44)<13,RANK(F33,$F$33:$F$44),\"\"),\"\")","v":1},{"$f":"IFERROR(IF(RANK(G33,$G$33:$G44)<13,RANK(G33,$G$33:$G44),\"\"),\"\")","v":2},{"$f":"IFERROR(IF(RANK(G33,$G$33:$G44)<13,RANK(G33,$G$33:$G44),\"\"),\"\")","v":2},null,{"$f":"IF(B33=\"\",\"\",+R33+Q33)","v":35},{"$f":"IF(B3=\"\",\"\",$X$45/X33*85%)","v":6.9942857142857138},null,{"$f":"IF(B33=\"\",\"\",+E33*5+F33*5+G33+H33*5+R33+Q33)","v":285.8},{"$f":"IF(B33=\"\",\"\",$AA$45/AA33*85%)","v":6.6298810356892925}]
[3,2,184,"PAZZO CAVALLO",2,2.5,4.5,35.5,24,14,17.600000000000001,2,{"$nulls":4},19,15,9,7,{"$f":"IFERROR(IF(RANK(G34,$G$33:$G45)<13,RANK(G34,$G$33:$G45),\"\"),\"\")","v":7},{"$f":"IFERROR(IF(RANK(G34,$G$33:$G45)<13,RANK(G34,$G$33:$G45),\"\"),\"\")","v":7},null,34,7.2,null,238.5,7.9447379454926619]
[3,3,113,"RUSTY DREAMS",3.6,4.2,19.600000000000001,35.5,21,3,17.399999999999999,7,{"$nulls":4},18,15,4,1,{"$f":"IFERROR(IF(RANK(G35,$G$33:$G46)<13,RANK(G35,$G$33:$G46),\"\"),\"\")","v":1},{"$f":"IFERROR(IF(RANK(G35,$G$33:$G46)<13,RANK(G35,$G$33:$G46),\"\"),\"\")","v":1},null,33,7.4181818181818171,null,269.10000000000002,7.0413229282794489]
[3,4,552,"UNIVERSAL FLAIR",2.2999999999999998,2.2000000000000002,5.3,34.5,10,17,17.3,3,{"$nulls":4},17,20,8,8,{"$f":"IFERROR(IF(RANK(G36,$G$33:$G47)<13,RANK(G36,$G$33:$G47),\"\"),\"\")","v":4},{"$f":"IFERROR(IF(RANK(G36,$G$33:$G47)<13,RANK(G36,$G$33:$G47),\"\"),\"\")","v":4},null,37,6.6162162162162161,null,237.3,7.9849136114622832]
[3,5,127,"ZOUBOLTZ",3.8,2.9,2.9,36,14,31,17.7,1,{"$nulls":4},16,20,3,6,{"$f":"IFERROR(IF(RANK(G37,$G$33:$G44)<13,RANK(G37,$G$33:$G44),\"\"),\"\")","v":9},{"$f":"IFERROR(IF(RANK(G37,$G$33:$G48)<13,RANK(G37,$G$33:$G48),\"\"),\"\")","v":10},null,36,6.8,null,252.4,7.5072107765451657]
[3,6,375,"KINGS SICARIO",4.0999999999999996,3,4.5,36,14,12,17.899999999999999,8,{"$nulls":4},15,20,1,5,{"$f":"IFERROR(IF(RANK(G38,$G$33:$G45)<13,RANK(G38,$G$33:$G45),\"\"),\"\")","v":7},{"$f":"IFERROR(IF(RANK(G38,$G$33:$G49)<13,RANK(G38,$G$33:$G49),\"\"),\"\")","v":9},null,35,6.9942857142857138,null,255,7.4306666666666654]
[3,7,541,"BEATS OF WAR",3.3,3.2,4.5999999999999996,32,17,10,17.399999999999999,6,{"$nulls":4},14,15,5,4,{"$f":"IFERROR(IF(RANK(G39,$G$33:$G50)<13,RANK(G39,$G$33:$G50),\"\"),\"\")","v":9},{"$f":"IFERROR(IF(RANK(G39,$G$33:$G50)<13,RANK(G39,$G$33:$G50),\"\"),\"\")","v":9},null,29,8.4413793103448285,null,226.1,8.3804511278195477]
[3,8,"51q","NUNES",2.6,4,5,38.5,14,6,17.7,5,{"$nulls":4},14,20,7,3,{"$f":"IFERROR(IF(RANK(G40,$G$33:$G44)<13,RANK(G40,$G$33:$G44),\"\"),\"\")","v":5},{"$f":"IFERROR(IF(RANK(G40,$G$33:$G51)<13,RANK(G40,$G$33:$G51),\"\"),\"\")","v":7},null,34,7.2,null,264.5,7.1637807183364837]
[3,9,753,"AZENA",3.1,1.9,5.5,31,16,20,17.399999999999999,9,{"$nulls":4},0,15,6,9,{"$f":"IFERROR(IF(RANK(G41,$G$33:$G44)<13,RANK(G41,$G$33:$G44),\"\"),\"\")","v":3},{"$f":"IFERROR(IF(RANK(G41,$G$33:$G52)<13,RANK(G41,$G$33:$G52),\"\"),\"\")","v":5},null,15,16.32,null,200.5,9.4504738154613452]
[3,{"$nulls":15},0,0,"","",{"$f":"IFERROR(IF(RANK(G42,$G$33:$G44)<13,RANK(G42,$G$33:$G44),\"\"),\"\")","v":""},{"$f":"IFERROR(IF(RANK(G42,$G$33:$G53)<13,RANK(G42,$G$33:$G53),\"\"),\"\")","v":""},null,"","",null,"",""]
[3,{"$nulls":15},0,0,"","",{"$f":"IFERROR(IF(RANK(G43,$G$33:$G44)<13,RANK(G43,$G$33:$G44),\"\"),\"\")","v":""},{"$f":"IFERROR(IF(RANK(G43,$G$33:$G54)<13,RANK(G43,$G$33:$G54),\"\"),\"\")","v":""},null,"","",null,"",""]
[3,{"$nulls":15},0,0,"","",{"$f":"IFERROR(IF(RANK(G44,$G$33:$G45)<13,RANK(G44,$G$33:$G45),\"\"),\"\")","v":""},{"$f":"IFERROR(IF(RANK(G44,$G$33:$G55)<13,RANK(G44,$G$33:$G55),\"\"),\"\")","v":""},null,"","",null,"",""]
[3,{"$nulls":22},{"$f":"SUM(X33:X44)","v":288},null,null,{"$f":"SUM(AA33:AA44)","v":2229.1999999999998}]
[null,"tab"]
["race","Tab","Form L3","Horse","TRat","JRat","API","LSRat","DLR","PR","AFS","BP",{"$nulls":4},"tab t","DLR T","TR","JK","api","LSRat",null,"rating","Price",null,"RATING","PRICE"]
[4,1,212,"COBBANCO",2.1,2,9.6,39.5,14,5,17.5,7,{"$nulls":4},{"$f":"IF(B48=1,20,0+IF(B48=2,19,0+IF(B48=3,18,0+IF(B48=4,17,0+IF(B48=5,16,0+IF(B48=6,15,0+IF(B48=7,14,0+IF(B48=8,14,0))))))))","v":20},{"$f":"IF(AND(I48>=1,I48<=15),20,IF(AND(I48>=16,I48<=28),15,0))","v":20},{"$f":"IFERROR(IF(RANK(E48,$E$48:$E$59)<13,RANK(E48,$E$48:$E$59),\"\"),\"\")","v":7},{"$f":"IFERROR(IF(RANK(F48,$F$48:$F$59)<13,RANK(F48,$F$48:$F$59),\"\"),\"\")","v":8},{"$f":"IFERROR(IF(RANK(G48,$G$48:$G$59)<13,RANK(G48,$G$48:$G$59),\"\"),\"\")","v":2},{"$f":"IFERROR(IF(RANK(H48,$H$48:$H$59)<13,RANK(H48,$H$48:$H$59),\"\"),\"\")","v":1},null,{"$f":"IF(B48=\"\",\"\",+R48+Q48)","v":40},{"$f":"IF(B48=\"\",\"\",$X$59/X48*85%)","v":{"$error":"#VALUE!"}},null,{"$f":"IF(B48=\"\",\"\",+E48*5+F48*5+G48+H48*5+R48+Q48)","v":267.60000000000002},{"$f":"IF(B47=\"\",\"\",$AA$60/AA48*85%)","v":8.1175635276532123}]
[4,2,"9x0","ADVANCED",2.2999999999999998,2.2999999999999998,10.3,33.5,28,13,17.8,8,{"$nulls":4},19,15,5,7,1,8,null,34,{"$error":"#VALUE!"},null,234.8,9.2515332197614981]
[4,3,"0x0","BUTTERLEA LAD",4.7,1.7,4.8,28.5,14,6,17.2,11,{"$nulls":4},18,20,1,9,5,10,null,38,{"$error":"#VALUE!"},null,217.3,9.9965945697192815]
[4,4,806,"DANI BELLA",2,2.8,3.6,36.5,14,31,17.2,10,{"$nulls":4},17,20,8,6,7,2,null,37,{"$error":"#VALUE!"},null,247.1,8.7910157830837719]
[4,5,"3x7","FLASH DUCATI",2.7,4.2,1.1000000000000001,35.5,14,17,18,9,{"$nulls":4},16,20,4,3,11,6,null,36,{"$error":"#VALUE!"},null,249.1,8.7204335608189485]
[4,6,653,"EL PATRON",4.4000000000000004,4.4000000000000004,5.2,36,10,4,17.100000000000001,2,{"$nulls":4},15,20,2,2,4,3,null,35,{"$error":"#VALUE!"},null,264.2,8.2220287660862983]
[4,7,686,"GREAT FORTUNE",2.2000000000000002,1.6,2.8,36,21,9.5,17.600000000000001,4,{"$nulls":4},14,15,6,10,9,3,null,29,{"$error":"#VALUE!"},null,230.8,9.4118717504332743]
[4,8,626,"ACE COMMAND",1.9,3.9,2.4,34,17,26,17.2,5,{"$nulls":4},14,15,10,4,10,7,null,29,{"$error":"#VALUE!"},null,230.4,9.4282118055555539]
[4,9,41,"FIRST ENCOUNTER",3.6,4.5,6.6,36,9,7.5,17,3,{"$nulls":4},0,20,3,1,3,3,null,20,{"$error":"#VALUE!"},null,247.1,8.7910157830837719]
[4,10,355,"JOLLY LACE",2,3.5,3.1,26.5,16,41,17.3,1,{"$nulls":4},0,15,8,5,8,11,null,15,{"$error":"#VALUE!"},null,178.1,12.19685569904548]
[4,11,872,"ROYAL ELITE",1.9,1.6,4.0999999999999996,30.5,18,21,17.399999999999999,6,{"$nulls":4},0,15,10,10,6,9,null,15,{"$error":"#VALUE!"},null,189.1,11.487361184558434]
[4,{"$nulls":15},0,0,"","","","",null,"","",null,"",{"$error":"#VALUE!"}]
[4,{"$nulls":22},{"$f":"SUM(X48:X59)","v":328},null,null,{"$f":"SUM(AA48:AA59)","v":2555.6}]
[]
["race","Tab","Form L3","Horse","TRat","JRat","API","LSRat","DLR","PR","AFS","BP",{"$nulls":4},"tab t","DLR T","TR","JK","api","LSRat",null,"rating","Price",null,"RATING","PRICE"]
[5,1,"34x","THOROGOOD",3.5,3,7.2,35.5,70,26,17.7,9,{"$nulls":4},{"$f":"IF(B63=1,20,0+IF(B63=2,19,0+IF(B63=3,18,0+IF(B63=4,17,0+IF(B63=5,16,0+IF(B63=6,15,0+IF(B63=7,14,0+IF(B63=8,14,0))))))))","v":20},{"$f":"IF(AND(I63>=1,I63<=15),20,IF(AND(I63>=16,I63<=28),15,0))","v":0},{"$f":"IFERROR(IF(RANK(E63,$E$63:$E$74)<13,RANK(E63,$E$63:$E$74),\"\"),\"\")","v":6},{"$f":"IFERROR(IF(RANK(F63,$F$63:$F$74)<13,RANK(F63,$F$63:$F$74),\"\"),\"\")","v":7},{"$f":"IFERROR(IF(RANK(G63,$G$63:$G$74)<13,RANK(G63,$G$63:$G$74),\"\"),\"\")","v":1},{"$f":"IFERROR(IF(RANK(H63,$H$63:$H$74)<13,RANK(H63,$H$63:$H$74),\"\"),\"\")","v":10},null,{"$f":"IF(B63=\"\",\"\",+R63+Q63)","v":20},{"$f":"IF(B63=\"\",\"\",$X$75/X63*85%)","v":12.0275},null,{"$f":"IF(A62=\"\",\"\",+E63*5+F63*5+G63+H63*5+R63+Q63)","v":237.2},{"$f":"IF(B62=\"\",\"\",$AA$75/AA63*85%)","v":10.459085160202363}]
[5,2,"72x","COLD SHIZZLE",3.3,3.2,6,38.5,128,7,18.2,7,{"$nulls":4},19,0,7,4,3,2,null,19,12.660526315789474,null,250,9.9235800000000012]
[5,3,"07x","LORD GANNICUS",4.2,4.2,6.2,40,161,9.5,17.5,4,{"$nulls":4},18,0,1,2,2,1,null,18,13.363888888888887,null,266.2,9.3196656649136003]
[5,4,721,"WHAT A PRINCE",2.5,3.2,5.3,37,17,8,17.399999999999999,6,{"$nulls":4},17,15,10,4,4,5,null,32,7.5171874999999995,null,250.8,9.8919258373205743]
[5,5,873,"KING CRUZER",3.2,1.6,1.7,37.5,14,9.5,17.3,5,{"$nulls":4},16,20,8,12,11,3,null,36,6.6819444444444436,null,249.2,9.9554373996789742]
[5,6,388,"DESERT VIXEN",4.0999999999999996,4.3,3.7,36,7,4,17.8,2,{"$nulls":4},15,20,2,1,8,8,null,35,6.8728571428571428,null,260.7,9.5162830840046038]
[5,7,265,"JAG THE JOKER",2.2999999999999998,2.5,3.5,35,10,13,17.5,3,{"$nulls":4},14,20,11,10,9,11,null,34,7.0750000000000002,null,236.5,10.490042283298099]
[5,8,641,"KATONA",1.9,3.2,3.4,36,10,19,17.899999999999999,11,{"$nulls":4},14,20,12,4,10,8,null,34,7.0750000000000002,null,242.9,10.213647591601482]
[5,9,"x92","CANNY CONI",3.6,3,4.7,37.5,17,31,17.5,8,{"$nulls":4},0,15,4,7,6,3,null,15,16.036666666666665,null,240.2,10.328455453788511]
[5,10,341,"LITTLE SILVER",4.0999999999999996,4.2,4.8,36.5,10,6,17.3,1,{"$nulls":4},0,20,2,2,5,7,null,20,12.0275,null,248.8,9.9714429260450164]
[5,11,"x38","SWEET TEA",3.6,2.9,4.2,33.5,14,41,17.899999999999999,10,{"$nulls":4},0,20,4,9,7,12,null,20,12.0275,null,224.2,11.065544157002677]
[5,12,"53x","FAR TOO STRONG",2.8,2.4,1,37,136,31,17.3,12,{"$nulls":4},0,0,9,11,12,5,null,0,{"$error":"#DIV/0!"},null,212,11.702334905660379]
[{"$nulls":23},{"$f":"SUM(X63:X74)","v":283},null,null,{"$f":"SUM(AA63:AA74)","v":2918.7000000000003}]
[null,"tab"]
["race","Tab","Form L3","Horse","TRat","JRat","API","LSRat","DLR","PR","AFS","BP",{"$nulls":4},"tab t","DLR T","TR","JK","api","LSRat",null,"rating","Price",null,"RATING","PRICE"]
[6,1,82,"EXCELLENT DREAM",3.4,3.9,5.5,45,14,12,17.399999999999999,2,{"$nulls":4},20,20,12,10,10,9,null,{"$f":"IF(B78=\"\",\"\",+R78+Q78)","v":40},{"$f":"IF(B78=\"\",\"\",$X$795/X78*85%)","v":0},null,{"$f":"IF(A77=\"\",\"\",+E78*5+F78*5+G78+H78*5+R78+Q78)","v":307},{"$f":"IF(B77=\"\",\"\",$AA$75/AA78*85%)","v":8.0810912052117256}]
[6,2,856,"BLACK SHADOW",2.2000000000000002,2.8,4.7,39,41,8.5,16.8,3,{"$nulls":4},19,15,11,4,9,7,null,34,6.9499999999999993,null,258.7,10.201480836236932]
[6,3,121,"CLASSIC ROGUE",4.3,2,11.2,43.5,28,8.5,17.7,7,{"$nulls":4},18,0,2,2,11,4,null,18,13.127777777777778,null,278.2,9.9450577445652169]
[6,4,"x93","GINGER BAKER",1.3,3.5,7.4,43.5,14,17,17.399999999999999,6,{"$nulls":4},17,20,6,7,1,11,null,37,6.3864864864864863,null,285.89999999999998,10.331069160197602]
[6,5,514,"KNOT SECRET",4.3,4.2,14,45,14,3.9,17.7,8,{"$nulls":4},16,0,7,1,12,12,null,16,14.768749999999999,null,297.5,13.823536355051935]
[6,6,411,"SESSIONS PEAK",4.3,3.2,9.6999999999999993,45,14,6.5,17.5,9,{"$nulls":4},15,15,7,6,6,8,null,30,7.8766666666666669,null,302.2,10.03367032213845]
[6,7,344,"KAYMAY",2.9,1.7,7.5,46,21,15,17.600000000000001,4,{"$nulls":4},14,15,3,11,4,10,null,29,8.1482758620689655,null,289.5,10.596543612015923]
[6,8,"0x5","BARAMAGIC",2.2000000000000002,1.8,2.6,45,21,31,17.7,1,{"$nulls":4},14,0,10,5,7,1,null,14,16.87857142857143,null,261.60000000000002,9.1810128566948883]
[6,9,221,"MACK MACK",3.6,4.5,8.6,43.5,10,4.8,17.8,5,{"$nulls":4},0,15,3,8,3,4,null,15,15.753333333333334,null,281.60000000000002,9.9315637720488468]
[6,10,525,"PICCOLA SIGNORA",3.3,2,3.6,43,14,21,17.7,10,{"$nulls":4},0,15,1,3,2,3,null,15,15.753333333333334,null,260.10000000000002,9.1695114312558719]
[6,{"$nulls":15},0,15,9,12,8,6,null,"",15.753333333333334,null,15,10.863914656771801]
[6,{"$nulls":15},0,15,3,9,5,2,null,"",15.753333333333334,null,15,9.1867743959836847]
[{"$nulls":23},{"$f":"SUM(X78:X89)","v":248},null,null,{"$f":"SUM(AA78:AA89)","v":2852.3}]
[{"$nulls":26},3444.5]
["race","Tab","Form L3","Horse","TRat","JRat","API","LSRat","DLR","PR","AFS","BP",{"$nulls":4},"tab t","DLR T","TR","JK","api","LSRat",null,"rating","Price",null,"RATING","PRICE"]
[7,1,"80x","BUMPER BLAST",1.9,2.2000000000000002,1.8,40,238,81,17,7,{"$nulls":4},{"$f":"IF(B93=1,20,0+IF(B93=2,19,0+IF(B93=3,18,0+IF(B93=4,17,0+IF(B93=5,16,0+IF(B93=6,15,0+IF(B93=7,14,0+IF(B93=8,14,0))))))))","v":20},{"$f":"IF(AND(I93>=1,I93<=15),20,IF(AND(I93>=16,I93<=28),15,0))","v":0},{"$f":"IFERROR(IF(RANK(E93,$E$93:$E$104)<13,RANK(E93,$E$93:$E$104),\"\"),\"\")","v":11},{"$f":"IFERROR(IF(RANK(F93,$F$93:$F$104)<13,RANK(F93,$F$93:$F$104),\"\"),\"\")","v":10},{"$f":"IFERROR(IF(RANK(G93,$G$93:$G104)<13,RANK(G93,$G$93:$G104),\"\"),\"\")","v":12},{"$f":"IFERROR(IF(RANK(H93,$H$93:$H$104)<13,RANK(H93,$H$93:$H$104),\"\"),\"\")","v":8},null,{"$f":"IF(B93=\"\",\"\",+R93+Q93)","v":20},{"$f":"IF(B92=\"\",\"\",$X$15/X93*85%)","v":{"$error":"#VALUE!"}},null,{"$f":"IF(A92=\"\",\"\",+E93*5+F93*5+G93+H93*5+R93+Q93)","v":242.3},{"$f":"IF(B92=\"\",\"\",$AA$15/AA93*85%)","v":4.9312628972348316}]
[7,2,552,"MAN CRUSH",3.3,3.2,16.8,42,14,7.5,17.3,13,{"$nulls":4},19,20,8,4,{"$f":"IFERROR(IF(RANK(G94,$G$93:$G104)<13,RANK(G94,$G$93:$G104),\"\"),\"\")","v":1},4,null,39,{"$error":"#VALUE!"},null,298.3,4.0055145826349303]
[7,3,"6x9","ALL DAY SESSION",2.2999999999999998,2.1,3.2,36,14,11,17.8,4,{"$nulls":4},18,20,9,11,{"$f":"IFERROR(IF(RANK(G95,$G$93:$G104)<13,RANK(G95,$G$93:$G104),\"\"),\"\")","v":11},10,null,38,{"$error":"#VALUE!"},null,243.2,4.9130139802631572]
[7,4,"3x1","CATALPA",4.2,3,16.100000000000001,42.5,14,5.5,18,10,{"$nulls":4},17,20,3,7,{"$f":"IFERROR(IF(RANK(G96,$G$93:$G104)<13,RANK(G96,$G$93:$G104),\"\"),\"\")","v":2},2,null,37,{"$error":"#VALUE!"},null,301.60000000000002,3.9616876657824927]
[7,5,"00x","POSITION OF POWER",3.5,1.8,8.1999999999999993,32,182,31,17.100000000000001,5,{"$nulls":4},16,0,7,12,{"$f":"IFERROR(IF(RANK(G97,$G$93:$G104)<13,RANK(G97,$G$93:$G104),\"\"),\"\")","v":6},12,null,16,{"$error":"#VALUE!"},null,210.7,5.670835310868533]
[7,6,"25x","TRADE WAR",3.6,3,13.1,41.5,133,20,17.899999999999999,1,{"$nulls":4},15,0,6,7,{"$f":"IFERROR(IF(RANK(G98,$G$93:$G104)<13,RANK(G98,$G$93:$G104),\"\"),\"\")","v":3},5,null,15,{"$error":"#VALUE!"},null,268.60000000000002,4.448417721518986]
[7,7,713,"DOUBLE SPICE",1.8,2.6,5.6,42.5,21,26,17.8,11,{"$nulls":4},14,15,12,9,{"$f":"IFERROR(IF(RANK(G99,$G$93:$G110)<13,RANK(G99,$G$93:$G110),\"\"),\"\")","v":11},2,null,29,{"$error":"#VALUE!"},null,269.10000000000002,4.440152359717576]
[7,8,"4x5","NURHACI",2.1,3.2,4.4000000000000004,40.5,14,14,17.899999999999999,2,{"$nulls":4},14,20,10,4,{"$f":"IFERROR(IF(RANK(G100,$G$93:$G104)<13,RANK(G100,$G$93:$G104),\"\"),\"\")","v":9},7,null,34,{"$error":"#VALUE!"},null,267.39999999999998,4.4683807030665665]
[7,9,"77x","VIA MONTE",4.9000000000000004,3.2,8.5,34.5,112,17,18,12,{"$nulls":4},0,0,1,4,{"$f":"IFERROR(IF(RANK(G101,$G$93:$G104)<13,RANK(G101,$G$93:$G104),\"\"),\"\")","v":5},11,null,0,{"$error":"#VALUE!"},null,221.5,5.3943340857787803]
[7,10,513,"EX SPORT MAN",4.0999999999999996,4.2,6.1,44,21,3.4,17.899999999999999,8,{"$nulls":4},0,15,4,1,{"$f":"IFERROR(IF(RANK(G102,$G$93:$G104)<13,RANK(G102,$G$93:$G104),\"\"),\"\")","v":7},1,null,15,{"$error":"#VALUE!"},null,282.60000000000002,4.2280431705590926]
[7,11,"58x","HINT OF MINT",3.8,4,4.2,41.5,126,61,17.8,9,{"$nulls":4},0,0,5,3,{"$f":"IFERROR(IF(RANK(G103,$G$93:$G104)<13,RANK(G103,$G$93:$G104),\"\"),\"\")","v":10},5,null,0,{"$error":"#VALUE!"},null,250.7,4.7660351017151967]
[7,12,"70x","PROBITY",4.8,4.2,9.3000000000000007,39.5,161,6.5,17.7,3,{"$nulls":4},0,0,2,1,{"$f":"IFERROR(IF(RANK(G104,$G$93:$G104)<13,RANK(G104,$G$93:$G104),\"\"),\"\")","v":4},9,null,0,{"$error":"#VALUE!"},null,251.8,4.7452144559173943]
[{"$nulls":16},0,0,{"$f":"IFERROR(IF(RANK(E105,$E$3:$E$14)<13,RANK(E105,$E$3:$E$14),\"\"),\"\")","v":""},{"$nulls":4},{"$f":"SUM(X93:X104)","v":243},null,null,{"$f":"SUM(AA93:AA104)","v":3107.8}]
[null,"tab"]
["race","Tab","Form L3","Horse","TRat","JRat","API","LSRat","DLR","PR","AFS","BP",{"$nulls":4},"tab t","DLR T","TR","JK","api","LSRat",null,"rating","Price",null,"RATING","PRICE"]
[8,1,263,"RED CAN MAN",4.0999999999999996,4.2,29.7,52,13,3.9,17.399999999999999,12,{"$nulls":4},{"$f":"IF(B108=1,20,0+IF(B108=2,19,0+IF(B108=3,18,0+IF(B108=4,17,0+IF(B108=5,16,0+IF(B108=6,15,0+IF(B108=7,14,0+IF(B108=8,14,0))))))))","v":20},{"$f":"IF(AND(I108>=1,I108<=15),20,IF(AND(I108>=16,I108<=28),15,0))","v":20},{"$f":"IFERROR(IF(RANK(E108,$E$108:$E$119)<13,RANK(E108,$E$108:$E$119),\"\"),\"\")","v":5},{"$f":"IFERROR(IF(RANK(F108,$F$108:$F$119)<13,RANK(F108,$F$108:$F$119),\"\"),\"\")","v":2},{"$f":"IFERROR(IF(RANK(G108,$G$108:$G119)<13,RANK(G108,$G$108:$G119),\"\"),\"\")","v":4},null,null,{"$f":"IF(B108=\"\",\"\",+R108+Q108)","v":40},{"$f":"IF(B107=\"\",\"\",$X$15/X108*85%)","v":{"$error":"#VALUE!"}},null,{"$f":"IF(A107=\"\",\"\",+E108*5+F108*5+G108+H108*5+R108+Q108)","v":371.2},{"$f":"IF(B107=\"\",\"\",$AA$15/AA108*85%)","v":3.2188712284482754}]
[8,2,522,"COMFORT ME",2.5,4.2,63,50.5,13,8,17.600000000000001,7,{"$nulls":4},19,20,11,2,{"$f":"IFERROR(IF(RANK(G109,$G$108:$G120)<13,RANK(G109,$G$108:$G120),\"\"),\"\")","v":1},{"$f":"IF(RANK(H109,$H$3:$H$14)<13,RANK(H109,$H$3:$H$14),\"\")","v":{"$error":"#N/A"}},null,39,{"$error":"#VALUE!"},null,388,3.0794974226804119]
[8,3,"x31","DOM TO SHOOT",4.3,4.2,28.5,52.5,13,6,17.899999999999999,6,{"$nulls":4},18,20,3,2,{"$f":"IFERROR(IF(RANK(G110,$G$108:$G121)<13,RANK(G110,$G$108:$G121),\"\"),\"\")","v":5},{"$error":"#N/A"},null,38,{"$error":"#VALUE!"},null,371.5,3.2162718707940776]
[8,4,"x47","RESORTMAN",3.6,2.5,42.1,52,28,4.8,18,1,{"$nulls":4},17,15,8,10,{"$f":"IFERROR(IF(RANK(G111,$G$108:$G122)<13,RANK(G111,$G$108:$G122),\"\"),\"\")","v":3},{"$error":"#N/A"},null,32,{"$error":"#VALUE!"},null,364.6,3.2771393307734495]
[8,6,"x05","STARTRADE",4.9000000000000004,4,25.4,47.5,28,12,18.100000000000001,10,{"$nulls":4},15,15,1,5,{"$f":"IFERROR(IF(RANK(G112,$G$108:$G123)<13,RANK(G112,$G$108:$G123),\"\"),\"\")","v":8},{"$error":"#N/A"},null,30,{"$error":"#VALUE!"},null,337.4,3.541330764671013]
[8,7,"90x","KAPTAIN KAOS",4.2,2.4,18.5,44,161,41,17.899999999999999,3,{"$nulls":4},14,0,4,11,{"$f":"IFERROR(IF(RANK(G113,$G$108:$G124)<13,RANK(G113,$G$108:$G124),\"\"),\"\")","v":9},{"$error":"#N/A"},null,14,{"$error":"#VALUE!"},null,285.5,4.185096322241681]
[8,8,"81x","MINSK MOMENT",2.9,3.2,28,52,126,16,17.8,11,{"$nulls":4},14,0,10,7,{"$f":"IFERROR(IF(RANK(G114,$G$108:$G125)<13,RANK(G114,$G$108:$G125),\"\"),\"\")","v":7},{"$error":"#N/A"},null,14,{"$error":"#VALUE!"},null,332.5,3.5935187969924809]
[8,9,"00x","NOTORIOUS ONE",4.0999999999999996,3.8,2.5,40,147,51,17.7,2,{"$nulls":4},0,0,5,6,{"$f":"IFERROR(IF(RANK(G115,$G$108:$G126)<13,RANK(G115,$G$108:$G126),\"\"),\"\")","v":""},{"$error":"#N/A"},null,0,{"$error":"#VALUE!"},null,242,4.9373760330578502]
[8,10,"9x5","STARALIGN",2.1,4.3,5.8,46.5,13,31,17.7,13,{"$nulls":4},0,20,12,1,{"$f":"IFERROR(IF(RANK(G116,$G$108:$G127)<13,RANK(G116,$G$108:$G127),\"\"),\"\")","v":""},{"$error":"#N/A"},null,20,{"$error":"#VALUE!"},null,290.3,4.1158973475714768]
[8,11,"x79","LET'S GALAHVANT",4.8,1.9,16.399999999999999,45.5,13,19,17.600000000000001,5,{"$nulls":4},0,20,2,12,{"$f":"IFERROR(IF(RANK(G117,$G$108:$G128)<13,RANK(G117,$G$108:$G128),\"\"),\"\")","v":11},{"$error":"#N/A"},null,20,{"$error":"#VALUE!"},null,297.39999999999998,4.0176361802286484]
[8,12,601,"BUSTLER",3.8,2.9,44,51.5,14,14,17.899999999999999,8,{"$nulls":4},0,20,7,9,{"$f":"IFERROR(IF(RANK(G118,$G$108:$G129)<13,RANK(G118,$G$108:$G129),\"\"),\"\")","v":2},{"$error":"#N/A"},null,20,{"$error":"#VALUE!"},null,355,3.365760563380281]
[8,13,"11x","THE VELVET QUEEN",3.3,3.2,28.4,50,97,31,18.100000000000001,4,{"$nulls":4},0,0,9,7,{"$f":"IFERROR(IF(RANK(G119,$G$108:$G130)<13,RANK(G119,$G$108:$G130),\"\"),\"\")","v":6},{"$error":"#N/A"},null,0,{"$error":"#VALUE!"},null,310.89999999999998,3.843181087166291]
[{"$nulls":23},{"$f":"SUM(X108:X119)","v":267},null,null,{"$f":"SUM(AA108:AA119)","v":3946.3000000000006}]
[null,"tab"]
["race","Tab","Form L3","Horse","TRat","JRat","API","LSRat","DLR","PR","AFS","BP",{"$nulls":4},"tab t","DLR T","TR","JK","api","LSRat",null,"rating","Price",null,"RATING","PRICE"]
[9,1,"7x1","IT'SARAYDAY",4.0999999999999996,3.2,13.2,47.5,14,4.4000000000000004,17.7,10,{"$nulls":4},{"$f":"IF(B123=1,20,0+IF(B123=2,19,0+IF(B123=3,18,0+IF(B123=4,17,0+IF(B123=5,16,0+IF(B123=6,15,0+IF(B123=7,14,0+IF(B123=8,14,0))))))))","v":20},{"$f":"IF(AND(I123>=1,I123<=15),20,IF(AND(I123>=16,I123<=28),15,0))","v":20},{"$f":"IFERROR(IF(RANK(E123,$E$123:$E$134)<13,RANK(E123,$E$123:$E$134),\"\"),\"\")","v":3},{"$f":"IFERROR(IF(RANK(F123,$F$123:$F$134)<13,RANK(F123,$F$123:$F$134),\"\"),\"\")","v":6},{"$f":"IFERROR(IF(RANK(G123,$G$123:$G134)<13,RANK(G123,$G$123:$G134),\"\"),\"\")","v":5},{"$f":"IF(RANK(H123,$H$3:$H$14)<13,RANK(H123,$H$3:$H$14),\"\")","v":{"$error":"#N/A"}},null,{"$f":"IF(B123=\"\",\"\",+R123+Q123)","v":40},{"$f":"IF(B122=\"\",\"\",$X$15/X123*85%)","v":{"$error":"#VALUE!"}},null,{"$f":"IF(A122=\"\",\"\",+E123*5+F123*5+G123+H123*5+R123+Q123)","v":327.2},{"$f":"IF(B122=\"\",\"\",$AA$15/AA123*85%)","v":3.6517267726161364}]
[9,2,265,"CREATOR",4.0999999999999996,2.2000000000000002,10,44.5,49,31,17.5,2,{"$nulls":4},19,0,3,11,{"$f":"IFERROR(IF(RANK(G124,$G$123:$G134)<13,RANK(G124,$G$123:$G134),\"\"),\"\")","v":8},{"$error":"#N/A"},null,19,{"$error":"#VALUE!"},null,283,4.2220671378091863]
[9,3,5,"MOOD SWINGS",1.8,3.2,9,45.5,14,17,17.2,4,{"$nulls":4},18,20,12,6,{"$f":"IFERROR(IF(RANK(G125,$G$123:$G134)<13,RANK(G125,$G$123:$G134),\"\"),\"\")","v":9},{"$error":"#N/A"},null,38,{"$error":"#VALUE!"},null,299.5,3.9894657762938222]
[9,4,"0x4","PANZDOWN",4.0999999999999996,4.3,4.0999999999999996,45.5,14,7.5,18,9,{"$nulls":4},17,20,3,1,{"$f":"IFERROR(IF(RANK(G126,$G$123:$G137)<13,RANK(G126,$G$123:$G137),\"\"),\"\")","v":11},{"$error":"#N/A"},null,37,{"$error":"#VALUE!"},null,310.60000000000002,3.8468931101094643]
[9,5,113,"SNOWDOME",3.8,4,22.7,47.5,14,9,17.5,1,{"$nulls":4},16,20,8,5,{"$f":"IFERROR(IF(RANK(G127,$G$123:$G138)<13,RANK(G127,$G$123:$G138),\"\"),\"\")","v":1},{"$error":"#N/A"},null,36,{"$error":"#VALUE!"},null,335.2,3.5645733890214792]
[9,6,161,"STELLAR VISTA",4.0999999999999996,2.9,14.8,45,21,26,17.5,11,{"$nulls":4},15,15,3,10,{"$f":"IFERROR(IF(RANK(G128,$G$123:$G139)<13,RANK(G128,$G$123:$G139),\"\"),\"\")","v":4},{"$error":"#N/A"},null,30,{"$error":"#VALUE!"},null,304.8,3.9200951443569547]
[9,7,944,"THE SPRUIKER",4.0999999999999996,4.2,4,42,18,5,17.600000000000001,5,{"$nulls":4},14,15,3,2,{"$f":"IFERROR(IF(RANK(G129,$G$123:$G140)<13,RANK(G129,$G$123:$G140),\"\"),\"\")","v":12},{"$error":"#N/A"},null,29,{"$error":"#VALUE!"},null,284.5,4.1998066783831272]
[9,8,"30x","ROKANORI",4.2,4.2,15.3,43.5,189,14,18,6,{"$nulls":4},14,0,2,2,{"$f":"IFERROR(IF(RANK(G130,$G$123:$G141)<13,RANK(G130,$G$123:$G141),\"\"),\"\")","v":3},{"$error":"#N/A"},null,14,{"$error":"#VALUE!"},null,288.8,4.137274930747922]
[9,9,"4x7","CAN'T BE DONE",2.1,3.2,15.7,44.5,14,11,17.600000000000001,3,{"$nulls":4},0,20,10,6,{"$f":"IFERROR(IF(RANK(G131,$G$123:$G142)<13,RANK(G131,$G$123:$G142),\"\"),\"\")","v":2},{"$error":"#N/A"},null,20,{"$error":"#VALUE!"},null,284.7,4.1968563400070247]
[9,10,"x53","FEATHERWEIGHT",4.9000000000000004,3,10.8,50,7,6.5,18,12,{"$nulls":4},0,20,1,9,{"$f":"IFERROR(IF(RANK(G132,$G$123:$G134)<13,RANK(G132,$G$123:$G134),\"\"),\"\")","v":7},{"$error":"#N/A"},null,20,{"$error":"#VALUE!"},null,320.3,3.7303933812051193]
[9,11,"28x","SPEED DREAM",2.1,4.2,12.7,46,154,71,null,8,{"$nulls":4},0,0,10,2,{"$f":"IFERROR(IF(RANK(G133,$G$123:$G134)<13,RANK(G133,$G$123:$G134),\"\"),\"\")","v":6},{"$error":"#N/A"},null,0,{"$error":"#VALUE!"},null,274.2,4.3575674690007293]
[9,12,"49x","TURBO POWER",2.2999999999999998,1.8,6.3,45,175,51,17.899999999999999,7,{"$nulls":4},0,0,9,12,{"$f":"IFERROR(IF(RANK(G134,$G$123:$G134)<13,RANK(G134,$G$123:$G134),\"\"),\"\")","v":10},{"$error":"#N/A"},null,0,{"$error":"#VALUE!"},null,251.8,4.7452144559173943]
[{"$nulls":23},{"$f":"SUM(X123:X134)","v":283},null,null,{"$f":"SUM(AA123:AA134)","v":3564.6000000000004}]
[null,"tab"]